Diagnosed failure

Parameters/TestRpc.TestCallWithChainCertAndRootCA/SSL_TCP: /data0/somelongdirectorytoavoidrpathissues/src/kudu/src/kudu/rpc/rpc-test.cc:303: Failure
Failed
Bad status: Runtime error: could not verify certificate chain (error with cert: subject=CN = localhost, ST = sadfjas, C = AS, emailAddress = sdflkdsajf, O = lskdfjlsad, OU = sldfkja, issuer=C = AS, ST = ASDfkjdhf, L = lskdjf, O = saldfja, OU = skdjf, CN = localhost, emailAddress = sadjflkadsj): : certificate has expired
Google Test trace:
/data0/somelongdirectorytoavoidrpathissues/src/kudu/src/kudu/rpc/rpc-test.cc:300: Connecting to 0.0.0.0:37881
I20260925 16:43:22.995105  2865 test_util.cc:175] -----------------------------------------------
I20260925 16:43:22.995307  2865 test_util.cc:176] Had fatal failures, leaving test files at /tmp/dist-test-taskJvgzsQ/test-tmp/rpc-test.1.Parameters_TestRpc.TestCallWithChainCertAndRootCA_SSL_TCP.1790354601628773-2865-0

Full log

Note: This is test shard 2 of 8.
[==========] Running 21 tests from 2 test suites.
[----------] Global test environment set-up.
[----------] 1 test from TestRpc
[ RUN      ] TestRpc.TestMethodsByName
[       OK ] TestRpc.TestMethodsByName (6 ms)
[----------] 1 test from TestRpc (6 ms total)

[----------] 20 tests from Parameters/TestRpc
[ RUN      ] Parameters/TestRpc.TestAcceptorPoolStartStop/SSL_TCP
WARNING: Logging before InitGoogleLogging() is written to STDERR
I20260925 16:43:21.726047  2880 acceptor_pool.cc:254] collecting diagnostics on the listening RPC socket 0.0.0.0:33925 every 8 connection(s)
I20260925 16:43:21.727514  2881 acceptor_pool.cc:254] collecting diagnostics on the listening RPC socket 0.0.0.0:33925 every 8 connection(s)
I20260925 16:43:22.787446  2892 acceptor_pool.cc:254] collecting diagnostics on the listening RPC socket 0.0.0.0:37233 every 8 connection(s)
I20260925 16:43:22.788738  2893 acceptor_pool.cc:254] collecting diagnostics on the listening RPC socket 0.0.0.0:37233 every 8 connection(s)
I20260925 16:43:22.818974  2903 acceptor_pool.cc:254] collecting diagnostics on the listening RPC socket 0.0.0.0:36813 every 8 connection(s)
I20260925 16:43:22.820245  2904 acceptor_pool.cc:254] collecting diagnostics on the listening RPC socket 0.0.0.0:36813 every 8 connection(s)
I20260925 16:43:22.844107  2914 acceptor_pool.cc:254] collecting diagnostics on the listening RPC socket 0.0.0.0:42243 every 8 connection(s)
I20260925 16:43:22.844782  2915 acceptor_pool.cc:254] collecting diagnostics on the listening RPC socket 0.0.0.0:42243 every 8 connection(s)
I20260925 16:43:22.860077  2925 acceptor_pool.cc:254] collecting diagnostics on the listening RPC socket 0.0.0.0:40481 every 8 connection(s)
I20260925 16:43:22.860745  2926 acceptor_pool.cc:254] collecting diagnostics on the listening RPC socket 0.0.0.0:40481 every 8 connection(s)
[       OK ] Parameters/TestRpc.TestAcceptorPoolStartStop/SSL_TCP (1177 ms)
[ RUN      ] Parameters/TestRpc.TestCall/SSL_TCP
I20260925 16:43:22.882476  2938 acceptor_pool.cc:254] collecting diagnostics on the listening RPC socket 0.0.0.0:39941 every 8 connection(s)
I20260925 16:43:22.884424  2939 acceptor_pool.cc:254] collecting diagnostics on the listening RPC socket 0.0.0.0:39941 every 8 connection(s)
I20260925 16:43:22.889050  2865 rpc-test.cc:234] Connecting to 0.0.0.0:39941
[       OK ] Parameters/TestRpc.TestCall/SSL_TCP (94 ms)
[ RUN      ] Parameters/TestRpc.TestCallWithChainCertAndRootCA/SSL_TCP
I20260925 16:43:22.975375  2963 acceptor_pool.cc:254] collecting diagnostics on the listening RPC socket 0.0.0.0:37881 every 8 connection(s)
I20260925 16:43:22.976063  2964 acceptor_pool.cc:254] collecting diagnostics on the listening RPC socket 0.0.0.0:37881 every 8 connection(s)
/data0/somelongdirectorytoavoidrpathissues/src/kudu/src/kudu/rpc/rpc-test.cc:303: Failure
Failed
Bad status: Runtime error: could not verify certificate chain (error with cert: subject=CN = localhost, ST = sadfjas, C = AS, emailAddress = sdflkdsajf, O = lskdfjlsad, OU = sldfkja, issuer=C = AS, ST = ASDfkjdhf, L = lskdjf, O = saldfja, OU = skdjf, CN = localhost, emailAddress = sadjflkadsj): : certificate has expired
Google Test trace:
/data0/somelongdirectorytoavoidrpathissues/src/kudu/src/kudu/rpc/rpc-test.cc:300: Connecting to 0.0.0.0:37881
I20260925 16:43:22.995105  2865 test_util.cc:175] -----------------------------------------------
I20260925 16:43:22.995307  2865 test_util.cc:176] Had fatal failures, leaving test files at /tmp/dist-test-taskJvgzsQ/test-tmp/rpc-test.1.Parameters_TestRpc.TestCallWithChainCertAndRootCA_SSL_TCP.1790354601628773-2865-0
[  FAILED  ] Parameters/TestRpc.TestCallWithChainCertAndRootCA/SSL_TCP, where GetParam() = (true, false) (36 ms)
[ RUN      ] Parameters/TestRpc.TestCallWithBadPasswordProtectedKey/SSL_TCP
[       OK ] Parameters/TestRpc.TestCallWithBadPasswordProtectedKey/SSL_TCP (30 ms)
[ RUN      ] Parameters/TestRpc.TestInvalidMethodCall/SSL_TCP
I20260925 16:43:23.045909  3000 acceptor_pool.cc:254] collecting diagnostics on the listening RPC socket 0.0.0.0:35883 every 8 connection(s)
I20260925 16:43:23.046708  3001 acceptor_pool.cc:254] collecting diagnostics on the listening RPC socket 0.0.0.0:35883 every 8 connection(s)
I20260925 16:43:23.050310  2865 rpc-test.cc:406] Connecting to 0.0.0.0:35883
[       OK ] Parameters/TestRpc.TestInvalidMethodCall/SSL_TCP (57 ms)
[ RUN      ] Parameters/TestRpc.TestHighFDs/SSL_TCP
I20260925 16:43:23.289834  3025 acceptor_pool.cc:254] collecting diagnostics on the listening RPC socket 0.0.0.0:37923 every 8 connection(s)
I20260925 16:43:23.290560  3026 acceptor_pool.cc:254] collecting diagnostics on the listening RPC socket 0.0.0.0:37923 every 8 connection(s)
[       OK ] Parameters/TestRpc.TestHighFDs/SSL_TCP (269 ms)
[ RUN      ] Parameters/TestRpc.TestConnectionAlwaysKeepalive/SSL_TCP
I20260925 16:43:23.389441  3048 acceptor_pool.cc:254] collecting diagnostics on the listening RPC socket 0.0.0.0:39461 every 8 connection(s)
I20260925 16:43:23.390082  3049 acceptor_pool.cc:254] collecting diagnostics on the listening RPC socket 0.0.0.0:39461 every 8 connection(s)
I20260925 16:43:23.392987  2865 rpc-test.cc:532] Connecting to 0.0.0.0:39461
[       OK ] Parameters/TestRpc.TestConnectionAlwaysKeepalive/SSL_TCP (3081 ms)
[ RUN      ] Parameters/TestRpc.TestReopenOutboundConnections/SSL_TCP
I20260925 16:43:26.457159  3071 acceptor_pool.cc:254] collecting diagnostics on the listening RPC socket 0.0.0.0:39281 every 8 connection(s)
I20260925 16:43:26.457870  3072 acceptor_pool.cc:254] collecting diagnostics on the listening RPC socket 0.0.0.0:39281 every 8 connection(s)
I20260925 16:43:26.460959  2865 rpc-test.cc:658] Connecting to 0.0.0.0:39281
[       OK ] Parameters/TestRpc.TestReopenOutboundConnections/SSL_TCP (380 ms)
[ RUN      ] Parameters/TestRpc.TestConnectionNetworkPlane/SSL_TCP
I20260925 16:43:26.849090  3094 acceptor_pool.cc:254] collecting diagnostics on the listening RPC socket 0.0.0.0:41559 every 8 connection(s)
I20260925 16:43:26.849900  3095 acceptor_pool.cc:254] collecting diagnostics on the listening RPC socket 0.0.0.0:41559 every 8 connection(s)
I20260925 16:43:26.853142  2865 rpc-test.cc:772] Connecting to 0.0.0.0:41559
[       OK ] Parameters/TestRpc.TestConnectionNetworkPlane/SSL_TCP (82 ms)
[ RUN      ] Parameters/TestRpc.TestTCPKeepalive/SSL_TCP
I20260925 16:43:26.913622  3119 acceptor_pool.cc:254] collecting diagnostics on the listening RPC socket 0.0.0.0:44435 every 8 connection(s)
I20260925 16:43:26.914253  3120 acceptor_pool.cc:254] collecting diagnostics on the listening RPC socket 0.0.0.0:44435 every 8 connection(s)
I20260925 16:43:26.946872  3123 rpc-test-base.h:222] got call: sleep_micros: 8000000 deferred: true
I20260925 16:43:34.950963  3123 rpcz_store.cc:275] Call kudu.rpc.GenericCalculatorService.Sleep from 127.0.0.1:60864 (request call id 0) took 8004 ms. Trace:
I20260925 16:43:34.951352  3123 rpcz_store.cc:276] 0925 16:43:26.946578 (+     0us) service_pool.cc:170] Inserting onto call queue
0925 16:43:26.946692 (+   114us) service_pool.cc:227] Handling call
0925 16:43:34.950804 (+8004112us) inbound_call.cc:173] Queueing success response
Metrics: {}
[       OK ] Parameters/TestRpc.TestTCPKeepalive/SSL_TCP (8065 ms)
[ RUN      ] Parameters/TestRpc.TestMaxSmallSidecars/SSL_TCP
I20260925 16:43:34.985857  3145 acceptor_pool.cc:254] collecting diagnostics on the listening RPC socket 0.0.0.0:44735 every 8 connection(s)
I20260925 16:43:34.986565  3146 acceptor_pool.cc:254] collecting diagnostics on the listening RPC socket 0.0.0.0:44735 every 8 connection(s)
[       OK ] Parameters/TestRpc.TestMaxSmallSidecars/SSL_TCP (194 ms)
[ RUN      ] Parameters/TestRpc.TestCallTimeout/SSL_TCP
I20260925 16:43:35.183938  3170 acceptor_pool.cc:254] collecting diagnostics on the listening RPC socket 0.0.0.0:43543 every 8 connection(s)
I20260925 16:43:35.184600  3171 acceptor_pool.cc:254] collecting diagnostics on the listening RPC socket 0.0.0.0:43543 every 8 connection(s)
I20260925 16:43:35.209786  2865 rpc-test-base.h:595] status: Timed out: connection negotiation to 0.0.0.0:43543 for RPC Sleep timed out after 0.000s (ON_OUTBOUND_QUEUE), seconds elapsed: 0.00237729
I20260925 16:43:35.217200  3174 rpc-test-base.h:222] got call: sleep_micros: 700000
I20260925 16:43:35.411023  2865 rpc-test-base.h:595] status: Timed out: Sleep RPC to 0.0.0.0:43543 timed out after 0.200s (SENT), seconds elapsed: 0.20082
I20260925 16:43:35.412463  3173 rpc-test-base.h:222] got call: sleep_micros: 2000000
W20260925 16:43:35.918048  3174 rpcz_store.cc:267] Call kudu.rpc.GenericCalculatorService.Sleep from 127.0.0.1:38508 (request call id 1) took 701 ms (client timeout 200 ms). Trace:
W20260925 16:43:35.918423  3174 rpcz_store.cc:269] 0925 16:43:35.217037 (+     0us) service_pool.cc:170] Inserting onto call queue
0925 16:43:35.217142 (+   105us) service_pool.cc:227] Handling call
0925 16:43:35.917978 (+700836us) inbound_call.cc:173] Queueing success response
Metrics: {}
I20260925 16:43:36.913714  2865 rpc-test-base.h:595] status: Timed out: Sleep RPC to 0.0.0.0:43543 timed out after 1.500s (SENT), seconds elapsed: 1.50236
W20260925 16:43:37.412949  3173 rpcz_store.cc:267] Call kudu.rpc.GenericCalculatorService.Sleep from 127.0.0.1:38508 (request call id 2) took 2000 ms (client timeout 1500 ms). Trace:
W20260925 16:43:37.413249  3173 rpcz_store.cc:269] 0925 16:43:35.412190 (+     0us) service_pool.cc:170] Inserting onto call queue
0925 16:43:35.412318 (+   128us) service_pool.cc:227] Handling call
0925 16:43:37.412899 (+2000581us) inbound_call.cc:173] Queueing success response
Metrics: {}
W20260925 16:43:37.413852  3169 connection.cc:441] server connection from 127.0.0.1:38508 torn down before Call kudu.rpc.GenericCalculatorService.Sleep from 127.0.0.1:38508 (request call id 2) could send its response
[       OK ] Parameters/TestRpc.TestCallTimeout/SSL_TCP (2259 ms)
[ RUN      ] Parameters/TestRpc.TestServerShutsDown/SSL_TCP
I20260925 16:43:37.420431  2865 rpc-test.cc:1125] Connecting to 0.0.0.0:43629
W20260925 16:43:37.428818  3187 negotiation.cc:337] Failed RPC negotiation. Trace:
0925 16:43:37.427341 (+     0us) reactor.cc:625] Submitting negotiation task for client connection to 0.0.0.0:43629 (local address 127.0.0.1:49634)
0925 16:43:37.427811 (+   470us) negotiation.cc:107] Waiting for socket to connect
0925 16:43:37.427841 (+    30us) client_negotiation.cc:174] Beginning negotiation
0925 16:43:37.428046 (+   205us) client_negotiation.cc:252] Sending NEGOTIATE NegotiatePB request
0925 16:43:37.428264 (+   218us) negotiation.cc:327] Negotiation complete: Network error: Client connection negotiation failed: client connection to 0.0.0.0:43629: BlockingWrite error: write error: Broken pipe (error 32)
Metrics: {"client-negotiator.queue_time_us":109}
[       OK ] Parameters/TestRpc.TestServerShutsDown/SSL_TCP (12 ms)
[ RUN      ] Parameters/TestRpc.TimedOutOnResponseMetric/SSL_TCP
I20260925 16:43:37.451445  3204 acceptor_pool.cc:254] collecting diagnostics on the listening RPC socket 0.0.0.0:37727 every 8 connection(s)
I20260925 16:43:37.452112  3205 acceptor_pool.cc:254] collecting diagnostics on the listening RPC socket 0.0.0.0:37727 every 8 connection(s)
W20260925 16:43:37.690413  3208 rpcz_store.cc:267] Call kudu.rpc_test.CalculatorService.Sleep from 127.0.0.1:35284 (request call id 3) took 50 ms (client timeout 25 ms). Trace:
W20260925 16:43:37.690697  3208 rpcz_store.cc:269] 0925 16:43:37.639864 (+     0us) service_pool.cc:170] Inserting onto call queue
0925 16:43:37.639966 (+   102us) service_pool.cc:227] Handling call
0925 16:43:37.690342 (+ 50376us) inbound_call.cc:173] Queueing success response
Related trace 'test_child':
Metrics: {"test_sleep_us":50000,"child_traces":[["test_child",{"related_trace_metric":1}]]}
W20260925 16:43:37.749703  3208 rpcz_store.cc:267] Call kudu.rpc_test.CalculatorService.Sleep from 127.0.0.1:35284 (request call id 4) took 50 ms (client timeout 50 ms). Trace:
W20260925 16:43:37.749979  3208 rpcz_store.cc:269] 0925 16:43:37.699238 (+     0us) service_pool.cc:170] Inserting onto call queue
0925 16:43:37.699349 (+   111us) service_pool.cc:227] Handling call
0925 16:43:37.749647 (+ 50298us) inbound_call.cc:173] Queueing success response
Related trace 'test_child':
Metrics: {"test_sleep_us":50000,"child_traces":[["test_child",{"related_trace_metric":1}]]}
[       OK ] Parameters/TestRpc.TimedOutOnResponseMetric/SSL_TCP (326 ms)
[ RUN      ] Parameters/TestRpc.AcceptorDispatchingTimesMetric/SSL_TCP
I20260925 16:43:37.768841  3229 acceptor_pool.cc:254] collecting diagnostics on the listening RPC socket 0.0.0.0:43775 every 8 connection(s)
I20260925 16:43:37.769654  3230 acceptor_pool.cc:254] collecting diagnostics on the listening RPC socket 0.0.0.0:43775 every 8 connection(s)
W20260925 16:43:37.775374  3225 negotiation.cc:337] Failed RPC negotiation. Trace:
0925 16:43:37.773637 (+     0us) reactor.cc:625] Submitting negotiation task for server connection from 127.0.0.1:43620 (local address 127.0.0.1:43775)
0925 16:43:37.774221 (+   584us) server_negotiation.cc:206] Beginning negotiation
0925 16:43:37.774255 (+    34us) server_negotiation.cc:399] Waiting for connection header
0925 16:43:37.774586 (+   331us) negotiation.cc:327] Negotiation complete: Network error: Server connection negotiation failed: server connection from 127.0.0.1:43620: BlockingRecv error: recv got EOF from 127.0.0.1:43620 (error 108)
Metrics: {"server-negotiator.queue_time_us":140}
[       OK ] Parameters/TestRpc.AcceptorDispatchingTimesMetric/SSL_TCP (20 ms)
[ RUN      ] Parameters/TestRpc.TestRpcCallbackDestroysMessenger/SSL_TCP
[       OK ] Parameters/TestRpc.TestRpcCallbackDestroysMessenger/SSL_TCP (24 ms)
[ RUN      ] Parameters/TestRpc.TestApplicationFeatureFlag/SSL_TCP
I20260925 16:43:37.823896  3254 acceptor_pool.cc:254] collecting diagnostics on the listening RPC socket 0.0.0.0:37901 every 8 connection(s)
I20260925 16:43:37.824631  3255 acceptor_pool.cc:254] collecting diagnostics on the listening RPC socket 0.0.0.0:37901 every 8 connection(s)
W20260925 16:43:37.856997  3253 messenger.cc:357] Unable to handle RPC call: Not implemented: call requires unsupported application feature flags: 99
[       OK ] Parameters/TestRpc.TestApplicationFeatureFlag/SSL_TCP (61 ms)
[ RUN      ] Parameters/TestRpc.TestCancellation/SSL_TCP
I20260925 16:43:37.879626  3279 acceptor_pool.cc:254] collecting diagnostics on the listening RPC socket 0.0.0.0:34395 every 8 connection(s)
I20260925 16:43:37.880281  3280 acceptor_pool.cc:254] collecting diagnostics on the listening RPC socket 0.0.0.0:34395 every 8 connection(s)
I20260925 16:43:37.883280  2865 rpc-test.cc:1648] Connecting to 0.0.0.0:34395
I20260925 16:43:37.991148  2865 rpc-test-base.h:595] status: Aborted: Sleep RPC to 0.0.0.0:34395 is cancelled in state READY, seconds elapsed: 0.000328128
I20260925 16:43:38.125171  2865 rpc-test-base.h:595] status: Aborted: Sleep RPC to 0.0.0.0:34395 is cancelled in state SENT, seconds elapsed: 0.000830613
I20260925 16:43:38.164431  3282 rpc-test-base.h:222] got call: sleep_micros: 510000
I20260925 16:43:38.284991  2865 rpc-test-base.h:595] status: Aborted: Sleep RPC to 0.0.0.0:34395 is cancelled in state SENT, seconds elapsed: 0.00083212
I20260925 16:43:38.321496  3281 rpc-test-base.h:222] got call: sleep_micros: 510000
I20260925 16:43:38.438169  2865 rpc-test-base.h:595] status: Aborted: Sleep RPC to 0.0.0.0:34395 is cancelled in state SENT, seconds elapsed: 0.000750425
W20260925 16:43:38.475383  3283 rpcz_store.cc:267] Call kudu.rpc.GenericCalculatorService.Sleep from 127.0.0.1:56650 (request call id 11) took 14 ms (client timeout 10 ms). Trace:
W20260925 16:43:38.475713  3283 rpcz_store.cc:269] 0925 16:43:38.460583 (+     0us) service_pool.cc:170] Inserting onto call queue
0925 16:43:38.475116 (+ 14533us) service_pool.cc:214] Skipping call since client already timed out
0925 16:43:38.475217 (+   101us) inbound_call.cc:173] Queueing failure response
Metrics: {}
I20260925 16:43:38.476226  3283 rpc-test-base.h:222] got call: sleep_micros: 1500000
W20260925 16:43:38.675069  3282 rpcz_store.cc:267] Call kudu.rpc.GenericCalculatorService.Sleep from 127.0.0.1:56650 (request call id 3) took 510 ms (client timeout 10 ms). Trace:
W20260925 16:43:38.675372  3282 rpcz_store.cc:269] 0925 16:43:38.164201 (+     0us) service_pool.cc:170] Inserting onto call queue
0925 16:43:38.164358 (+   157us) service_pool.cc:227] Handling call
0925 16:43:38.675009 (+510651us) inbound_call.cc:173] Queueing success response
Metrics: {}
W20260925 16:43:38.832104  3281 rpcz_store.cc:267] Call kudu.rpc.GenericCalculatorService.Sleep from 127.0.0.1:56650 (request call id 7) took 511 ms (client timeout 10 ms). Trace:
W20260925 16:43:38.832414  3281 rpcz_store.cc:269] 0925 16:43:38.320548 (+     0us) service_pool.cc:170] Inserting onto call queue
0925 16:43:38.321442 (+   894us) service_pool.cc:227] Handling call
0925 16:43:38.832049 (+510607us) inbound_call.cc:173] Queueing success response
Metrics: {}
I20260925 16:43:39.439977  2865 rpc-test-base.h:595] status: Timed out: Sleep RPC to 0.0.0.0:34395 timed out after 1.000s (SENT), seconds elapsed: 1.00146
I20260925 16:43:39.441197  3281 rpc-test-base.h:222] got call: sleep_micros: 1500000
W20260925 16:43:39.976758  3283 rpcz_store.cc:267] Call kudu.rpc.GenericCalculatorService.Sleep from 127.0.0.1:56650 (request call id 12) took 1515 ms (client timeout 1000 ms). Trace:
W20260925 16:43:39.977072  3283 rpcz_store.cc:269] 0925 16:43:38.460910 (+     0us) service_pool.cc:170] Inserting onto call queue
0925 16:43:38.476187 (+ 15277us) service_pool.cc:227] Handling call
0925 16:43:39.976705 (+1500518us) inbound_call.cc:173] Queueing success response
Metrics: {}
I20260925 16:43:40.442353  2865 rpc-test-base.h:595] status: Timed out: Sleep RPC to 0.0.0.0:34395 timed out after 1.000s (SENT), seconds elapsed: 1.00207
W20260925 16:43:40.443776  3276 messenger.cc:357] Unable to handle RPC call: Not implemented: call requires unsupported application feature flags: 99, 1
W20260925 16:43:40.445227  3276 messenger.cc:357] Unable to handle RPC call: Not implemented: call requires unsupported application feature flags: 99, 1
W20260925 16:43:40.941766  3281 rpcz_store.cc:267] Call kudu.rpc.GenericCalculatorService.Sleep from 127.0.0.1:56650 (request call id 13) took 1500 ms (client timeout 1000 ms). Trace:
W20260925 16:43:40.942077  3281 rpcz_store.cc:269] 0925 16:43:39.441001 (+     0us) service_pool.cc:170] Inserting onto call queue
0925 16:43:39.441151 (+   150us) service_pool.cc:227] Handling call
0925 16:43:40.941711 (+1500560us) inbound_call.cc:173] Queueing success response
Metrics: {}
W20260925 16:43:40.942654  3276 connection.cc:441] server connection from 127.0.0.1:56650 torn down before Call kudu.rpc.GenericCalculatorService.Sleep from 127.0.0.1:56650 (request call id 13) could send its response
[       OK ] Parameters/TestRpc.TestCancellation/SSL_TCP (3083 ms)
[ RUN      ] Parameters/TestRpc.TestCancellationMultiThreads/SSL_TCP
I20260925 16:43:40.987787  3304 acceptor_pool.cc:254] collecting diagnostics on the listening RPC socket 0.0.0.0:46715 every 8 connection(s)
I20260925 16:43:40.988399  3305 acceptor_pool.cc:254] collecting diagnostics on the listening RPC socket 0.0.0.0:46715 every 8 connection(s)
I20260925 16:43:40.991356  2865 rpc-test.cc:1808] Connecting to 0.0.0.0:46715
I20260925 16:43:41.127982  3318 test_util.cc:268] Using random seed: 1798757650
I20260925 16:43:41.128996  3319 test_util.cc:268] Using random seed: 1798758666
I20260925 16:43:41.130287  3320 test_util.cc:268] Using random seed: 1798759963
I20260925 16:43:41.131603  3321 test_util.cc:268] Using random seed: 1798761253
I20260925 16:43:41.133178  3322 test_util.cc:268] Using random seed: 1798762715
I20260925 16:43:41.134469  3323 test_util.cc:268] Using random seed: 1798764020
I20260925 16:43:41.135677  3324 test_util.cc:268] Using random seed: 1798765257
I20260925 16:43:41.137355  3325 test_util.cc:268] Using random seed: 1798766875
I20260925 16:43:41.138774  3326 test_util.cc:268] Using random seed: 1798768311
I20260925 16:43:41.140002  3327 test_util.cc:268] Using random seed: 1798769552
I20260925 16:43:41.141472  3328 test_util.cc:268] Using random seed: 1798770992
I20260925 16:43:41.142985  3329 test_util.cc:268] Using random seed: 1798772402
I20260925 16:43:41.145704  3330 test_util.cc:268] Using random seed: 1798775135
I20260925 16:43:41.150164  3331 test_util.cc:268] Using random seed: 1798779665
I20260925 16:43:41.151907  3332 test_util.cc:268] Using random seed: 1798781445
I20260925 16:43:41.153530  3333 test_util.cc:268] Using random seed: 1798783001
I20260925 16:43:41.155330  3334 test_util.cc:268] Using random seed: 1798784805
I20260925 16:43:41.157263  3335 test_util.cc:268] Using random seed: 1798786764
I20260925 16:43:41.162242  3336 test_util.cc:268] Using random seed: 1798791719
I20260925 16:43:41.164491  3337 test_util.cc:268] Using random seed: 1798794016
I20260925 16:43:41.166061  3338 test_util.cc:268] Using random seed: 1798795589
I20260925 16:43:41.167677  3339 test_util.cc:268] Using random seed: 1798797189
I20260925 16:43:41.169320  3340 test_util.cc:268] Using random seed: 1798798858
I20260925 16:43:41.171465  3341 test_util.cc:268] Using random seed: 1798800976
I20260925 16:43:41.173275  3342 test_util.cc:268] Using random seed: 1798802710
I20260925 16:43:41.174944  3343 test_util.cc:268] Using random seed: 1798804428
I20260925 16:43:41.176589  3344 test_util.cc:268] Using random seed: 1798806067
I20260925 16:43:41.178900  3345 test_util.cc:268] Using random seed: 1798808426
I20260925 16:43:41.180570  3346 test_util.cc:268] Using random seed: 1798810055
I20260925 16:43:41.182164  3347 test_util.cc:268] Using random seed: 1798811710
[       OK ] Parameters/TestRpc.TestCancellationMultiThreads/SSL_TCP (16939 ms)
[ RUN      ] Parameters/TestRpc.TestCallId/SSL_TCP
I20260925 16:43:57.921846  3361 acceptor_pool.cc:254] collecting diagnostics on the listening RPC socket 0.0.0.0:43381 every 8 connection(s)
I20260925 16:43:57.922600  3362 acceptor_pool.cc:254] collecting diagnostics on the listening RPC socket 0.0.0.0:43381 every 8 connection(s)
[       OK ] Parameters/TestRpc.TestCallId/SSL_TCP (83 ms)
[----------] 20 tests from Parameters/TestRpc (36284 ms total)

[----------] Global test environment tear-down
[==========] 21 tests from 2 test suites ran. (36292 ms total)
[  PASSED  ] 20 tests.
[  FAILED  ] 1 test, listed below:
[  FAILED  ] Parameters/TestRpc.TestCallWithChainCertAndRootCA/SSL_TCP, where GetParam() = (true, false)

 1 FAILED TEST