Diagnosed failure
Parameters/TestRpc.TestCallWithChainCertAndChainCA/SSL_UnixSocket: /data0/somelongdirectorytoavoidrpathissues/src/kudu/src/kudu/rpc/rpc-test.cc:270: Failure
Failed
Bad status: Runtime error: could not verify certificate chain (error with cert: subject=CN = localhost, ST = sadfjas, C = AS, emailAddress = sdflkdsajf, O = lskdfjlsad, OU = sldfkja, issuer=C = AS, ST = ASDfkjdhf, L = lskdjf, O = saldfja, OU = skdjf, CN = localhost, emailAddress = sadjflkadsj): : certificate has expired
Google Test trace:
/data0/somelongdirectorytoavoidrpathissues/src/kudu/src/kudu/rpc/rpc-test.cc:267: Connecting to unix:/tmp/dist-test-taskuXufU0/test-tmp/rpc-test-84c4fbaa5d2a4c42812b272c6ea850f2.sock
I20260928 21:47:21.170480 379 test_util.cc:175] -----------------------------------------------
I20260928 21:47:21.170593 379 test_util.cc:176] Had fatal failures, leaving test files at /tmp/dist-test-taskuXufU0/test-tmp/rpc-test.6.Parameters_TestRpc.TestCallWithChainCertAndChainCA_SSL_UnixSocket.1790632041036426-379-0
Full log
Note: This is test shard 7 of 8.
[==========] Running 21 tests from 2 test suites.
[----------] Global test environment set-up.
[----------] 20 tests from Parameters/TestRpc
[ RUN ] Parameters/TestRpc.TestMessengerCreateDestroy/SSL_UnixSocket
WARNING: Logging before InitGoogleLogging() is written to STDERR
I20260928 21:47:21.094774 379 rpc-test.cc:169] started messenger TestCreateDestroy
[ OK ] Parameters/TestRpc.TestMessengerCreateDestroy/SSL_UnixSocket (36 ms)
[ RUN ] Parameters/TestRpc.TestNegotiationDeadlock/SSL_UnixSocket
I20260928 21:47:21.108489 399 acceptor_pool.cc:254] collecting diagnostics on the listening RPC socket unix:/tmp/dist-test-taskuXufU0/test-tmp/rpc-test-a659391498334102bc8add5af5ae1e03.sock every 8 connection(s)
I20260928 21:47:21.108789 400 acceptor_pool.cc:254] collecting diagnostics on the listening RPC socket unix:/tmp/dist-test-taskuXufU0/test-tmp/rpc-test-a659391498334102bc8add5af5ae1e03.sock every 8 connection(s)
[ OK ] Parameters/TestRpc.TestNegotiationDeadlock/SSL_UnixSocket (30 ms)
[ RUN ] Parameters/TestRpc.TestCallWithChainCertAndChainCA/SSL_UnixSocket
I20260928 21:47:21.157912 415 acceptor_pool.cc:254] collecting diagnostics on the listening RPC socket unix:/tmp/dist-test-taskuXufU0/test-tmp/rpc-test-84c4fbaa5d2a4c42812b272c6ea850f2.sock every 8 connection(s)
I20260928 21:47:21.158260 416 acceptor_pool.cc:254] collecting diagnostics on the listening RPC socket unix:/tmp/dist-test-taskuXufU0/test-tmp/rpc-test-84c4fbaa5d2a4c42812b272c6ea850f2.sock every 8 connection(s)
/data0/somelongdirectorytoavoidrpathissues/src/kudu/src/kudu/rpc/rpc-test.cc:270: Failure
Failed
Bad status: Runtime error: could not verify certificate chain (error with cert: subject=CN = localhost, ST = sadfjas, C = AS, emailAddress = sdflkdsajf, O = lskdfjlsad, OU = sldfkja, issuer=C = AS, ST = ASDfkjdhf, L = lskdjf, O = saldfja, OU = skdjf, CN = localhost, emailAddress = sadjflkadsj): : certificate has expired
Google Test trace:
/data0/somelongdirectorytoavoidrpathissues/src/kudu/src/kudu/rpc/rpc-test.cc:267: Connecting to unix:/tmp/dist-test-taskuXufU0/test-tmp/rpc-test-84c4fbaa5d2a4c42812b272c6ea850f2.sock
I20260928 21:47:21.170480 379 test_util.cc:175] -----------------------------------------------
I20260928 21:47:21.170593 379 test_util.cc:176] Had fatal failures, leaving test files at /tmp/dist-test-taskuXufU0/test-tmp/rpc-test.6.Parameters_TestRpc.TestCallWithChainCertAndChainCA_SSL_UnixSocket.1790632041036426-379-0
[ FAILED ] Parameters/TestRpc.TestCallWithChainCertAndChainCA/SSL_UnixSocket, where GetParam() = (true, true) (41 ms)
[ RUN ] Parameters/TestRpc.TestCallWithPasswordProtectedKey/SSL_UnixSocket
I20260928 21:47:21.209836 440 acceptor_pool.cc:254] collecting diagnostics on the listening RPC socket unix:/tmp/dist-test-taskuXufU0/test-tmp/rpc-test-6fa9825e51324595baa4b9785aadce40.sock every 8 connection(s)
I20260928 21:47:21.210035 441 acceptor_pool.cc:254] collecting diagnostics on the listening RPC socket unix:/tmp/dist-test-taskuXufU0/test-tmp/rpc-test-6fa9825e51324595baa4b9785aadce40.sock every 8 connection(s)
W20260928 21:47:21.242007 437 connection.cc:196] Error closing socket: Network error: TlsSocket::Close: Broken pipe
[ OK ] Parameters/TestRpc.TestCallWithPasswordProtectedKey/SSL_UnixSocket (75 ms)
[ RUN ] Parameters/TestRpc.TestCallToBadServer/SSL_UnixSocket
I20260928 21:47:21.255959 379 rpc-test.cc:394] Status: Network error: Client connection negotiation failed: client connection to 0.0.0.0:0: connect: Connection refused (error 111)
I20260928 21:47:21.256703 379 rpc-test.cc:394] Status: Network error: Client connection negotiation failed: client connection to 0.0.0.0:0: connect: Connection refused (error 111)
I20260928 21:47:21.257407 379 rpc-test.cc:394] Status: Network error: Client connection negotiation failed: client connection to 0.0.0.0:0: connect: Connection refused (error 111)
I20260928 21:47:21.258073 379 rpc-test.cc:394] Status: Network error: Client connection negotiation failed: client connection to 0.0.0.0:0: connect: Connection refused (error 111)
I20260928 21:47:21.258725 379 rpc-test.cc:394] Status: Network error: Client connection negotiation failed: client connection to 0.0.0.0:0: connect: Connection refused (error 111)
[ OK ] Parameters/TestRpc.TestCallToBadServer/SSL_UnixSocket (14 ms)
[ RUN ] Parameters/TestRpc.TestWrongService/SSL_UnixSocket
I20260928 21:47:21.275079 475 acceptor_pool.cc:254] collecting diagnostics on the listening RPC socket unix:/tmp/dist-test-taskuXufU0/test-tmp/rpc-test-35724c29700e4e0b99bf574cb099f284.sock every 8 connection(s)
I20260928 21:47:21.275332 476 acceptor_pool.cc:254] collecting diagnostics on the listening RPC socket unix:/tmp/dist-test-taskuXufU0/test-tmp/rpc-test-35724c29700e4e0b99bf574cb099f284.sock every 8 connection(s)
I20260928 21:47:21.321900 472 messenger.cc:345] service WrongServiceName not registered on TestServer
[ OK ] Parameters/TestRpc.TestWrongService/SSL_UnixSocket (65 ms)
[ RUN ] Parameters/TestRpc.TestConnectionKeepalive/SSL_UnixSocket
I20260928 21:47:21.341001 498 acceptor_pool.cc:254] collecting diagnostics on the listening RPC socket unix:/tmp/dist-test-taskuXufU0/test-tmp/rpc-test-5b30bc807840437d8aa2c05ce8c2ad87.sock every 8 connection(s)
I20260928 21:47:21.341229 499 acceptor_pool.cc:254] collecting diagnostics on the listening RPC socket unix:/tmp/dist-test-taskuXufU0/test-tmp/rpc-test-5b30bc807840437d8aa2c05ce8c2ad87.sock every 8 connection(s)
I20260928 21:47:21.342257 379 rpc-test.cc:488] Connecting to unix:/tmp/dist-test-taskuXufU0/test-tmp/rpc-test-5b30bc807840437d8aa2c05ce8c2ad87.sock
W20260928 21:47:21.830065 511 connection.cc:196] Error closing socket: Network error: TlsSocket::Close: Broken pipe
[ OK ] Parameters/TestRpc.TestConnectionKeepalive/SSL_UnixSocket (1042 ms)
[ RUN ] Parameters/TestRpc.TestClientConnectionMetrics/SSL_UnixSocket
I20260928 21:47:22.395124 523 acceptor_pool.cc:254] collecting diagnostics on the listening RPC socket unix:/tmp/dist-test-taskuXufU0/test-tmp/rpc-test-1cc99f828b8d40018a374643a7502142.sock every 8 connection(s)
I20260928 21:47:22.395411 524 acceptor_pool.cc:254] collecting diagnostics on the listening RPC socket unix:/tmp/dist-test-taskuXufU0/test-tmp/rpc-test-1cc99f828b8d40018a374643a7502142.sock every 8 connection(s)
I20260928 21:47:22.396483 379 rpc-test.cc:569] Connecting to unix:/tmp/dist-test-taskuXufU0/test-tmp/rpc-test-1cc99f828b8d40018a374643a7502142.sock
[ OK ] Parameters/TestRpc.TestClientConnectionMetrics/SSL_UnixSocket (22256 ms)
[ RUN ] Parameters/TestRpc.TestCredentialsPolicy/SSL_UnixSocket
I20260928 21:47:44.653092 546 acceptor_pool.cc:254] collecting diagnostics on the listening RPC socket unix:/tmp/dist-test-taskuXufU0/test-tmp/rpc-test-0c20bb46065641108e39e3d81733740c.sock every 8 connection(s)
I20260928 21:47:44.653371 547 acceptor_pool.cc:254] collecting diagnostics on the listening RPC socket unix:/tmp/dist-test-taskuXufU0/test-tmp/rpc-test-0c20bb46065641108e39e3d81733740c.sock every 8 connection(s)
I20260928 21:47:44.654467 379 rpc-test.cc:700] Connecting to unix:/tmp/dist-test-taskuXufU0/test-tmp/rpc-test-0c20bb46065641108e39e3d81733740c.sock
W20260928 21:47:44.679529 545 connection.cc:196] Error closing socket: Network error: TlsSocket::Close: Broken pipe
[ OK ] Parameters/TestRpc.TestCredentialsPolicy/SSL_UnixSocket (64 ms)
[ RUN ] Parameters/TestRpc.TestCallLongerThanKeepalive/SSL_UnixSocket
I20260928 21:47:44.714071 571 acceptor_pool.cc:254] collecting diagnostics on the listening RPC socket unix:/tmp/dist-test-taskuXufU0/test-tmp/rpc-test-1e7565e22a5c494f83a14756c0c2eccc.sock every 8 connection(s)
I20260928 21:47:44.714282 572 acceptor_pool.cc:254] collecting diagnostics on the listening RPC socket unix:/tmp/dist-test-taskuXufU0/test-tmp/rpc-test-1e7565e22a5c494f83a14756c0c2eccc.sock every 8 connection(s)
I20260928 21:47:44.743942 575 rpc-test-base.h:222] got call: sleep_micros: 3000000 deferred: true
I20260928 21:47:47.745591 575 rpcz_store.cc:275] Call kudu.rpc.GenericCalculatorService.Sleep from unix:<unnamed> (request call id 0) took 3001 ms. Trace:
I20260928 21:47:47.745747 575 rpcz_store.cc:276] 0928 21:47:44.743824 (+ 0us) service_pool.cc:170] Inserting onto call queue
0928 21:47:44.743882 (+ 58us) service_pool.cc:227] Handling call
0928 21:47:47.745549 (+3001667us) inbound_call.cc:173] Queueing success response
Metrics: {}
W20260928 21:47:47.747908 568 connection.cc:196] Error closing socket: Network error: TlsSocket::Close: Broken pipe
[ OK ] Parameters/TestRpc.TestCallLongerThanKeepalive/SSL_UnixSocket (3060 ms)
[ RUN ] Parameters/TestRpc.TestRpcSidecar/SSL_UnixSocket
I20260928 21:47:47.770999 596 acceptor_pool.cc:254] collecting diagnostics on the listening RPC socket unix:/tmp/dist-test-taskuXufU0/test-tmp/rpc-test-81c65062cf4c424886047f85e1f20a3a.sock every 8 connection(s)
I20260928 21:47:47.771349 597 acceptor_pool.cc:254] collecting diagnostics on the listening RPC socket unix:/tmp/dist-test-taskuXufU0/test-tmp/rpc-test-81c65062cf4c424886047f85e1f20a3a.sock every 8 connection(s)
W20260928 21:47:47.877038 593 connection.cc:196] Error closing socket: Network error: TlsSocket::Close: Broken pipe
[ OK ] Parameters/TestRpc.TestRpcSidecar/SSL_UnixSocket (127 ms)
[ RUN ] Parameters/TestRpc.TestRpcSidecarLimits/SSL_UnixSocket
I20260928 21:47:50.092084 621 acceptor_pool.cc:254] collecting diagnostics on the listening RPC socket unix:/tmp/dist-test-taskuXufU0/test-tmp/rpc-test-b18c52eeb89c4d5895cd6ee54c1f6791.sock every 8 connection(s)
I20260928 21:47:50.092437 622 acceptor_pool.cc:254] collecting diagnostics on the listening RPC socket unix:/tmp/dist-test-taskuXufU0/test-tmp/rpc-test-b18c52eeb89c4d5895cd6ee54c1f6791.sock every 8 connection(s)
W20260928 21:47:50.109941 379 serialization.cc:72] Serialized kudu.rpc_test.PushStringsRequestPB (2147483654 bytes) is larger than the maximum configured RPC message size (52428800 bytes). Sending anyway, but peer may reject the data.
W20260928 21:47:50.116190 618 connection.cc:535] server connection from unix:<unnamed> recv error: Network error: RPC frame had a length of 2147483714, but we only support messages up to 52428800 bytes long.
W20260928 21:47:50.116308 618 connection.cc:158] shutting down server connection from unix:<unnamed> with pending inbound data: 4/2147483714 bytes received; last active 0 ns ago: status Network error: RPC frame had a length of 2147483714, but we only support messages up to 52428800 bytes long.
W20260928 21:47:50.116704 634 connection.cc:698] client connection to unix:/tmp/dist-test-taskuXufU0/test-tmp/rpc-test-b18c52eeb89c4d5895cd6ee54c1f6791.sock send error: Network error: failed to write to TLS socket: Broken pipe
W20260928 21:47:50.117758 634 connection.cc:196] Error closing socket: Network error: TlsSocket::Close: Success
I20260928 21:47:50.135622 646 acceptor_pool.cc:254] collecting diagnostics on the listening RPC socket unix:/tmp/dist-test-taskuXufU0/test-tmp/rpc-test-b18c52eeb89c4d5895cd6ee54c1f6791.sock every 8 connection(s)
I20260928 21:47:50.135735 647 acceptor_pool.cc:254] collecting diagnostics on the listening RPC socket unix:/tmp/dist-test-taskuXufU0/test-tmp/rpc-test-b18c52eeb89c4d5895cd6ee54c1f6791.sock every 8 connection(s)
W20260928 21:47:55.942503 643 connection.cc:577] server connection from unix:<unnamed>: received bad data: 'Corruption: Invalid packet: message had a length of 2147483710, but we only support messages up to 2147483647 bytes
'
W20260928 21:47:55.943194 659 connection.cc:196] Error closing socket: Network error: TlsSocket::Close: Broken pipe
[ OK ] Parameters/TestRpc.TestRpcSidecarLimits/SSL_UnixSocket (8526 ms)
[ RUN ] Parameters/TestRpc.TestCallTimeoutDoesntAffectNegotiation/SSL_UnixSocket
I20260928 21:47:56.419986 671 acceptor_pool.cc:254] collecting diagnostics on the listening RPC socket unix:/tmp/dist-test-taskuXufU0/test-tmp/rpc-test-63c21e5b0cb54145872c553eb9dd65e4.sock every 8 connection(s)
I20260928 21:47:56.420317 672 acceptor_pool.cc:254] collecting diagnostics on the listening RPC socket unix:/tmp/dist-test-taskuXufU0/test-tmp/rpc-test-63c21e5b0cb54145872c553eb9dd65e4.sock every 8 connection(s)
W20260928 21:47:56.444933 667 negotiation.cc:266] Injecting 500ms delay in negotiation
I20260928 21:47:56.495396 379 rpc-test-base.h:595] status: Timed out: connection negotiation to unix:/tmp/dist-test-taskuXufU0/test-tmp/rpc-test-63c21e5b0cb54145872c553eb9dd65e4.sock for RPC Sleep timed out after 0.050s (ON_OUTBOUND_QUEUE), seconds elapsed: 0.0511632
[ OK ] Parameters/TestRpc.TestCallTimeoutDoesntAffectNegotiation/SSL_UnixSocket (549 ms)
[ RUN ] Parameters/TestRpc.TestRpcHandlerLatencyMetric/SSL_UnixSocket
I20260928 21:47:56.971758 696 acceptor_pool.cc:254] collecting diagnostics on the listening RPC socket unix:/tmp/dist-test-taskuXufU0/test-tmp/rpc-test-a7716e7432fa4f0ca0b9d69bfb8c026e.sock every 8 connection(s)
I20260928 21:47:56.972014 697 acceptor_pool.cc:254] collecting diagnostics on the listening RPC socket unix:/tmp/dist-test-taskuXufU0/test-tmp/rpc-test-a7716e7432fa4f0ca0b9d69bfb8c026e.sock every 8 connection(s)
I20260928 21:47:57.007917 379 rpc-test.cc:1236] Sleep() min lat: 20609
I20260928 21:47:57.008054 379 rpc-test.cc:1237] Sleep() mean lat: 20609
I20260928 21:47:57.008177 379 rpc-test.cc:1238] Sleep() max lat: 20609
I20260928 21:47:57.008222 379 rpc-test.cc:1239] Sleep() #calls: 1
[ OK ] Parameters/TestRpc.TestRpcHandlerLatencyMetric/SSL_UnixSocket (57 ms)
[ RUN ] Parameters/TestRpc.TimedOutOnResponseMetricServiceQueue/SSL_UnixSocket
I20260928 21:47:57.027522 722 acceptor_pool.cc:254] collecting diagnostics on the listening RPC socket unix:/tmp/dist-test-taskuXufU0/test-tmp/rpc-test-74064b05ef264776936f8c9d6dd62b01.sock every 8 connection(s)
I20260928 21:47:57.027773 723 acceptor_pool.cc:254] collecting diagnostics on the listening RPC socket unix:/tmp/dist-test-taskuXufU0/test-tmp/rpc-test-74064b05ef264776936f8c9d6dd62b01.sock every 8 connection(s)
W20260928 21:47:57.098991 724 rpcz_store.cc:267] Call kudu.rpc_test.CalculatorService.Sleep from unix:<unnamed> (request call id 2) took 20 ms (client timeout 20 ms). Trace:
W20260928 21:47:57.099185 724 rpcz_store.cc:269] 0928 21:47:57.078550 (+ 0us) service_pool.cc:170] Inserting onto call queue
0928 21:47:57.098924 (+ 20374us) service_pool.cc:214] Skipping call since client already timed out
0928 21:47:57.098973 (+ 49us) inbound_call.cc:173] Queueing failure response
Metrics: {}
[ OK ] Parameters/TestRpc.TimedOutOnResponseMetricServiceQueue/SSL_UnixSocket (90 ms)
[ RUN ] Parameters/TestRpc.RpcPendingConnectionsMetric/SSL_UnixSocket
I20260928 21:47:57.108793 745 acceptor_pool.cc:254] collecting diagnostics on the listening RPC socket 0.0.0.0:45517 every 8 connection(s)
I20260928 21:47:57.109000 746 acceptor_pool.cc:254] collecting diagnostics on the listening RPC socket 0.0.0.0:45517 every 8 connection(s)
W20260928 21:47:57.120100 741 negotiation.cc:337] Failed RPC negotiation. Trace:
0928 21:47:57.119041 (+ 0us) reactor.cc:625] Submitting negotiation task for server connection from 127.0.0.1:42600 (local address 127.0.0.1:45517)
0928 21:47:57.119293 (+ 252us) server_negotiation.cc:206] Beginning negotiation
0928 21:47:57.119302 (+ 9us) server_negotiation.cc:399] Waiting for connection header
0928 21:47:57.119525 (+ 223us) negotiation.cc:327] Negotiation complete: Network error: Server connection negotiation failed: server connection from 127.0.0.1:42600: BlockingRecv error: recv got EOF from 127.0.0.1:42600 (error 108)
Metrics: {"server-negotiator.queue_time_us":74}
[ OK ] Parameters/TestRpc.RpcPendingConnectionsMetric/SSL_UnixSocket (28 ms)
[ RUN ] Parameters/TestRpc.TestRpcContextClientDeadline/SSL_UnixSocket
I20260928 21:47:57.150211 761 acceptor_pool.cc:254] collecting diagnostics on the listening RPC socket unix:/tmp/dist-test-taskuXufU0/test-tmp/rpc-test-bebd8984d6ea4929b80ff1062660655e.sock every 8 connection(s)
I20260928 21:47:57.150410 762 acceptor_pool.cc:254] collecting diagnostics on the listening RPC socket unix:/tmp/dist-test-taskuXufU0/test-tmp/rpc-test-bebd8984d6ea4929b80ff1062660655e.sock every 8 connection(s)
[ OK ] Parameters/TestRpc.TestRpcContextClientDeadline/SSL_UnixSocket (71 ms)
[ RUN ] Parameters/TestRpc.TestApplicationFeatureFlagUnsupportedServer/SSL_UnixSocket
I20260928 21:47:57.228868 786 acceptor_pool.cc:254] collecting diagnostics on the listening RPC socket unix:/tmp/dist-test-taskuXufU0/test-tmp/rpc-test-1c01903869db4bc489ec9d63d2e4c46d.sock every 8 connection(s)
I20260928 21:47:57.229080 787 acceptor_pool.cc:254] collecting diagnostics on the listening RPC socket unix:/tmp/dist-test-taskuXufU0/test-tmp/rpc-test-1c01903869db4bc489ec9d63d2e4c46d.sock every 8 connection(s)
[ OK ] Parameters/TestRpc.TestApplicationFeatureFlagUnsupportedServer/SSL_UnixSocket (49 ms)
[ RUN ] Parameters/TestRpc.TestCancellationAsync/SSL_UnixSocket
I20260928 21:47:57.274922 811 acceptor_pool.cc:254] collecting diagnostics on the listening RPC socket unix:/tmp/dist-test-taskuXufU0/test-tmp/rpc-test-76af208cf190493483048666840d1545.sock every 8 connection(s)
I20260928 21:47:57.275188 812 acceptor_pool.cc:254] collecting diagnostics on the listening RPC socket unix:/tmp/dist-test-taskuXufU0/test-tmp/rpc-test-76af208cf190493483048666840d1545.sock every 8 connection(s)
I20260928 21:47:57.276290 379 rpc-test.cc:1716] Connecting to unix:/tmp/dist-test-taskuXufU0/test-tmp/rpc-test-76af208cf190493483048666840d1545.sock
I20260928 21:47:57.295689 379 test_util.cc:268] Using random seed: 82051124
I20260928 21:47:57.338769 815 rpc-test-base.h:240] got call: sleep_micros: 500 pattern: 4294967295 num_repetitions: 2097152 sidecar_idx: 0
I20260928 21:47:57.368631 814 rpc-test-base.h:240] got call: sleep_micros: 500 pattern: 4294967295 num_repetitions: 2097152 sidecar_idx: 0
I20260928 21:47:57.397058 813 rpc-test-base.h:240] got call: sleep_micros: 500 pattern: 4294967295 num_repetitions: 2097152 sidecar_idx: 0
I20260928 21:47:57.425276 815 rpc-test-base.h:240] got call: sleep_micros: 500 pattern: 4294967295 num_repetitions: 2097152 sidecar_idx: 0
I20260928 21:47:57.452481 814 rpc-test-base.h:240] got call: sleep_micros: 500 pattern: 4294967295 num_repetitions: 2097152 sidecar_idx: 0
I20260928 21:47:57.488804 815 rpc-test-base.h:240] got call: sleep_micros: 500 pattern: 4294967295 num_repetitions: 2097152 sidecar_idx: 0
I20260928 21:47:57.516021 814 rpc-test-base.h:240] got call: sleep_micros: 500 pattern: 4294967295 num_repetitions: 2097152 sidecar_idx: 0
W20260928 21:47:57.518488 808 connection.cc:196] Error closing socket: Network error: TlsSocket::Close: Broken pipe
W20260928 21:47:57.533793 808 connection.cc:441] server connection from unix:<unnamed> torn down before Call kudu.rpc.GenericCalculatorService.SleepWithSidecar from unix:<unnamed> (request call id 8) could send its response
W20260928 21:47:57.551304 808 connection.cc:441] server connection from unix:<unnamed> torn down before Call kudu.rpc.GenericCalculatorService.SleepWithSidecar from unix:<unnamed> (request call id 9) could send its response
[ OK ] Parameters/TestRpc.TestCancellationAsync/SSL_UnixSocket (302 ms)
[ RUN ] Parameters/TestRpc.TestPerformanceBySocketType/SSL_UnixSocket
I20260928 21:47:57.595073 836 acceptor_pool.cc:254] collecting diagnostics on the listening RPC socket unix:/tmp/dist-test-taskuXufU0/test-tmp/rpc-test-db48ebf4953d477bad5a7a2dc29adfd8.sock every 8 connection(s)
I20260928 21:47:57.595265 837 acceptor_pool.cc:254] collecting diagnostics on the listening RPC socket unix:/tmp/dist-test-taskuXufU0/test-tmp/rpc-test-db48ebf4953d477bad5a7a2dc29adfd8.sock every 8 connection(s)
I20260928 21:47:57.596262 379 rpc-test.cc:1846] Connecting to unix:/tmp/dist-test-taskuXufU0/test-tmp/rpc-test-db48ebf4953d477bad5a7a2dc29adfd8.sock
I20260928 21:48:00.765561 379 rpc-test.cc:1859] Sending 1024MB via ssl-enabled unix socket: real 3.148s user 3.085s sys 2.233s
I20260928 21:48:03.929241 379 rpc-test.cc:1859] Sending 1024MB via ssl-enabled unix socket: real 3.164s user 3.142s sys 2.190s
I20260928 21:48:07.140818 379 rpc-test.cc:1859] Sending 1024MB via ssl-enabled unix socket: real 3.211s user 3.125s sys 2.300s
I20260928 21:48:10.336580 379 rpc-test.cc:1859] Sending 1024MB via ssl-enabled unix socket: real 3.196s user 3.022s sys 2.390s
I20260928 21:48:13.570461 379 rpc-test.cc:1859] Sending 1024MB via ssl-enabled unix socket: real 3.234s user 3.074s sys 2.384s
W20260928 21:48:13.572464 833 connection.cc:196] Error closing socket: Network error: TlsSocket::Close: Broken pipe
[ OK ] Parameters/TestRpc.TestPerformanceBySocketType/SSL_UnixSocket (16023 ms)
[----------] 20 tests from Parameters/TestRpc (52517 ms total)
[----------] 1 test from Parameters/TestRpcSocketTxRxQueue
[ RUN ] Parameters/TestRpcSocketTxRxQueue.AcceptorRxQueueSizeMetric/0
I20260928 21:48:13.588340 861 acceptor_pool.cc:254] collecting diagnostics on the listening RPC socket 0.0.0.0:40255 every 1 connection(s)
I20260928 21:48:13.588615 862 acceptor_pool.cc:254] collecting diagnostics on the listening RPC socket 0.0.0.0:40255 every 1 connection(s)
W20260928 21:48:13.590262 857 negotiation.cc:337] Failed RPC negotiation. Trace:
0928 21:48:13.589851 (+ 0us) reactor.cc:625] Submitting negotiation task for server connection from 127.0.0.1:49296 (local address 127.0.0.1:40255)
0928 21:48:13.590012 (+ 161us) server_negotiation.cc:206] Beginning negotiation
0928 21:48:13.590016 (+ 4us) server_negotiation.cc:399] Waiting for connection header
0928 21:48:13.590137 (+ 121us) negotiation.cc:327] Negotiation complete: Network error: Server connection negotiation failed: server connection from 127.0.0.1:49296: BlockingRecv error: recv got EOF from 127.0.0.1:49296 (error 108)
Metrics: {"server-negotiator.queue_time_us":50}
[ OK ] Parameters/TestRpcSocketTxRxQueue.AcceptorRxQueueSizeMetric/0 (15 ms)
[----------] 1 test from Parameters/TestRpcSocketTxRxQueue (15 ms total)
[----------] Global test environment tear-down
[==========] 21 tests from 2 test suites ran. (52532 ms total)
[ PASSED ] 20 tests.
[ FAILED ] 1 test, listed below:
[ FAILED ] Parameters/TestRpc.TestCallWithChainCertAndChainCA/SSL_UnixSocket, where GetParam() = (true, true)
1 FAILED TEST