Diagnosed failure

Parameters/TestRpc.TestCallWithChainCertAndChainCA/SSL_UnixSocket: /data0/somelongdirectorytoavoidrpathissues/src/kudu/src/kudu/rpc/rpc-test.cc:270: Failure
Failed
Bad status: Runtime error: could not verify certificate chain (error with cert: subject=CN = localhost, ST = sadfjas, C = AS, emailAddress = sdflkdsajf, O = lskdfjlsad, OU = sldfkja, issuer=C = AS, ST = ASDfkjdhf, L = lskdjf, O = saldfja, OU = skdjf, CN = localhost, emailAddress = sadjflkadsj): : certificate has expired
Google Test trace:
/data0/somelongdirectorytoavoidrpathissues/src/kudu/src/kudu/rpc/rpc-test.cc:267: Connecting to unix:/tmp/dist-test-taskTiND8b/test-tmp/rpc-test-19c757f6387d4b4986be9ea208a2c731.sock
I20260928 19:28:00.301573  1554 test_util.cc:175] -----------------------------------------------
I20260928 19:28:00.301741  1554 test_util.cc:176] Had fatal failures, leaving test files at /tmp/dist-test-taskTiND8b/test-tmp/rpc-test.6.Parameters_TestRpc.TestCallWithChainCertAndChainCA_SSL_UnixSocket.1790623679010948-1554-0

Full log

Note: This is test shard 7 of 8.
[==========] Running 21 tests from 2 test suites.
[----------] Global test environment set-up.
[----------] 20 tests from Parameters/TestRpc
[ RUN      ] Parameters/TestRpc.TestMessengerCreateDestroy/SSL_UnixSocket
WARNING: Logging before InitGoogleLogging() is written to STDERR
I20260928 19:27:59.111054  1554 rpc-test.cc:169] started messenger TestCreateDestroy
[       OK ] Parameters/TestRpc.TestMessengerCreateDestroy/SSL_UnixSocket (1086 ms)
[ RUN      ] Parameters/TestRpc.TestNegotiationDeadlock/SSL_UnixSocket
I20260928 19:28:00.182529  1576 acceptor_pool.cc:254] collecting diagnostics on the listening RPC socket unix:/tmp/dist-test-taskTiND8b/test-tmp/rpc-test-08aeb4412b0747849b8ebf08e942dc67.sock every 8 connection(s)
I20260928 19:28:00.183826  1577 acceptor_pool.cc:254] collecting diagnostics on the listening RPC socket unix:/tmp/dist-test-taskTiND8b/test-tmp/rpc-test-08aeb4412b0747849b8ebf08e942dc67.sock every 8 connection(s)
[       OK ] Parameters/TestRpc.TestNegotiationDeadlock/SSL_UnixSocket (81 ms)
[ RUN      ] Parameters/TestRpc.TestCallWithChainCertAndChainCA/SSL_UnixSocket
I20260928 19:28:00.274243  1592 acceptor_pool.cc:254] collecting diagnostics on the listening RPC socket unix:/tmp/dist-test-taskTiND8b/test-tmp/rpc-test-19c757f6387d4b4986be9ea208a2c731.sock every 8 connection(s)
I20260928 19:28:00.276214  1593 acceptor_pool.cc:254] collecting diagnostics on the listening RPC socket unix:/tmp/dist-test-taskTiND8b/test-tmp/rpc-test-19c757f6387d4b4986be9ea208a2c731.sock every 8 connection(s)
/data0/somelongdirectorytoavoidrpathissues/src/kudu/src/kudu/rpc/rpc-test.cc:270: Failure
Failed
Bad status: Runtime error: could not verify certificate chain (error with cert: subject=CN = localhost, ST = sadfjas, C = AS, emailAddress = sdflkdsajf, O = lskdfjlsad, OU = sldfkja, issuer=C = AS, ST = ASDfkjdhf, L = lskdjf, O = saldfja, OU = skdjf, CN = localhost, emailAddress = sadjflkadsj): : certificate has expired
Google Test trace:
/data0/somelongdirectorytoavoidrpathissues/src/kudu/src/kudu/rpc/rpc-test.cc:267: Connecting to unix:/tmp/dist-test-taskTiND8b/test-tmp/rpc-test-19c757f6387d4b4986be9ea208a2c731.sock
I20260928 19:28:00.301573  1554 test_util.cc:175] -----------------------------------------------
I20260928 19:28:00.301741  1554 test_util.cc:176] Had fatal failures, leaving test files at /tmp/dist-test-taskTiND8b/test-tmp/rpc-test.6.Parameters_TestRpc.TestCallWithChainCertAndChainCA_SSL_UnixSocket.1790623679010948-1554-0
[  FAILED  ] Parameters/TestRpc.TestCallWithChainCertAndChainCA/SSL_UnixSocket, where GetParam() = (true, true) (72 ms)
[ RUN      ] Parameters/TestRpc.TestCallWithPasswordProtectedKey/SSL_UnixSocket
I20260928 19:28:00.323176  1617 acceptor_pool.cc:254] collecting diagnostics on the listening RPC socket unix:/tmp/dist-test-taskTiND8b/test-tmp/rpc-test-fda643d06c0f447f9ecb321692290193.sock every 8 connection(s)
I20260928 19:28:00.323839  1618 acceptor_pool.cc:254] collecting diagnostics on the listening RPC socket unix:/tmp/dist-test-taskTiND8b/test-tmp/rpc-test-fda643d06c0f447f9ecb321692290193.sock every 8 connection(s)
W20260928 19:28:00.363130  1614 connection.cc:196] Error closing socket: Network error: TlsSocket::Close: Broken pipe
[       OK ] Parameters/TestRpc.TestCallWithPasswordProtectedKey/SSL_UnixSocket (65 ms)
[ RUN      ] Parameters/TestRpc.TestCallToBadServer/SSL_UnixSocket
I20260928 19:28:00.386543  1554 rpc-test.cc:394] Status: Network error: Client connection negotiation failed: client connection to 0.0.0.0:0: connect: Connection refused (error 111)
I20260928 19:28:00.387746  1554 rpc-test.cc:394] Status: Network error: Client connection negotiation failed: client connection to 0.0.0.0:0: connect: Connection refused (error 111)
I20260928 19:28:00.388895  1554 rpc-test.cc:394] Status: Network error: Client connection negotiation failed: client connection to 0.0.0.0:0: connect: Connection refused (error 111)
I20260928 19:28:00.390048  1554 rpc-test.cc:394] Status: Network error: Client connection negotiation failed: client connection to 0.0.0.0:0: connect: Connection refused (error 111)
I20260928 19:28:00.391160  1554 rpc-test.cc:394] Status: Network error: Client connection negotiation failed: client connection to 0.0.0.0:0: connect: Connection refused (error 111)
[       OK ] Parameters/TestRpc.TestCallToBadServer/SSL_UnixSocket (25 ms)
[ RUN      ] Parameters/TestRpc.TestWrongService/SSL_UnixSocket
I20260928 19:28:00.413666  1652 acceptor_pool.cc:254] collecting diagnostics on the listening RPC socket unix:/tmp/dist-test-taskTiND8b/test-tmp/rpc-test-95cd05cfbf1b4001a03b2f9ac4a51eb9.sock every 8 connection(s)
I20260928 19:28:00.414450  1653 acceptor_pool.cc:254] collecting diagnostics on the listening RPC socket unix:/tmp/dist-test-taskTiND8b/test-tmp/rpc-test-95cd05cfbf1b4001a03b2f9ac4a51eb9.sock every 8 connection(s)
I20260928 19:28:00.438755  1649 messenger.cc:345] service WrongServiceName not registered on TestServer
[       OK ] Parameters/TestRpc.TestWrongService/SSL_UnixSocket (51 ms)
[ RUN      ] Parameters/TestRpc.TestConnectionKeepalive/SSL_UnixSocket
I20260928 19:28:00.469781  1675 acceptor_pool.cc:254] collecting diagnostics on the listening RPC socket unix:/tmp/dist-test-taskTiND8b/test-tmp/rpc-test-a6cd570da6fd4e46b91d466565b04915.sock every 8 connection(s)
I20260928 19:28:00.470471  1676 acceptor_pool.cc:254] collecting diagnostics on the listening RPC socket unix:/tmp/dist-test-taskTiND8b/test-tmp/rpc-test-a6cd570da6fd4e46b91d466565b04915.sock every 8 connection(s)
I20260928 19:28:00.473412  1554 rpc-test.cc:488] Connecting to unix:/tmp/dist-test-taskTiND8b/test-tmp/rpc-test-a6cd570da6fd4e46b91d466565b04915.sock
W20260928 19:28:00.948722  1688 connection.cc:196] Error closing socket: Network error: TlsSocket::Close: Broken pipe
[       OK ] Parameters/TestRpc.TestConnectionKeepalive/SSL_UnixSocket (1073 ms)
[ RUN      ] Parameters/TestRpc.TestClientConnectionMetrics/SSL_UnixSocket
I20260928 19:28:01.569240  1700 acceptor_pool.cc:254] collecting diagnostics on the listening RPC socket unix:/tmp/dist-test-taskTiND8b/test-tmp/rpc-test-89bb7da62883419ea5588ea1c7c0a940.sock every 8 connection(s)
I20260928 19:28:01.569998  1701 acceptor_pool.cc:254] collecting diagnostics on the listening RPC socket unix:/tmp/dist-test-taskTiND8b/test-tmp/rpc-test-89bb7da62883419ea5588ea1c7c0a940.sock every 8 connection(s)
I20260928 19:28:01.573071  1554 rpc-test.cc:569] Connecting to unix:/tmp/dist-test-taskTiND8b/test-tmp/rpc-test-89bb7da62883419ea5588ea1c7c0a940.sock
W20260928 19:30:08.348018  1697 connection.cc:196] Error closing socket: Network error: TlsSocket::Close: Broken pipe
[       OK ] Parameters/TestRpc.TestClientConnectionMetrics/SSL_UnixSocket (126836 ms)
[ RUN      ] Parameters/TestRpc.TestCredentialsPolicy/SSL_UnixSocket
I20260928 19:30:08.398854  1735 acceptor_pool.cc:254] collecting diagnostics on the listening RPC socket unix:/tmp/dist-test-taskTiND8b/test-tmp/rpc-test-2adfb7cf444e4d9e941f131ff07b7be2.sock every 8 connection(s)
I20260928 19:30:08.399668  1736 acceptor_pool.cc:254] collecting diagnostics on the listening RPC socket unix:/tmp/dist-test-taskTiND8b/test-tmp/rpc-test-2adfb7cf444e4d9e941f131ff07b7be2.sock every 8 connection(s)
I20260928 19:30:08.402773  1554 rpc-test.cc:700] Connecting to unix:/tmp/dist-test-taskTiND8b/test-tmp/rpc-test-2adfb7cf444e4d9e941f131ff07b7be2.sock
W20260928 19:30:08.438094  1734 connection.cc:196] Error closing socket: Network error: TlsSocket::Close: Broken pipe
[       OK ] Parameters/TestRpc.TestCredentialsPolicy/SSL_UnixSocket (100 ms)
[ RUN      ] Parameters/TestRpc.TestCallLongerThanKeepalive/SSL_UnixSocket
I20260928 19:30:08.513563  1760 acceptor_pool.cc:254] collecting diagnostics on the listening RPC socket unix:/tmp/dist-test-taskTiND8b/test-tmp/rpc-test-38c54da9fd4841cca534dea53b96891b.sock every 8 connection(s)
I20260928 19:30:08.514274  1761 acceptor_pool.cc:254] collecting diagnostics on the listening RPC socket unix:/tmp/dist-test-taskTiND8b/test-tmp/rpc-test-38c54da9fd4841cca534dea53b96891b.sock every 8 connection(s)
I20260928 19:30:08.540009  1764 rpc-test-base.h:222] got call: sleep_micros: 3000000 deferred: true
I20260928 19:30:11.544260  1764 rpcz_store.cc:275] Call kudu.rpc.GenericCalculatorService.Sleep from unix:<unnamed> (request call id 0) took 3004 ms. Trace:
I20260928 19:30:11.544663  1764 rpcz_store.cc:276] 0928 19:30:08.539870 (+     0us) service_pool.cc:170] Inserting onto call queue
0928 19:30:08.539956 (+    86us) service_pool.cc:227] Handling call
0928 19:30:11.544091 (+3004135us) inbound_call.cc:173] Queueing success response
Metrics: {}
W20260928 19:30:11.549530  1757 connection.cc:196] Error closing socket: Network error: TlsSocket::Close: Broken pipe
[       OK ] Parameters/TestRpc.TestCallLongerThanKeepalive/SSL_UnixSocket (3099 ms)
[ RUN      ] Parameters/TestRpc.TestRpcSidecar/SSL_UnixSocket
I20260928 19:30:11.615031  1786 acceptor_pool.cc:254] collecting diagnostics on the listening RPC socket unix:/tmp/dist-test-taskTiND8b/test-tmp/rpc-test-66dec3b3f3264455bc0ffe053b8b04b2.sock every 8 connection(s)
I20260928 19:30:11.615846  1787 acceptor_pool.cc:254] collecting diagnostics on the listening RPC socket unix:/tmp/dist-test-taskTiND8b/test-tmp/rpc-test-66dec3b3f3264455bc0ffe053b8b04b2.sock every 8 connection(s)
W20260928 19:30:12.098093  1783 connection.cc:196] Error closing socket: Network error: TlsSocket::Close: Broken pipe
[       OK ] Parameters/TestRpc.TestRpcSidecar/SSL_UnixSocket (546 ms)
[ RUN      ] Parameters/TestRpc.TestRpcSidecarLimits/SSL_UnixSocket
I20260928 19:30:27.815711  1812 acceptor_pool.cc:254] collecting diagnostics on the listening RPC socket unix:/tmp/dist-test-taskTiND8b/test-tmp/rpc-test-a46beec51b7e4275895ef807a8d9ff64.sock every 8 connection(s)
I20260928 19:30:27.816562  1813 acceptor_pool.cc:254] collecting diagnostics on the listening RPC socket unix:/tmp/dist-test-taskTiND8b/test-tmp/rpc-test-a46beec51b7e4275895ef807a8d9ff64.sock every 8 connection(s)
W20260928 19:30:27.852548  1554 serialization.cc:72] Serialized kudu.rpc_test.PushStringsRequestPB (2147483654 bytes) is larger than the maximum configured RPC message size (52428800 bytes). Sending anyway, but peer may reject the data.
W20260928 19:30:27.863044  1809 connection.cc:535] server connection from unix:<unnamed> recv error: Network error: RPC frame had a length of 2147483714, but we only support messages up to 52428800 bytes long.
W20260928 19:30:27.863364  1809 connection.cc:158] shutting down server connection from unix:<unnamed> with pending inbound data: 4/2147483714 bytes received; last active 0 ns ago: status Network error: RPC frame had a length of 2147483714, but we only support messages up to 52428800 bytes long.
W20260928 19:30:27.864053  1825 connection.cc:698] client connection to unix:/tmp/dist-test-taskTiND8b/test-tmp/rpc-test-a46beec51b7e4275895ef807a8d9ff64.sock send error: Network error: failed to write to TLS socket: Broken pipe
W20260928 19:30:27.864557  1825 connection.cc:196] Error closing socket: Network error: TlsSocket::Close: Success
[       OK ] Parameters/TestRpc.TestRpcSidecarLimits/SSL_UnixSocket (16468 ms)
[ RUN      ] Parameters/TestRpc.TestCallTimeoutDoesntAffectNegotiation/SSL_UnixSocket
I20260928 19:30:28.591720  1837 acceptor_pool.cc:254] collecting diagnostics on the listening RPC socket unix:/tmp/dist-test-taskTiND8b/test-tmp/rpc-test-67a854c6506f4316a36c1e4d90cddd38.sock every 8 connection(s)
I20260928 19:30:28.592414  1838 acceptor_pool.cc:254] collecting diagnostics on the listening RPC socket unix:/tmp/dist-test-taskTiND8b/test-tmp/rpc-test-67a854c6506f4316a36c1e4d90cddd38.sock every 8 connection(s)
W20260928 19:30:28.614899  1833 negotiation.cc:266] Injecting 500ms delay in negotiation
I20260928 19:30:28.665011  1554 rpc-test-base.h:595] status: Timed out: connection negotiation to unix:/tmp/dist-test-taskTiND8b/test-tmp/rpc-test-67a854c6506f4316a36c1e4d90cddd38.sock for RPC Sleep timed out after 0.050s (ON_OUTBOUND_QUEUE), seconds elapsed: 0.0509933
W20260928 19:30:29.126961  1834 connection.cc:196] Error closing socket: Network error: TlsSocket::Close: Broken pipe
[       OK ] Parameters/TestRpc.TestCallTimeoutDoesntAffectNegotiation/SSL_UnixSocket (559 ms)
[ RUN      ] Parameters/TestRpc.TestRpcHandlerLatencyMetric/SSL_UnixSocket
I20260928 19:30:29.160398  1862 acceptor_pool.cc:254] collecting diagnostics on the listening RPC socket unix:/tmp/dist-test-taskTiND8b/test-tmp/rpc-test-c573424c1efd4a17994374f60b1bf50b.sock every 8 connection(s)
I20260928 19:30:29.161093  1863 acceptor_pool.cc:254] collecting diagnostics on the listening RPC socket unix:/tmp/dist-test-taskTiND8b/test-tmp/rpc-test-c573424c1efd4a17994374f60b1bf50b.sock every 8 connection(s)
I20260928 19:30:29.221784  1554 rpc-test.cc:1236] Sleep() min lat: 21512
I20260928 19:30:29.221979  1554 rpc-test.cc:1237] Sleep() mean lat: 21512
I20260928 19:30:29.222157  1554 rpc-test.cc:1238] Sleep() max lat: 21512
I20260928 19:30:29.222293  1554 rpc-test.cc:1239] Sleep() #calls: 1
W20260928 19:30:29.224861  1859 connection.cc:196] Error closing socket: Network error: TlsSocket::Close: Broken pipe
[       OK ] Parameters/TestRpc.TestRpcHandlerLatencyMetric/SSL_UnixSocket (98 ms)
[ RUN      ] Parameters/TestRpc.TimedOutOnResponseMetricServiceQueue/SSL_UnixSocket
I20260928 19:30:29.249245  1888 acceptor_pool.cc:254] collecting diagnostics on the listening RPC socket unix:/tmp/dist-test-taskTiND8b/test-tmp/rpc-test-685c94532c4d4d53838022136fb8f1dd.sock every 8 connection(s)
I20260928 19:30:29.249903  1889 acceptor_pool.cc:254] collecting diagnostics on the listening RPC socket unix:/tmp/dist-test-taskTiND8b/test-tmp/rpc-test-685c94532c4d4d53838022136fb8f1dd.sock every 8 connection(s)
W20260928 19:30:29.320115  1890 rpcz_store.cc:267] Call kudu.rpc_test.CalculatorService.Sleep from unix:<unnamed> (request call id 2) took 20 ms (client timeout 20 ms). Trace:
W20260928 19:30:29.320387  1890 rpcz_store.cc:269] 0928 19:30:29.299666 (+     0us) service_pool.cc:170] Inserting onto call queue
0928 19:30:29.319985 (+ 20319us) service_pool.cc:214] Skipping call since client already timed out
0928 19:30:29.320071 (+    86us) inbound_call.cc:173] Queueing failure response
Metrics: {}
[       OK ] Parameters/TestRpc.TimedOutOnResponseMetricServiceQueue/SSL_UnixSocket (97 ms)
[ RUN      ] Parameters/TestRpc.RpcPendingConnectionsMetric/SSL_UnixSocket
I20260928 19:30:29.336074  1911 acceptor_pool.cc:254] collecting diagnostics on the listening RPC socket 0.0.0.0:33395 every 8 connection(s)
I20260928 19:30:29.336781  1912 acceptor_pool.cc:254] collecting diagnostics on the listening RPC socket 0.0.0.0:33395 every 8 connection(s)
W20260928 19:30:29.349767  1907 negotiation.cc:337] Failed RPC negotiation. Trace:
0928 19:30:29.348151 (+     0us) reactor.cc:625] Submitting negotiation task for server connection from 127.0.0.1:44886 (local address 127.0.0.1:33395)
0928 19:30:29.348720 (+   569us) server_negotiation.cc:206] Beginning negotiation
0928 19:30:29.348745 (+    25us) server_negotiation.cc:399] Waiting for connection header
0928 19:30:29.349032 (+   287us) negotiation.cc:327] Negotiation complete: Network error: Server connection negotiation failed: server connection from 127.0.0.1:44886: BlockingRecv error: recv got EOF from 127.0.0.1:44886 (error 108)
Metrics: {"server-negotiator.queue_time_us":116}
[       OK ] Parameters/TestRpc.RpcPendingConnectionsMetric/SSL_UnixSocket (35 ms)
[ RUN      ] Parameters/TestRpc.TestRpcContextClientDeadline/SSL_UnixSocket
I20260928 19:30:29.389046  1927 acceptor_pool.cc:254] collecting diagnostics on the listening RPC socket unix:/tmp/dist-test-taskTiND8b/test-tmp/rpc-test-32ffd6f2eadb49c7adabcf09edce1ed0.sock every 8 connection(s)
I20260928 19:30:29.389716  1928 acceptor_pool.cc:254] collecting diagnostics on the listening RPC socket unix:/tmp/dist-test-taskTiND8b/test-tmp/rpc-test-32ffd6f2eadb49c7adabcf09edce1ed0.sock every 8 connection(s)
W20260928 19:30:29.449815  1924 connection.cc:196] Error closing socket: Network error: TlsSocket::Close: Broken pipe
[       OK ] Parameters/TestRpc.TestRpcContextClientDeadline/SSL_UnixSocket (92 ms)
[ RUN      ] Parameters/TestRpc.TestApplicationFeatureFlagUnsupportedServer/SSL_UnixSocket
I20260928 19:30:29.474390  1952 acceptor_pool.cc:254] collecting diagnostics on the listening RPC socket unix:/tmp/dist-test-taskTiND8b/test-tmp/rpc-test-98b84a119d4b4ae4930962885541a42b.sock every 8 connection(s)
I20260928 19:30:29.475051  1953 acceptor_pool.cc:254] collecting diagnostics on the listening RPC socket unix:/tmp/dist-test-taskTiND8b/test-tmp/rpc-test-98b84a119d4b4ae4930962885541a42b.sock every 8 connection(s)
W20260928 19:30:29.522482  1949 connection.cc:196] Error closing socket: Network error: TlsSocket::Close: Broken pipe
[       OK ] Parameters/TestRpc.TestApplicationFeatureFlagUnsupportedServer/SSL_UnixSocket (73 ms)
[ RUN      ] Parameters/TestRpc.TestCancellationAsync/SSL_UnixSocket
I20260928 19:30:29.550928  1978 acceptor_pool.cc:254] collecting diagnostics on the listening RPC socket unix:/tmp/dist-test-taskTiND8b/test-tmp/rpc-test-316ccf2002ec4581bcea764280d860f2.sock every 8 connection(s)
I20260928 19:30:29.551887  1979 acceptor_pool.cc:254] collecting diagnostics on the listening RPC socket unix:/tmp/dist-test-taskTiND8b/test-tmp/rpc-test-316ccf2002ec4581bcea764280d860f2.sock every 8 connection(s)
I20260928 19:30:29.554896  1554 rpc-test.cc:1716] Connecting to unix:/tmp/dist-test-taskTiND8b/test-tmp/rpc-test-316ccf2002ec4581bcea764280d860f2.sock
I20260928 19:30:29.574023  1554 test_util.cc:268] Using random seed: 424264050
I20260928 19:30:29.789352  1982 rpc-test-base.h:240] got call: sleep_micros: 500 pattern: 4294967295 num_repetitions: 2097152 sidecar_idx: 0
I20260928 19:30:30.001915  1981 rpc-test-base.h:240] got call: sleep_micros: 500 pattern: 4294967295 num_repetitions: 2097152 sidecar_idx: 0
I20260928 19:30:30.192961  1982 rpc-test-base.h:240] got call: sleep_micros: 500 pattern: 4294967295 num_repetitions: 2097152 sidecar_idx: 0
I20260928 19:30:30.365794  1981 rpc-test-base.h:240] got call: sleep_micros: 500 pattern: 4294967295 num_repetitions: 2097152 sidecar_idx: 0
I20260928 19:30:30.563903  1982 rpc-test-base.h:240] got call: sleep_micros: 500 pattern: 4294967295 num_repetitions: 2097152 sidecar_idx: 0
I20260928 19:30:30.779192  1982 rpc-test-base.h:240] got call: sleep_micros: 500 pattern: 4294967295 num_repetitions: 2097152 sidecar_idx: 0
I20260928 19:30:30.951675  1981 rpc-test-base.h:240] got call: sleep_micros: 500 pattern: 4294967295 num_repetitions: 2097152 sidecar_idx: 0
I20260928 19:30:31.170111  1982 rpc-test-base.h:240] got call: sleep_micros: 500 pattern: 4294967295 num_repetitions: 2097152 sidecar_idx: 0
I20260928 19:30:31.375918  1982 rpc-test-base.h:240] got call: sleep_micros: 500 pattern: 4294967295 num_repetitions: 2097152 sidecar_idx: 0
W20260928 19:30:31.390079  1975 connection.cc:196] Error closing socket: Network error: TlsSocket::Close: Broken pipe
W20260928 19:30:31.512857  1975 connection.cc:441] server connection from unix:<unnamed> torn down before Call kudu.rpc.GenericCalculatorService.SleepWithSidecar from unix:<unnamed> (request call id 9) could send its response
[       OK ] Parameters/TestRpc.TestCancellationAsync/SSL_UnixSocket (1993 ms)
[ RUN      ] Parameters/TestRpc.TestPerformanceBySocketType/SSL_UnixSocket
I20260928 19:30:31.606061  2003 acceptor_pool.cc:254] collecting diagnostics on the listening RPC socket unix:/tmp/dist-test-taskTiND8b/test-tmp/rpc-test-e3dc2323db7e43cb80b63101a551b15e.sock every 8 connection(s)
I20260928 19:30:31.606745  2004 acceptor_pool.cc:254] collecting diagnostics on the listening RPC socket unix:/tmp/dist-test-taskTiND8b/test-tmp/rpc-test-e3dc2323db7e43cb80b63101a551b15e.sock every 8 connection(s)
I20260928 19:30:31.609833  1554 rpc-test.cc:1846] Connecting to unix:/tmp/dist-test-taskTiND8b/test-tmp/rpc-test-e3dc2323db7e43cb80b63101a551b15e.sock
I20260928 19:30:51.616474  1554 rpc-test.cc:1859] Sending 1024MB via ssl-enabled unix socket: real 19.990s	user 18.252s	sys 11.536s
I20260928 19:31:12.073309  1554 rpc-test.cc:1859] Sending 1024MB via ssl-enabled unix socket: real 20.456s	user 18.662s	sys 11.980s
I20260928 19:31:32.206938  1554 rpc-test.cc:1859] Sending 1024MB via ssl-enabled unix socket: real 20.133s	user 18.252s	sys 11.809s
I20260928 19:31:51.961517  1554 rpc-test.cc:1859] Sending 1024MB via ssl-enabled unix socket: real 19.754s	user 17.934s	sys 11.396s
I20260928 19:32:11.779959  1554 rpc-test.cc:1859] Sending 1024MB via ssl-enabled unix socket: real 19.818s	user 17.461s	sys 12.046s
W20260928 19:32:11.784876  2000 connection.cc:196] Error closing socket: Network error: TlsSocket::Close: Broken pipe
[       OK ] Parameters/TestRpc.TestPerformanceBySocketType/SSL_UnixSocket (100273 ms)
[----------] 20 tests from Parameters/TestRpc (252734 ms total)

[----------] 1 test from Parameters/TestRpcSocketTxRxQueue
[ RUN      ] Parameters/TestRpcSocketTxRxQueue.AcceptorRxQueueSizeMetric/0
I20260928 19:32:11.812928  2038 acceptor_pool.cc:254] collecting diagnostics on the listening RPC socket 0.0.0.0:33013 every 1 connection(s)
I20260928 19:32:11.813786  2039 acceptor_pool.cc:254] collecting diagnostics on the listening RPC socket 0.0.0.0:33013 every 1 connection(s)
W20260928 19:32:11.818620  2034 negotiation.cc:337] Failed RPC negotiation. Trace:
0928 19:32:11.817362 (+     0us) reactor.cc:625] Submitting negotiation task for server connection from 127.0.0.1:46446 (local address 127.0.0.1:33013)
0928 19:32:11.817799 (+   437us) server_negotiation.cc:206] Beginning negotiation
0928 19:32:11.817830 (+    31us) server_negotiation.cc:399] Waiting for connection header
0928 19:32:11.818042 (+   212us) negotiation.cc:327] Negotiation complete: Network error: Server connection negotiation failed: server connection from 127.0.0.1:46446: BlockingRecv error: recv got EOF from 127.0.0.1:46446 (error 108)
Metrics: {"server-negotiator.queue_time_us":106}
[       OK ] Parameters/TestRpcSocketTxRxQueue.AcceptorRxQueueSizeMetric/0 (29 ms)
[----------] 1 test from Parameters/TestRpcSocketTxRxQueue (29 ms total)

[----------] Global test environment tear-down
[==========] 21 tests from 2 test suites ran. (252764 ms total)
[  PASSED  ] 20 tests.
[  FAILED  ] 1 test, listed below:
[  FAILED  ] Parameters/TestRpc.TestCallWithChainCertAndChainCA/SSL_UnixSocket, where GetParam() = (true, true)

 1 FAILED TEST