Diagnosed failure
Parameters/TestRpc.TestCallWithChainCertAndChainCA/SSL_UnixSocket: /data0/somelongdirectorytoavoidrpathissues/src/kudu/src/kudu/rpc/rpc-test.cc:270: Failure
Failed
Bad status: Runtime error: could not verify certificate chain (error with cert: subject=CN = localhost, ST = sadfjas, C = AS, emailAddress = sdflkdsajf, O = lskdfjlsad, OU = sldfkja, issuer=C = AS, ST = ASDfkjdhf, L = lskdjf, O = saldfja, OU = skdjf, CN = localhost, emailAddress = sadjflkadsj): : certificate has expired
Google Test trace:
/data0/somelongdirectorytoavoidrpathissues/src/kudu/src/kudu/rpc/rpc-test.cc:267: Connecting to unix:/tmp/dist-test-taskH7TghI/test-tmp/rpc-test-33c407ffd8f44806a59d82dc91caa2e8.sock
I20260929 21:42:22.648118 390 test_util.cc:175] -----------------------------------------------
I20260929 21:42:22.648310 390 test_util.cc:176] Had fatal failures, leaving test files at /tmp/dist-test-taskH7TghI/test-tmp/rpc-test.6.Parameters_TestRpc.TestCallWithChainCertAndChainCA_SSL_UnixSocket.1790718141336681-390-0
Full log
Note: This is test shard 7 of 8.
[==========] Running 21 tests from 2 test suites.
[----------] Global test environment set-up.
[----------] 20 tests from Parameters/TestRpc
[ RUN ] Parameters/TestRpc.TestMessengerCreateDestroy/SSL_UnixSocket
WARNING: Logging before InitGoogleLogging() is written to STDERR
I20260929 21:42:21.433250 390 rpc-test.cc:169] started messenger TestCreateDestroy
[ OK ] Parameters/TestRpc.TestMessengerCreateDestroy/SSL_UnixSocket (1105 ms)
[ RUN ] Parameters/TestRpc.TestNegotiationDeadlock/SSL_UnixSocket
I20260929 21:42:22.522370 412 acceptor_pool.cc:254] collecting diagnostics on the listening RPC socket unix:/tmp/dist-test-taskH7TghI/test-tmp/rpc-test-eb40dd4d0ab342a8a5600ae6f8bc480c.sock every 8 connection(s)
I20260929 21:42:22.524282 413 acceptor_pool.cc:254] collecting diagnostics on the listening RPC socket unix:/tmp/dist-test-taskH7TghI/test-tmp/rpc-test-eb40dd4d0ab342a8a5600ae6f8bc480c.sock every 8 connection(s)
[ OK ] Parameters/TestRpc.TestNegotiationDeadlock/SSL_UnixSocket (90 ms)
[ RUN ] Parameters/TestRpc.TestCallWithChainCertAndChainCA/SSL_UnixSocket
I20260929 21:42:22.614563 428 acceptor_pool.cc:254] collecting diagnostics on the listening RPC socket unix:/tmp/dist-test-taskH7TghI/test-tmp/rpc-test-33c407ffd8f44806a59d82dc91caa2e8.sock every 8 connection(s)
I20260929 21:42:22.617249 429 acceptor_pool.cc:254] collecting diagnostics on the listening RPC socket unix:/tmp/dist-test-taskH7TghI/test-tmp/rpc-test-33c407ffd8f44806a59d82dc91caa2e8.sock every 8 connection(s)
/data0/somelongdirectorytoavoidrpathissues/src/kudu/src/kudu/rpc/rpc-test.cc:270: Failure
Failed
Bad status: Runtime error: could not verify certificate chain (error with cert: subject=CN = localhost, ST = sadfjas, C = AS, emailAddress = sdflkdsajf, O = lskdfjlsad, OU = sldfkja, issuer=C = AS, ST = ASDfkjdhf, L = lskdjf, O = saldfja, OU = skdjf, CN = localhost, emailAddress = sadjflkadsj): : certificate has expired
Google Test trace:
/data0/somelongdirectorytoavoidrpathissues/src/kudu/src/kudu/rpc/rpc-test.cc:267: Connecting to unix:/tmp/dist-test-taskH7TghI/test-tmp/rpc-test-33c407ffd8f44806a59d82dc91caa2e8.sock
I20260929 21:42:22.648118 390 test_util.cc:175] -----------------------------------------------
I20260929 21:42:22.648310 390 test_util.cc:176] Had fatal failures, leaving test files at /tmp/dist-test-taskH7TghI/test-tmp/rpc-test.6.Parameters_TestRpc.TestCallWithChainCertAndChainCA_SSL_UnixSocket.1790718141336681-390-0
[ FAILED ] Parameters/TestRpc.TestCallWithChainCertAndChainCA/SSL_UnixSocket, where GetParam() = (true, true) (63 ms)
[ RUN ] Parameters/TestRpc.TestCallWithPasswordProtectedKey/SSL_UnixSocket
I20260929 21:42:22.669140 453 acceptor_pool.cc:254] collecting diagnostics on the listening RPC socket unix:/tmp/dist-test-taskH7TghI/test-tmp/rpc-test-8905828baeb24e64b99301b2848aadf2.sock every 8 connection(s)
I20260929 21:42:22.669862 454 acceptor_pool.cc:254] collecting diagnostics on the listening RPC socket unix:/tmp/dist-test-taskH7TghI/test-tmp/rpc-test-8905828baeb24e64b99301b2848aadf2.sock every 8 connection(s)
[ OK ] Parameters/TestRpc.TestCallWithPasswordProtectedKey/SSL_UnixSocket (73 ms)
[ RUN ] Parameters/TestRpc.TestCallToBadServer/SSL_UnixSocket
I20260929 21:42:22.748157 390 rpc-test.cc:394] Status: Network error: Client connection negotiation failed: client connection to 0.0.0.0:0: connect: Connection refused (error 111)
I20260929 21:42:22.749655 390 rpc-test.cc:394] Status: Network error: Client connection negotiation failed: client connection to 0.0.0.0:0: connect: Connection refused (error 111)
I20260929 21:42:22.751179 390 rpc-test.cc:394] Status: Network error: Client connection negotiation failed: client connection to 0.0.0.0:0: connect: Connection refused (error 111)
I20260929 21:42:22.752897 390 rpc-test.cc:394] Status: Network error: Client connection negotiation failed: client connection to 0.0.0.0:0: connect: Connection refused (error 111)
I20260929 21:42:22.754699 390 rpc-test.cc:394] Status: Network error: Client connection negotiation failed: client connection to 0.0.0.0:0: connect: Connection refused (error 111)
[ OK ] Parameters/TestRpc.TestCallToBadServer/SSL_UnixSocket (35 ms)
[ RUN ] Parameters/TestRpc.TestWrongService/SSL_UnixSocket
I20260929 21:42:22.781704 488 acceptor_pool.cc:254] collecting diagnostics on the listening RPC socket unix:/tmp/dist-test-taskH7TghI/test-tmp/rpc-test-be2586d52afb4371b5280bb1779f3bbc.sock every 8 connection(s)
I20260929 21:42:22.782401 489 acceptor_pool.cc:254] collecting diagnostics on the listening RPC socket unix:/tmp/dist-test-taskH7TghI/test-tmp/rpc-test-be2586d52afb4371b5280bb1779f3bbc.sock every 8 connection(s)
I20260929 21:42:22.817425 485 messenger.cc:345] service WrongServiceName not registered on TestServer
[ OK ] Parameters/TestRpc.TestWrongService/SSL_UnixSocket (68 ms)
[ RUN ] Parameters/TestRpc.TestConnectionKeepalive/SSL_UnixSocket
I20260929 21:42:22.853127 511 acceptor_pool.cc:254] collecting diagnostics on the listening RPC socket unix:/tmp/dist-test-taskH7TghI/test-tmp/rpc-test-f2f9a97fe1924999b314ee7fb928a8bd.sock every 8 connection(s)
I20260929 21:42:22.853826 512 acceptor_pool.cc:254] collecting diagnostics on the listening RPC socket unix:/tmp/dist-test-taskH7TghI/test-tmp/rpc-test-f2f9a97fe1924999b314ee7fb928a8bd.sock every 8 connection(s)
I20260929 21:42:22.858388 390 rpc-test.cc:488] Connecting to unix:/tmp/dist-test-taskH7TghI/test-tmp/rpc-test-f2f9a97fe1924999b314ee7fb928a8bd.sock
W20260929 21:42:23.329387 524 connection.cc:196] Error closing socket: Network error: TlsSocket::Close: Broken pipe
[ OK ] Parameters/TestRpc.TestConnectionKeepalive/SSL_UnixSocket (1076 ms)
[ RUN ] Parameters/TestRpc.TestClientConnectionMetrics/SSL_UnixSocket
I20260929 21:42:23.938563 536 acceptor_pool.cc:254] collecting diagnostics on the listening RPC socket unix:/tmp/dist-test-taskH7TghI/test-tmp/rpc-test-9fbb245a181e427f9af68b4991c07956.sock every 8 connection(s)
I20260929 21:42:23.939318 537 acceptor_pool.cc:254] collecting diagnostics on the listening RPC socket unix:/tmp/dist-test-taskH7TghI/test-tmp/rpc-test-9fbb245a181e427f9af68b4991c07956.sock every 8 connection(s)
I20260929 21:42:23.943315 390 rpc-test.cc:569] Connecting to unix:/tmp/dist-test-taskH7TghI/test-tmp/rpc-test-9fbb245a181e427f9af68b4991c07956.sock
W20260929 21:44:44.691453 533 connection.cc:196] Error closing socket: Network error: TlsSocket::Close: Broken pipe
[ OK ] Parameters/TestRpc.TestClientConnectionMetrics/SSL_UnixSocket (140797 ms)
[ RUN ] Parameters/TestRpc.TestCredentialsPolicy/SSL_UnixSocket
I20260929 21:44:44.730604 573 acceptor_pool.cc:254] collecting diagnostics on the listening RPC socket unix:/tmp/dist-test-taskH7TghI/test-tmp/rpc-test-0f182d6ed48c4dba90981aa60b0303b7.sock every 8 connection(s)
I20260929 21:44:44.731451 574 acceptor_pool.cc:254] collecting diagnostics on the listening RPC socket unix:/tmp/dist-test-taskH7TghI/test-tmp/rpc-test-0f182d6ed48c4dba90981aa60b0303b7.sock every 8 connection(s)
I20260929 21:44:44.734651 390 rpc-test.cc:700] Connecting to unix:/tmp/dist-test-taskH7TghI/test-tmp/rpc-test-0f182d6ed48c4dba90981aa60b0303b7.sock
W20260929 21:44:44.778337 572 connection.cc:196] Error closing socket: Network error: TlsSocket::Close: Broken pipe
W20260929 21:44:44.794229 572 connection.cc:196] Error closing socket: Network error: TlsSocket::Close: Broken pipe
[ OK ] Parameters/TestRpc.TestCredentialsPolicy/SSL_UnixSocket (100 ms)
[ RUN ] Parameters/TestRpc.TestCallLongerThanKeepalive/SSL_UnixSocket
I20260929 21:44:44.826083 598 acceptor_pool.cc:254] collecting diagnostics on the listening RPC socket unix:/tmp/dist-test-taskH7TghI/test-tmp/rpc-test-6a4a0d014a7a4636a03c5313ec07fdb9.sock every 8 connection(s)
I20260929 21:44:44.826743 599 acceptor_pool.cc:254] collecting diagnostics on the listening RPC socket unix:/tmp/dist-test-taskH7TghI/test-tmp/rpc-test-6a4a0d014a7a4636a03c5313ec07fdb9.sock every 8 connection(s)
I20260929 21:44:44.864552 602 rpc-test-base.h:222] got call: sleep_micros: 3000000 deferred: true
I20260929 21:44:47.869369 602 rpcz_store.cc:275] Call kudu.rpc.GenericCalculatorService.Sleep from unix:<unnamed> (request call id 0) took 3005 ms. Trace:
I20260929 21:44:47.869671 602 rpcz_store.cc:276] 0929 21:44:44.864300 (+ 0us) service_pool.cc:170] Inserting onto call queue
0929 21:44:44.864481 (+ 181us) service_pool.cc:227] Handling call
0929 21:44:47.869317 (+3004836us) inbound_call.cc:173] Queueing success response
Metrics: {}
W20260929 21:44:47.874289 595 connection.cc:196] Error closing socket: Network error: TlsSocket::Close: Broken pipe
[ OK ] Parameters/TestRpc.TestCallLongerThanKeepalive/SSL_UnixSocket (3079 ms)
[ RUN ] Parameters/TestRpc.TestRpcSidecar/SSL_UnixSocket
I20260929 21:44:47.904845 623 acceptor_pool.cc:254] collecting diagnostics on the listening RPC socket unix:/tmp/dist-test-taskH7TghI/test-tmp/rpc-test-da69cb76cacd48b687a22a5277426fbe.sock every 8 connection(s)
I20260929 21:44:47.905608 624 acceptor_pool.cc:254] collecting diagnostics on the listening RPC socket unix:/tmp/dist-test-taskH7TghI/test-tmp/rpc-test-da69cb76cacd48b687a22a5277426fbe.sock every 8 connection(s)
W20260929 21:44:48.445899 620 connection.cc:196] Error closing socket: Network error: TlsSocket::Close: Broken pipe
[ OK ] Parameters/TestRpc.TestRpcSidecar/SSL_UnixSocket (569 ms)
[ RUN ] Parameters/TestRpc.TestRpcSidecarLimits/SSL_UnixSocket
I20260929 21:45:05.323851 650 acceptor_pool.cc:254] collecting diagnostics on the listening RPC socket unix:/tmp/dist-test-taskH7TghI/test-tmp/rpc-test-6d590b91dc7c412d8cea2018bc98d761.sock every 8 connection(s)
I20260929 21:45:05.324728 651 acceptor_pool.cc:254] collecting diagnostics on the listening RPC socket unix:/tmp/dist-test-taskH7TghI/test-tmp/rpc-test-6d590b91dc7c412d8cea2018bc98d761.sock every 8 connection(s)
W20260929 21:45:05.372794 390 serialization.cc:72] Serialized kudu.rpc_test.PushStringsRequestPB (2147483654 bytes) is larger than the maximum configured RPC message size (52428800 bytes). Sending anyway, but peer may reject the data.
W20260929 21:45:05.384166 647 connection.cc:535] server connection from unix:<unnamed> recv error: Network error: RPC frame had a length of 2147483714, but we only support messages up to 52428800 bytes long.
W20260929 21:45:05.384487 647 connection.cc:158] shutting down server connection from unix:<unnamed> with pending inbound data: 4/2147483714 bytes received; last active 0 ns ago: status Network error: RPC frame had a length of 2147483714, but we only support messages up to 52428800 bytes long.
W20260929 21:45:05.385341 663 connection.cc:698] client connection to unix:/tmp/dist-test-taskH7TghI/test-tmp/rpc-test-6d590b91dc7c412d8cea2018bc98d761.sock send error: Network error: failed to write to TLS socket: Broken pipe
W20260929 21:45:05.385910 663 connection.cc:196] Error closing socket: Network error: TlsSocket::Close: Success
[ OK ] Parameters/TestRpc.TestRpcSidecarLimits/SSL_UnixSocket (17550 ms)
[ RUN ] Parameters/TestRpc.TestCallTimeoutDoesntAffectNegotiation/SSL_UnixSocket
I20260929 21:45:06.023752 675 acceptor_pool.cc:254] collecting diagnostics on the listening RPC socket unix:/tmp/dist-test-taskH7TghI/test-tmp/rpc-test-44ca39c679b04d23b9bc0a4146417c1d.sock every 8 connection(s)
I20260929 21:45:06.024642 676 acceptor_pool.cc:254] collecting diagnostics on the listening RPC socket unix:/tmp/dist-test-taskH7TghI/test-tmp/rpc-test-44ca39c679b04d23b9bc0a4146417c1d.sock every 8 connection(s)
W20260929 21:45:06.042704 671 negotiation.cc:266] Injecting 500ms delay in negotiation
I20260929 21:45:06.092093 390 rpc-test-base.h:595] status: Timed out: connection negotiation to unix:/tmp/dist-test-taskH7TghI/test-tmp/rpc-test-44ca39c679b04d23b9bc0a4146417c1d.sock for RPC Sleep timed out after 0.050s (ON_OUTBOUND_QUEUE), seconds elapsed: 0.0505692
W20260929 21:45:06.557255 672 connection.cc:196] Error closing socket: Network error: TlsSocket::Close: Broken pipe
[ OK ] Parameters/TestRpc.TestCallTimeoutDoesntAffectNegotiation/SSL_UnixSocket (559 ms)
[ RUN ] Parameters/TestRpc.TestRpcHandlerLatencyMetric/SSL_UnixSocket
I20260929 21:45:06.606884 700 acceptor_pool.cc:254] collecting diagnostics on the listening RPC socket unix:/tmp/dist-test-taskH7TghI/test-tmp/rpc-test-8d26e14f47c3402498fb87a3f21fa419.sock every 8 connection(s)
I20260929 21:45:06.607684 701 acceptor_pool.cc:254] collecting diagnostics on the listening RPC socket unix:/tmp/dist-test-taskH7TghI/test-tmp/rpc-test-8d26e14f47c3402498fb87a3f21fa419.sock every 8 connection(s)
I20260929 21:45:06.667440 390 rpc-test.cc:1236] Sleep() min lat: 21893
I20260929 21:45:06.667637 390 rpc-test.cc:1237] Sleep() mean lat: 21893
I20260929 21:45:06.667793 390 rpc-test.cc:1238] Sleep() max lat: 21893
I20260929 21:45:06.667949 390 rpc-test.cc:1239] Sleep() #calls: 1
[ OK ] Parameters/TestRpc.TestRpcHandlerLatencyMetric/SSL_UnixSocket (113 ms)
[ RUN ] Parameters/TestRpc.TimedOutOnResponseMetricServiceQueue/SSL_UnixSocket
I20260929 21:45:06.697763 726 acceptor_pool.cc:254] collecting diagnostics on the listening RPC socket unix:/tmp/dist-test-taskH7TghI/test-tmp/rpc-test-be448f5fab47441c9a66e45e371795e6.sock every 8 connection(s)
I20260929 21:45:06.698417 727 acceptor_pool.cc:254] collecting diagnostics on the listening RPC socket unix:/tmp/dist-test-taskH7TghI/test-tmp/rpc-test-be448f5fab47441c9a66e45e371795e6.sock every 8 connection(s)
W20260929 21:45:06.776928 728 rpcz_store.cc:267] Call kudu.rpc_test.CalculatorService.Sleep from unix:<unnamed> (request call id 2) took 21 ms (client timeout 20 ms). Trace:
W20260929 21:45:06.777556 728 rpcz_store.cc:269] 0929 21:45:06.755752 (+ 0us) service_pool.cc:170] Inserting onto call queue
0929 21:45:06.776783 (+ 21031us) service_pool.cc:214] Skipping call since client already timed out
0929 21:45:06.776877 (+ 94us) inbound_call.cc:173] Queueing failure response
Metrics: {}
[ OK ] Parameters/TestRpc.TimedOutOnResponseMetricServiceQueue/SSL_UnixSocket (110 ms)
[ RUN ] Parameters/TestRpc.RpcPendingConnectionsMetric/SSL_UnixSocket
I20260929 21:45:06.797196 749 acceptor_pool.cc:254] collecting diagnostics on the listening RPC socket 0.0.0.0:40679 every 8 connection(s)
I20260929 21:45:06.797987 750 acceptor_pool.cc:254] collecting diagnostics on the listening RPC socket 0.0.0.0:40679 every 8 connection(s)
W20260929 21:45:06.814292 745 negotiation.cc:337] Failed RPC negotiation. Trace:
0929 21:45:06.812142 (+ 0us) reactor.cc:625] Submitting negotiation task for server connection from 127.0.0.1:49394 (local address 127.0.0.1:40679)
0929 21:45:06.812773 (+ 631us) server_negotiation.cc:206] Beginning negotiation
0929 21:45:06.812800 (+ 27us) server_negotiation.cc:399] Waiting for connection header
0929 21:45:06.813331 (+ 531us) negotiation.cc:327] Negotiation complete: Network error: Server connection negotiation failed: server connection from 127.0.0.1:49394: BlockingRecv error: recv got EOF from 127.0.0.1:49394 (error 108)
Metrics: {"server-negotiator.queue_time_us":171}
[ OK ] Parameters/TestRpc.RpcPendingConnectionsMetric/SSL_UnixSocket (41 ms)
[ RUN ] Parameters/TestRpc.TestRpcContextClientDeadline/SSL_UnixSocket
I20260929 21:45:06.849973 765 acceptor_pool.cc:254] collecting diagnostics on the listening RPC socket unix:/tmp/dist-test-taskH7TghI/test-tmp/rpc-test-3759dea7948b43fa9894bd9236df6a17.sock every 8 connection(s)
I20260929 21:45:06.850590 766 acceptor_pool.cc:254] collecting diagnostics on the listening RPC socket unix:/tmp/dist-test-taskH7TghI/test-tmp/rpc-test-3759dea7948b43fa9894bd9236df6a17.sock every 8 connection(s)
W20260929 21:45:06.929993 762 connection.cc:196] Error closing socket: Network error: TlsSocket::Close: Broken pipe
[ OK ] Parameters/TestRpc.TestRpcContextClientDeadline/SSL_UnixSocket (107 ms)
[ RUN ] Parameters/TestRpc.TestApplicationFeatureFlagUnsupportedServer/SSL_UnixSocket
I20260929 21:45:06.959300 790 acceptor_pool.cc:254] collecting diagnostics on the listening RPC socket unix:/tmp/dist-test-taskH7TghI/test-tmp/rpc-test-8a15de8d01d04ffba5be0c82f8281407.sock every 8 connection(s)
I20260929 21:45:06.960634 791 acceptor_pool.cc:254] collecting diagnostics on the listening RPC socket unix:/tmp/dist-test-taskH7TghI/test-tmp/rpc-test-8a15de8d01d04ffba5be0c82f8281407.sock every 8 connection(s)
[ OK ] Parameters/TestRpc.TestApplicationFeatureFlagUnsupportedServer/SSL_UnixSocket (75 ms)
[ RUN ] Parameters/TestRpc.TestCancellationAsync/SSL_UnixSocket
I20260929 21:45:07.040405 815 acceptor_pool.cc:254] collecting diagnostics on the listening RPC socket unix:/tmp/dist-test-taskH7TghI/test-tmp/rpc-test-420b50a8ea664eed809f87de0f3a465c.sock every 8 connection(s)
I20260929 21:45:07.041013 816 acceptor_pool.cc:254] collecting diagnostics on the listening RPC socket unix:/tmp/dist-test-taskH7TghI/test-tmp/rpc-test-420b50a8ea664eed809f87de0f3a465c.sock every 8 connection(s)
I20260929 21:45:07.045161 390 rpc-test.cc:1716] Connecting to unix:/tmp/dist-test-taskH7TghI/test-tmp/rpc-test-420b50a8ea664eed809f87de0f3a465c.sock
I20260929 21:45:07.067339 390 test_util.cc:268] Using random seed: 412476852
I20260929 21:45:07.310766 819 rpc-test-base.h:240] got call: sleep_micros: 500 pattern: 4294967295 num_repetitions: 2097152 sidecar_idx: 0
I20260929 21:45:07.548269 819 rpc-test-base.h:240] got call: sleep_micros: 500 pattern: 4294967295 num_repetitions: 2097152 sidecar_idx: 0
I20260929 21:45:07.775655 819 rpc-test-base.h:240] got call: sleep_micros: 500 pattern: 4294967295 num_repetitions: 2097152 sidecar_idx: 0
I20260929 21:45:08.001175 819 rpc-test-base.h:240] got call: sleep_micros: 500 pattern: 4294967295 num_repetitions: 2097152 sidecar_idx: 0
I20260929 21:45:08.203949 818 rpc-test-base.h:240] got call: sleep_micros: 500 pattern: 4294967295 num_repetitions: 2097152 sidecar_idx: 0
I20260929 21:45:08.428447 818 rpc-test-base.h:240] got call: sleep_micros: 500 pattern: 4294967295 num_repetitions: 2097152 sidecar_idx: 0
I20260929 21:45:08.650873 818 rpc-test-base.h:240] got call: sleep_micros: 500 pattern: 4294967295 num_repetitions: 2097152 sidecar_idx: 0
I20260929 21:45:08.859081 818 rpc-test-base.h:240] got call: sleep_micros: 500 pattern: 4294967295 num_repetitions: 2097152 sidecar_idx: 0
I20260929 21:45:09.091078 818 rpc-test-base.h:240] got call: sleep_micros: 500 pattern: 4294967295 num_repetitions: 2097152 sidecar_idx: 0
W20260929 21:45:09.233322 812 connection.cc:441] server connection from unix:<unnamed> torn down before Call kudu.rpc.GenericCalculatorService.SleepWithSidecar from unix:<unnamed> (request call id 9) could send its response
[ OK ] Parameters/TestRpc.TestCancellationAsync/SSL_UnixSocket (2231 ms)
[ RUN ] Parameters/TestRpc.TestPerformanceBySocketType/SSL_UnixSocket
I20260929 21:45:09.330914 840 acceptor_pool.cc:254] collecting diagnostics on the listening RPC socket unix:/tmp/dist-test-taskH7TghI/test-tmp/rpc-test-6a79aaca7022414c824480904b1ae9e9.sock every 8 connection(s)
I20260929 21:45:09.331516 841 acceptor_pool.cc:254] collecting diagnostics on the listening RPC socket unix:/tmp/dist-test-taskH7TghI/test-tmp/rpc-test-6a79aaca7022414c824480904b1ae9e9.sock every 8 connection(s)
I20260929 21:45:09.334954 390 rpc-test.cc:1846] Connecting to unix:/tmp/dist-test-taskH7TghI/test-tmp/rpc-test-6a79aaca7022414c824480904b1ae9e9.sock
I20260929 21:45:32.275382 390 rpc-test.cc:1859] Sending 1024MB via ssl-enabled unix socket: real 22.922s user 20.990s sys 14.593s
I20260929 21:45:54.659817 390 rpc-test.cc:1859] Sending 1024MB via ssl-enabled unix socket: real 22.384s user 20.523s sys 14.045s
I20260929 21:46:17.205883 390 rpc-test.cc:1859] Sending 1024MB via ssl-enabled unix socket: real 22.546s user 20.650s sys 14.197s
I20260929 21:46:39.089809 390 rpc-test.cc:1859] Sending 1024MB via ssl-enabled unix socket: real 21.883s user 20.142s sys 13.544s
I20260929 21:47:00.949301 390 rpc-test.cc:1859] Sending 1024MB via ssl-enabled unix socket: real 21.859s user 20.222s sys 13.459s
W20260929 21:47:00.953969 837 connection.cc:196] Error closing socket: Network error: TlsSocket::Close: Broken pipe
[ OK ] Parameters/TestRpc.TestPerformanceBySocketType/SSL_UnixSocket (111722 ms)
[----------] 20 tests from Parameters/TestRpc (279577 ms total)
[----------] 1 test from Parameters/TestRpcSocketTxRxQueue
[ RUN ] Parameters/TestRpcSocketTxRxQueue.AcceptorRxQueueSizeMetric/0
I20260929 21:47:00.982919 876 acceptor_pool.cc:254] collecting diagnostics on the listening RPC socket 0.0.0.0:33031 every 1 connection(s)
I20260929 21:47:00.983687 877 acceptor_pool.cc:254] collecting diagnostics on the listening RPC socket 0.0.0.0:33031 every 1 connection(s)
W20260929 21:47:00.989281 872 negotiation.cc:337] Failed RPC negotiation. Trace:
0929 21:47:00.987661 (+ 0us) reactor.cc:625] Submitting negotiation task for server connection from 127.0.0.1:48270 (local address 127.0.0.1:33031)
0929 21:47:00.988167 (+ 506us) server_negotiation.cc:206] Beginning negotiation
0929 21:47:00.988191 (+ 24us) server_negotiation.cc:399] Waiting for connection header
0929 21:47:00.988438 (+ 247us) negotiation.cc:327] Negotiation complete: Network error: Server connection negotiation failed: server connection from 127.0.0.1:48270: BlockingRecv error: recv got EOF from 127.0.0.1:48270 (error 108)
Metrics: {"server-negotiator.queue_time_us":130}
[ OK ] Parameters/TestRpcSocketTxRxQueue.AcceptorRxQueueSizeMetric/0 (30 ms)
[----------] 1 test from Parameters/TestRpcSocketTxRxQueue (30 ms total)
[----------] Global test environment tear-down
[==========] 21 tests from 2 test suites ran. (279608 ms total)
[ PASSED ] 20 tests.
[ FAILED ] 1 test, listed below:
[ FAILED ] Parameters/TestRpc.TestCallWithChainCertAndChainCA/SSL_UnixSocket, where GetParam() = (true, true)
1 FAILED TEST