Diagnosed failure

Parameters/TestRpc.TestCallWithChainCertAndChainCA/SSL_UnixSocket: /data0/somelongdirectorytoavoidrpathissues/src/kudu/src/kudu/rpc/rpc-test.cc:270: Failure
Failed
Bad status: Runtime error: could not verify certificate chain (error with cert: subject=CN = localhost, ST = sadfjas, C = AS, emailAddress = sdflkdsajf, O = lskdfjlsad, OU = sldfkja, issuer=C = AS, ST = ASDfkjdhf, L = lskdjf, O = saldfja, OU = skdjf, CN = localhost, emailAddress = sadjflkadsj): : certificate has expired
Google Test trace:
/data0/somelongdirectorytoavoidrpathissues/src/kudu/src/kudu/rpc/rpc-test.cc:267: Connecting to unix:/tmp/dist-test-taskAg6KzW/test-tmp/rpc-test-55e81fa2493c4e2681cf072a24c5b7ec.sock
I20260923 14:36:56.210369 12020 test_util.cc:175] -----------------------------------------------
I20260923 14:36:56.210423 12020 test_util.cc:176] Had fatal failures, leaving test files at /tmp/dist-test-taskAg6KzW/test-tmp/rpc-test.6.Parameters_TestRpc.TestCallWithChainCertAndChainCA_SSL_UnixSocket.1790174216141586-12020-0

Full log

Note: This is test shard 7 of 8.
[==========] Running 21 tests from 2 test suites.
[----------] Global test environment set-up.
[----------] 20 tests from Parameters/TestRpc
[ RUN      ] Parameters/TestRpc.TestMessengerCreateDestroy/SSL_UnixSocket
WARNING: Logging before InitGoogleLogging() is written to STDERR
I20260923 14:36:56.171604 12020 rpc-test.cc:169] started messenger TestCreateDestroy
[       OK ] Parameters/TestRpc.TestMessengerCreateDestroy/SSL_UnixSocket (25 ms)
[ RUN      ] Parameters/TestRpc.TestNegotiationDeadlock/SSL_UnixSocket
I20260923 14:36:56.188580 12040 acceptor_pool.cc:254] collecting diagnostics on the listening RPC socket unix:/tmp/dist-test-taskAg6KzW/test-tmp/rpc-test-c1229704838346a2b7f2f1b67df98245.sock every 8 connection(s)
I20260923 14:36:56.188616 12041 acceptor_pool.cc:254] collecting diagnostics on the listening RPC socket unix:/tmp/dist-test-taskAg6KzW/test-tmp/rpc-test-c1229704838346a2b7f2f1b67df98245.sock every 8 connection(s)
[       OK ] Parameters/TestRpc.TestNegotiationDeadlock/SSL_UnixSocket (25 ms)
[ RUN      ] Parameters/TestRpc.TestCallWithChainCertAndChainCA/SSL_UnixSocket
I20260923 14:36:56.205250 12056 acceptor_pool.cc:254] collecting diagnostics on the listening RPC socket unix:/tmp/dist-test-taskAg6KzW/test-tmp/rpc-test-55e81fa2493c4e2681cf072a24c5b7ec.sock every 8 connection(s)
I20260923 14:36:56.205308 12057 acceptor_pool.cc:254] collecting diagnostics on the listening RPC socket unix:/tmp/dist-test-taskAg6KzW/test-tmp/rpc-test-55e81fa2493c4e2681cf072a24c5b7ec.sock every 8 connection(s)
/data0/somelongdirectorytoavoidrpathissues/src/kudu/src/kudu/rpc/rpc-test.cc:270: Failure
Failed
Bad status: Runtime error: could not verify certificate chain (error with cert: subject=CN = localhost, ST = sadfjas, C = AS, emailAddress = sdflkdsajf, O = lskdfjlsad, OU = sldfkja, issuer=C = AS, ST = ASDfkjdhf, L = lskdjf, O = saldfja, OU = skdjf, CN = localhost, emailAddress = sadjflkadsj): : certificate has expired
Google Test trace:
/data0/somelongdirectorytoavoidrpathissues/src/kudu/src/kudu/rpc/rpc-test.cc:267: Connecting to unix:/tmp/dist-test-taskAg6KzW/test-tmp/rpc-test-55e81fa2493c4e2681cf072a24c5b7ec.sock
I20260923 14:36:56.210369 12020 test_util.cc:175] -----------------------------------------------
I20260923 14:36:56.210423 12020 test_util.cc:176] Had fatal failures, leaving test files at /tmp/dist-test-taskAg6KzW/test-tmp/rpc-test.6.Parameters_TestRpc.TestCallWithChainCertAndChainCA_SSL_UnixSocket.1790174216141586-12020-0
[  FAILED  ] Parameters/TestRpc.TestCallWithChainCertAndChainCA/SSL_UnixSocket, where GetParam() = (true, true) (10 ms)
[ RUN      ] Parameters/TestRpc.TestCallWithPasswordProtectedKey/SSL_UnixSocket
I20260923 14:36:56.228475 12081 acceptor_pool.cc:254] collecting diagnostics on the listening RPC socket unix:/tmp/dist-test-taskAg6KzW/test-tmp/rpc-test-23f606e7d78f419f92ef5c4c0556a627.sock every 8 connection(s)
I20260923 14:36:56.228508 12082 acceptor_pool.cc:254] collecting diagnostics on the listening RPC socket unix:/tmp/dist-test-taskAg6KzW/test-tmp/rpc-test-23f606e7d78f419f92ef5c4c0556a627.sock every 8 connection(s)
W20260923 14:36:56.241161 12078 connection.cc:196] Error closing socket: Network error: TlsSocket::Close: Broken pipe
[       OK ] Parameters/TestRpc.TestCallWithPasswordProtectedKey/SSL_UnixSocket (32 ms)
[ RUN      ] Parameters/TestRpc.TestCallToBadServer/SSL_UnixSocket
I20260923 14:36:56.257543 12020 rpc-test.cc:394] Status: Network error: Client connection negotiation failed: client connection to 0.0.0.0:0: connect: Connection refused (error 111)
I20260923 14:36:56.258021 12020 rpc-test.cc:394] Status: Network error: Client connection negotiation failed: client connection to 0.0.0.0:0: connect: Connection refused (error 111)
I20260923 14:36:56.258451 12020 rpc-test.cc:394] Status: Network error: Client connection negotiation failed: client connection to 0.0.0.0:0: connect: Connection refused (error 111)
I20260923 14:36:56.258881 12020 rpc-test.cc:394] Status: Network error: Client connection negotiation failed: client connection to 0.0.0.0:0: connect: Connection refused (error 111)
I20260923 14:36:56.259303 12020 rpc-test.cc:394] Status: Network error: Client connection negotiation failed: client connection to 0.0.0.0:0: connect: Connection refused (error 111)
[       OK ] Parameters/TestRpc.TestCallToBadServer/SSL_UnixSocket (16 ms)
[ RUN      ] Parameters/TestRpc.TestWrongService/SSL_UnixSocket
I20260923 14:36:56.270740 12116 acceptor_pool.cc:254] collecting diagnostics on the listening RPC socket unix:/tmp/dist-test-taskAg6KzW/test-tmp/rpc-test-26175cc33f5f4d1c8dca467352f9d0fe.sock every 8 connection(s)
I20260923 14:36:56.270787 12117 acceptor_pool.cc:254] collecting diagnostics on the listening RPC socket unix:/tmp/dist-test-taskAg6KzW/test-tmp/rpc-test-26175cc33f5f4d1c8dca467352f9d0fe.sock every 8 connection(s)
I20260923 14:36:56.282480 12113 messenger.cc:345] service WrongServiceName not registered on TestServer
W20260923 14:36:56.283424 12113 connection.cc:196] Error closing socket: Network error: TlsSocket::Close: Broken pipe
[       OK ] Parameters/TestRpc.TestWrongService/SSL_UnixSocket (24 ms)
[ RUN      ] Parameters/TestRpc.TestConnectionKeepalive/SSL_UnixSocket
I20260923 14:36:56.301864 12140 acceptor_pool.cc:254] collecting diagnostics on the listening RPC socket unix:/tmp/dist-test-taskAg6KzW/test-tmp/rpc-test-7cb843394490446f841507d9a7edd2b1.sock every 8 connection(s)
I20260923 14:36:56.301841 12139 acceptor_pool.cc:254] collecting diagnostics on the listening RPC socket unix:/tmp/dist-test-taskAg6KzW/test-tmp/rpc-test-7cb843394490446f841507d9a7edd2b1.sock every 8 connection(s)
I20260923 14:36:56.302160 12020 rpc-test.cc:488] Connecting to unix:/tmp/dist-test-taskAg6KzW/test-tmp/rpc-test-7cb843394490446f841507d9a7edd2b1.sock
W20260923 14:36:56.786909 12152 connection.cc:196] Error closing socket: Network error: TlsSocket::Close: Broken pipe
[       OK ] Parameters/TestRpc.TestConnectionKeepalive/SSL_UnixSocket (1036 ms)
[ RUN      ] Parameters/TestRpc.TestClientConnectionMetrics/SSL_UnixSocket
I20260923 14:36:57.337684 12164 acceptor_pool.cc:254] collecting diagnostics on the listening RPC socket unix:/tmp/dist-test-taskAg6KzW/test-tmp/rpc-test-eead5ecf14e343639bb00190c5934a2c.sock every 8 connection(s)
I20260923 14:36:57.337729 12165 acceptor_pool.cc:254] collecting diagnostics on the listening RPC socket unix:/tmp/dist-test-taskAg6KzW/test-tmp/rpc-test-eead5ecf14e343639bb00190c5934a2c.sock every 8 connection(s)
I20260923 14:36:57.338063 12020 rpc-test.cc:569] Connecting to unix:/tmp/dist-test-taskAg6KzW/test-tmp/rpc-test-eead5ecf14e343639bb00190c5934a2c.sock
W20260923 14:37:07.273530 12161 connection.cc:196] Error closing socket: Network error: TlsSocket::Close: Broken pipe
[       OK ] Parameters/TestRpc.TestClientConnectionMetrics/SSL_UnixSocket (9953 ms)
[ RUN      ] Parameters/TestRpc.TestCredentialsPolicy/SSL_UnixSocket
I20260923 14:37:07.287182 12187 acceptor_pool.cc:254] collecting diagnostics on the listening RPC socket unix:/tmp/dist-test-taskAg6KzW/test-tmp/rpc-test-4b30666d6eb24e208dbed51338d7e85d.sock every 8 connection(s)
I20260923 14:37:07.287231 12188 acceptor_pool.cc:254] collecting diagnostics on the listening RPC socket unix:/tmp/dist-test-taskAg6KzW/test-tmp/rpc-test-4b30666d6eb24e208dbed51338d7e85d.sock every 8 connection(s)
I20260923 14:37:07.287550 12020 rpc-test.cc:700] Connecting to unix:/tmp/dist-test-taskAg6KzW/test-tmp/rpc-test-4b30666d6eb24e208dbed51338d7e85d.sock
W20260923 14:37:07.308832 12186 connection.cc:196] Error closing socket: Network error: TlsSocket::Close: Broken pipe
W20260923 14:37:07.313438 12186 connection.cc:196] Error closing socket: Network error: TlsSocket::Close: Broken pipe
[       OK ] Parameters/TestRpc.TestCredentialsPolicy/SSL_UnixSocket (39 ms)
[ RUN      ] Parameters/TestRpc.TestCallLongerThanKeepalive/SSL_UnixSocket
I20260923 14:37:07.342690 12212 acceptor_pool.cc:254] collecting diagnostics on the listening RPC socket unix:/tmp/dist-test-taskAg6KzW/test-tmp/rpc-test-0d8a11b156124991b79bd7591a3c35be.sock every 8 connection(s)
I20260923 14:37:07.342737 12213 acceptor_pool.cc:254] collecting diagnostics on the listening RPC socket unix:/tmp/dist-test-taskAg6KzW/test-tmp/rpc-test-0d8a11b156124991b79bd7591a3c35be.sock every 8 connection(s)
I20260923 14:37:07.351897 12216 rpc-test-base.h:222] got call: sleep_micros: 3000000 deferred: true
I20260923 14:37:10.352792 12216 rpcz_store.cc:275] Call kudu.rpc.GenericCalculatorService.Sleep from unix:<unnamed> (request call id 0) took 3000 ms. Trace:
I20260923 14:37:10.352922 12216 rpcz_store.cc:276] 0923 14:37:07.351819 (+     0us) service_pool.cc:170] Inserting onto call queue
0923 14:37:07.351871 (+    52us) service_pool.cc:227] Handling call
0923 14:37:10.352770 (+3000899us) inbound_call.cc:173] Queueing success response
Metrics: {}
W20260923 14:37:10.354497 12209 connection.cc:196] Error closing socket: Network error: TlsSocket::Close: Broken pipe
[       OK ] Parameters/TestRpc.TestCallLongerThanKeepalive/SSL_UnixSocket (3041 ms)
[ RUN      ] Parameters/TestRpc.TestRpcSidecar/SSL_UnixSocket
I20260923 14:37:10.383361 12237 acceptor_pool.cc:254] collecting diagnostics on the listening RPC socket unix:/tmp/dist-test-taskAg6KzW/test-tmp/rpc-test-5027ba329d374e29a56d06338a89c0cf.sock every 8 connection(s)
I20260923 14:37:10.383514 12238 acceptor_pool.cc:254] collecting diagnostics on the listening RPC socket unix:/tmp/dist-test-taskAg6KzW/test-tmp/rpc-test-5027ba329d374e29a56d06338a89c0cf.sock every 8 connection(s)
W20260923 14:37:10.434834 12234 connection.cc:196] Error closing socket: Network error: TlsSocket::Close: Broken pipe
[       OK ] Parameters/TestRpc.TestRpcSidecar/SSL_UnixSocket (79 ms)
[ RUN      ] Parameters/TestRpc.TestRpcSidecarLimits/SSL_UnixSocket
I20260923 14:37:12.472946 12262 acceptor_pool.cc:254] collecting diagnostics on the listening RPC socket unix:/tmp/dist-test-taskAg6KzW/test-tmp/rpc-test-d3034ac481714f90ac76d50a1e0feddf.sock every 8 connection(s)
I20260923 14:37:12.472997 12263 acceptor_pool.cc:254] collecting diagnostics on the listening RPC socket unix:/tmp/dist-test-taskAg6KzW/test-tmp/rpc-test-d3034ac481714f90ac76d50a1e0feddf.sock every 8 connection(s)
W20260923 14:37:12.491394 12020 serialization.cc:72] Serialized kudu.rpc_test.PushStringsRequestPB (2147483654 bytes) is larger than the maximum configured RPC message size (52428800 bytes). Sending anyway, but peer may reject the data.
W20260923 14:37:12.495409 12259 connection.cc:535] server connection from unix:<unnamed> recv error: Network error: RPC frame had a length of 2147483714, but we only support messages up to 52428800 bytes long.
W20260923 14:37:12.495488 12259 connection.cc:158] shutting down server connection from unix:<unnamed> with pending inbound data: 4/2147483714 bytes received; last active 0 ns ago: status Network error: RPC frame had a length of 2147483714, but we only support messages up to 52428800 bytes long.
W20260923 14:37:12.495759 12275 connection.cc:196] Error closing socket: Network error: TlsSocket::Close: Broken pipe
I20260923 14:37:12.505916 12287 acceptor_pool.cc:254] collecting diagnostics on the listening RPC socket unix:/tmp/dist-test-taskAg6KzW/test-tmp/rpc-test-d3034ac481714f90ac76d50a1e0feddf.sock every 8 connection(s)
I20260923 14:37:12.505918 12288 acceptor_pool.cc:254] collecting diagnostics on the listening RPC socket unix:/tmp/dist-test-taskAg6KzW/test-tmp/rpc-test-d3034ac481714f90ac76d50a1e0feddf.sock every 8 connection(s)
W20260923 14:37:18.670575 12284 connection.cc:577] server connection from unix:<unnamed>: received bad data: 'Corruption: Invalid packet: message had a length of 2147483710, but we only support messages up to 2147483647 bytes
'
W20260923 14:37:18.670951 12300 connection.cc:196] Error closing socket: Network error: TlsSocket::Close: Broken pipe
[       OK ] Parameters/TestRpc.TestRpcSidecarLimits/SSL_UnixSocket (8237 ms)
[ RUN      ] Parameters/TestRpc.TestCallTimeoutDoesntAffectNegotiation/SSL_UnixSocket
I20260923 14:37:18.695133 12312 acceptor_pool.cc:254] collecting diagnostics on the listening RPC socket unix:/tmp/dist-test-taskAg6KzW/test-tmp/rpc-test-0b8a956cc5164606b8b65284a6b6dcb1.sock every 8 connection(s)
I20260923 14:37:18.695467 12313 acceptor_pool.cc:254] collecting diagnostics on the listening RPC socket unix:/tmp/dist-test-taskAg6KzW/test-tmp/rpc-test-0b8a956cc5164606b8b65284a6b6dcb1.sock every 8 connection(s)
W20260923 14:37:18.712975 12306 negotiation.cc:266] Injecting 500ms delay in negotiation
I20260923 14:37:18.763715 12020 rpc-test-base.h:595] status: Timed out: connection negotiation to unix:/tmp/dist-test-taskAg6KzW/test-tmp/rpc-test-0b8a956cc5164606b8b65284a6b6dcb1.sock for RPC Sleep timed out after 0.050s (ON_OUTBOUND_QUEUE), seconds elapsed: 0.0513376
[       OK ] Parameters/TestRpc.TestCallTimeoutDoesntAffectNegotiation/SSL_UnixSocket (547 ms)
[ RUN      ] Parameters/TestRpc.TestRpcHandlerLatencyMetric/SSL_UnixSocket
I20260923 14:37:19.235152 12338 acceptor_pool.cc:254] collecting diagnostics on the listening RPC socket unix:/tmp/dist-test-taskAg6KzW/test-tmp/rpc-test-11d350451f12450bbef0780f9c60a287.sock every 8 connection(s)
I20260923 14:37:19.235358 12337 acceptor_pool.cc:254] collecting diagnostics on the listening RPC socket unix:/tmp/dist-test-taskAg6KzW/test-tmp/rpc-test-11d350451f12450bbef0780f9c60a287.sock every 8 connection(s)
I20260923 14:37:19.276899 12020 rpc-test.cc:1236] Sleep() min lat: 20568
I20260923 14:37:19.276996 12020 rpc-test.cc:1237] Sleep() mean lat: 20568
I20260923 14:37:19.277031 12020 rpc-test.cc:1238] Sleep() max lat: 20568
I20260923 14:37:19.277047 12020 rpc-test.cc:1239] Sleep() #calls: 1
[       OK ] Parameters/TestRpc.TestRpcHandlerLatencyMetric/SSL_UnixSocket (59 ms)
[ RUN      ] Parameters/TestRpc.TimedOutOnResponseMetricServiceQueue/SSL_UnixSocket
I20260923 14:37:19.299381 12364 acceptor_pool.cc:254] collecting diagnostics on the listening RPC socket unix:/tmp/dist-test-taskAg6KzW/test-tmp/rpc-test-e281003fceb04266b16e0db879fe4996.sock every 8 connection(s)
I20260923 14:37:19.299434 12363 acceptor_pool.cc:254] collecting diagnostics on the listening RPC socket unix:/tmp/dist-test-taskAg6KzW/test-tmp/rpc-test-e281003fceb04266b16e0db879fe4996.sock every 8 connection(s)
W20260923 14:37:19.366143 12365 rpcz_store.cc:267] Call kudu.rpc_test.CalculatorService.Sleep from unix:<unnamed> (request call id 2) took 20 ms (client timeout 20 ms). Trace:
W20260923 14:37:19.366323 12365 rpcz_store.cc:269] 0923 14:37:19.345600 (+     0us) service_pool.cc:170] Inserting onto call queue
0923 14:37:19.366058 (+ 20458us) service_pool.cc:214] Skipping call since client already timed out
0923 14:37:19.366101 (+    43us) inbound_call.cc:173] Queueing failure response
Metrics: {}
W20260923 14:37:19.367385 12360 connection.cc:196] Error closing socket: Network error: TlsSocket::Close: Broken pipe
[       OK ] Parameters/TestRpc.TimedOutOnResponseMetricServiceQueue/SSL_UnixSocket (88 ms)
[ RUN      ] Parameters/TestRpc.RpcPendingConnectionsMetric/SSL_UnixSocket
I20260923 14:37:19.372360 12386 acceptor_pool.cc:254] collecting diagnostics on the listening RPC socket 0.0.0.0:41887 every 8 connection(s)
I20260923 14:37:19.372393 12387 acceptor_pool.cc:254] collecting diagnostics on the listening RPC socket 0.0.0.0:41887 every 8 connection(s)
W20260923 14:37:19.373811 12382 negotiation.cc:337] Failed RPC negotiation. Trace:
0923 14:37:19.373295 (+     0us) reactor.cc:625] Submitting negotiation task for server connection from 127.0.0.1:58822 (local address 127.0.0.1:41887)
0923 14:37:19.373459 (+   164us) server_negotiation.cc:206] Beginning negotiation
0923 14:37:19.373463 (+     4us) server_negotiation.cc:399] Waiting for connection header
0923 14:37:19.373578 (+   115us) negotiation.cc:327] Negotiation complete: Network error: Server connection negotiation failed: server connection from 127.0.0.1:58822: BlockingRecv error: recv got EOF from 127.0.0.1:58822 (error 108)
Metrics: {"server-negotiator.queue_time_us":81}
[       OK ] Parameters/TestRpc.RpcPendingConnectionsMetric/SSL_UnixSocket (16 ms)
[ RUN      ] Parameters/TestRpc.TestRpcContextClientDeadline/SSL_UnixSocket
I20260923 14:37:19.399442 12403 acceptor_pool.cc:254] collecting diagnostics on the listening RPC socket unix:/tmp/dist-test-taskAg6KzW/test-tmp/rpc-test-f6d0615cc6004606a26280298dd3f1ee.sock every 8 connection(s)
I20260923 14:37:19.399595 12402 acceptor_pool.cc:254] collecting diagnostics on the listening RPC socket unix:/tmp/dist-test-taskAg6KzW/test-tmp/rpc-test-f6d0615cc6004606a26280298dd3f1ee.sock every 8 connection(s)
W20260923 14:37:19.440779 12399 connection.cc:196] Error closing socket: Network error: TlsSocket::Close: Broken pipe
[       OK ] Parameters/TestRpc.TestRpcContextClientDeadline/SSL_UnixSocket (57 ms)
[ RUN      ] Parameters/TestRpc.TestApplicationFeatureFlagUnsupportedServer/SSL_UnixSocket
I20260923 14:37:19.452527 12427 acceptor_pool.cc:254] collecting diagnostics on the listening RPC socket unix:/tmp/dist-test-taskAg6KzW/test-tmp/rpc-test-bda475cdd1844d6a8ff30a5c1958e242.sock every 8 connection(s)
I20260923 14:37:19.452539 12428 acceptor_pool.cc:254] collecting diagnostics on the listening RPC socket unix:/tmp/dist-test-taskAg6KzW/test-tmp/rpc-test-bda475cdd1844d6a8ff30a5c1958e242.sock every 8 connection(s)
W20260923 14:37:19.478878 12424 connection.cc:196] Error closing socket: Network error: TlsSocket::Close: Broken pipe
[       OK ] Parameters/TestRpc.TestApplicationFeatureFlagUnsupportedServer/SSL_UnixSocket (37 ms)
[ RUN      ] Parameters/TestRpc.TestCancellationAsync/SSL_UnixSocket
I20260923 14:37:19.490738 12452 acceptor_pool.cc:254] collecting diagnostics on the listening RPC socket unix:/tmp/dist-test-taskAg6KzW/test-tmp/rpc-test-5798de9d46f34a9e941d584f4f08d350.sock every 8 connection(s)
I20260923 14:37:19.490769 12453 acceptor_pool.cc:254] collecting diagnostics on the listening RPC socket unix:/tmp/dist-test-taskAg6KzW/test-tmp/rpc-test-5798de9d46f34a9e941d584f4f08d350.sock every 8 connection(s)
I20260923 14:37:19.491097 12020 rpc-test.cc:1716] Connecting to unix:/tmp/dist-test-taskAg6KzW/test-tmp/rpc-test-5798de9d46f34a9e941d584f4f08d350.sock
I20260923 14:37:19.497650 12020 test_util.cc:268] Using random seed: 1805753766
I20260923 14:37:19.519909 12456 rpc-test-base.h:240] got call: sleep_micros: 500 pattern: 4294967295 num_repetitions: 2097152 sidecar_idx: 0
I20260923 14:37:19.539253 12455 rpc-test-base.h:240] got call: sleep_micros: 500 pattern: 4294967295 num_repetitions: 2097152 sidecar_idx: 0
I20260923 14:37:19.558495 12456 rpc-test-base.h:240] got call: sleep_micros: 500 pattern: 4294967295 num_repetitions: 2097152 sidecar_idx: 0
I20260923 14:37:19.577214 12455 rpc-test-base.h:240] got call: sleep_micros: 500 pattern: 4294967295 num_repetitions: 2097152 sidecar_idx: 0
I20260923 14:37:19.597020 12456 rpc-test-base.h:240] got call: sleep_micros: 500 pattern: 4294967295 num_repetitions: 2097152 sidecar_idx: 0
I20260923 14:37:19.616851 12456 rpc-test-base.h:240] got call: sleep_micros: 500 pattern: 4294967295 num_repetitions: 2097152 sidecar_idx: 0
I20260923 14:37:19.636138 12455 rpc-test-base.h:240] got call: sleep_micros: 500 pattern: 4294967295 num_repetitions: 2097152 sidecar_idx: 0
I20260923 14:37:19.654450 12455 rpc-test-base.h:240] got call: sleep_micros: 500 pattern: 4294967295 num_repetitions: 2097152 sidecar_idx: 0
W20260923 14:37:19.656536 12449 connection.cc:196] Error closing socket: Network error: TlsSocket::Close: Broken pipe
W20260923 14:37:19.673638 12449 connection.cc:441] server connection from unix:<unnamed> torn down before Call kudu.rpc.GenericCalculatorService.SleepWithSidecar from unix:<unnamed> (request call id 9) could send its response
[       OK ] Parameters/TestRpc.TestCancellationAsync/SSL_UnixSocket (194 ms)
[ RUN      ] Parameters/TestRpc.TestPerformanceBySocketType/SSL_UnixSocket
I20260923 14:37:19.697402 12477 acceptor_pool.cc:254] collecting diagnostics on the listening RPC socket unix:/tmp/dist-test-taskAg6KzW/test-tmp/rpc-test-30453ce157f64edfbd9c2e0770440249.sock every 8 connection(s)
I20260923 14:37:19.697474 12478 acceptor_pool.cc:254] collecting diagnostics on the listening RPC socket unix:/tmp/dist-test-taskAg6KzW/test-tmp/rpc-test-30453ce157f64edfbd9c2e0770440249.sock every 8 connection(s)
I20260923 14:37:19.697791 12020 rpc-test.cc:1846] Connecting to unix:/tmp/dist-test-taskAg6KzW/test-tmp/rpc-test-30453ce157f64edfbd9c2e0770440249.sock
I20260923 14:37:21.399863 12020 rpc-test.cc:1859] Sending 1024MB via ssl-enabled unix socket: real 1.684s	user 2.173s	sys 0.822s
I20260923 14:37:23.046482 12020 rpc-test.cc:1859] Sending 1024MB via ssl-enabled unix socket: real 1.646s	user 2.053s	sys 0.891s
I20260923 14:37:25.056600 12020 rpc-test.cc:1859] Sending 1024MB via ssl-enabled unix socket: real 2.010s	user 2.367s	sys 1.160s
I20260923 14:37:27.080554 12020 rpc-test.cc:1859] Sending 1024MB via ssl-enabled unix socket: real 2.024s	user 2.421s	sys 1.146s
I20260923 14:37:29.010689 12020 rpc-test.cc:1859] Sending 1024MB via ssl-enabled unix socket: real 1.930s	user 2.363s	sys 1.057s
W20260923 14:37:29.012133 12474 connection.cc:196] Error closing socket: Network error: TlsSocket::Close: Broken pipe
[       OK ] Parameters/TestRpc.TestPerformanceBySocketType/SSL_UnixSocket (9339 ms)
[----------] 20 tests from Parameters/TestRpc (32866 ms total)

[----------] 1 test from Parameters/TestRpcSocketTxRxQueue
[ RUN      ] Parameters/TestRpcSocketTxRxQueue.AcceptorRxQueueSizeMetric/0
I20260923 14:37:29.025306 12502 acceptor_pool.cc:254] collecting diagnostics on the listening RPC socket 0.0.0.0:36909 every 1 connection(s)
I20260923 14:37:29.025374 12503 acceptor_pool.cc:254] collecting diagnostics on the listening RPC socket 0.0.0.0:36909 every 1 connection(s)
W20260923 14:37:29.026314 12498 negotiation.cc:337] Failed RPC negotiation. Trace:
0923 14:37:29.026000 (+     0us) reactor.cc:625] Submitting negotiation task for server connection from 127.0.0.1:51590 (local address 127.0.0.1:36909)
0923 14:37:29.026128 (+   128us) server_negotiation.cc:206] Beginning negotiation
0923 14:37:29.026131 (+     3us) server_negotiation.cc:399] Waiting for connection header
0923 14:37:29.026235 (+   104us) negotiation.cc:327] Negotiation complete: Network error: Server connection negotiation failed: server connection from 127.0.0.1:51590: BlockingRecv error: recv got EOF from 127.0.0.1:51590 (error 108)
Metrics: {"server-negotiator.queue_time_us":53}
[       OK ] Parameters/TestRpcSocketTxRxQueue.AcceptorRxQueueSizeMetric/0 (14 ms)
[----------] 1 test from Parameters/TestRpcSocketTxRxQueue (14 ms total)

[----------] Global test environment tear-down
[==========] 21 tests from 2 test suites ran. (32881 ms total)
[  PASSED  ] 20 tests.
[  FAILED  ] 1 test, listed below:
[  FAILED  ] Parameters/TestRpc.TestCallWithChainCertAndChainCA/SSL_UnixSocket, where GetParam() = (true, true)

 1 FAILED TEST