Diagnosed failure
Parameters/TestRpc.TestCallWithChainCertAndChainCA/SSL_TCP: /data0/somelongdirectorytoavoidrpathissues/src/kudu/src/kudu/rpc/rpc-test.cc:270: Failure
Failed
Bad status: Runtime error: could not verify certificate chain (error with cert: subject=CN = localhost, ST = sadfjas, C = AS, emailAddress = sdflkdsajf, O = lskdfjlsad, OU = sldfkja, issuer=C = AS, ST = ASDfkjdhf, L = lskdjf, O = saldfja, OU = skdjf, CN = localhost, emailAddress = sadjflkadsj): : certificate has expired
Google Test trace:
/data0/somelongdirectorytoavoidrpathissues/src/kudu/src/kudu/rpc/rpc-test.cc:267: Connecting to 0.0.0.0:35705
I20260924 16:01:12.852133 7068 test_util.cc:175] -----------------------------------------------
I20260924 16:01:12.852245 7068 test_util.cc:176] Had fatal failures, leaving test files at /tmp/dist-test-taskQjGAFo/test-tmp/rpc-test.5.Parameters_TestRpc.TestCallWithChainCertAndChainCA_SSL_TCP.1790265672725437-7068-0
Full log
Note: This is test shard 6 of 8.
[==========] Running 21 tests from 2 test suites.
[----------] Global test environment set-up.
[----------] 20 tests from Parameters/TestRpc
[ RUN ] Parameters/TestRpc.TestMessengerCreateDestroy/SSL_TCP
WARNING: Logging before InitGoogleLogging() is written to STDERR
I20260924 16:01:12.766840 7068 rpc-test.cc:169] started messenger TestCreateDestroy
[ OK ] Parameters/TestRpc.TestMessengerCreateDestroy/SSL_TCP (25 ms)
[ RUN ] Parameters/TestRpc.TestNegotiationDeadlock/SSL_TCP
I20260924 16:01:12.792640 7088 acceptor_pool.cc:254] collecting diagnostics on the listening RPC socket 0.0.0.0:41749 every 8 connection(s)
I20260924 16:01:12.792873 7089 acceptor_pool.cc:254] collecting diagnostics on the listening RPC socket 0.0.0.0:41749 every 8 connection(s)
[ OK ] Parameters/TestRpc.TestNegotiationDeadlock/SSL_TCP (43 ms)
[ RUN ] Parameters/TestRpc.TestCallWithChainCertAndChainCA/SSL_TCP
I20260924 16:01:12.840222 7104 acceptor_pool.cc:254] collecting diagnostics on the listening RPC socket 0.0.0.0:35705 every 8 connection(s)
I20260924 16:01:12.840588 7105 acceptor_pool.cc:254] collecting diagnostics on the listening RPC socket 0.0.0.0:35705 every 8 connection(s)
/data0/somelongdirectorytoavoidrpathissues/src/kudu/src/kudu/rpc/rpc-test.cc:270: Failure
Failed
Bad status: Runtime error: could not verify certificate chain (error with cert: subject=CN = localhost, ST = sadfjas, C = AS, emailAddress = sdflkdsajf, O = lskdfjlsad, OU = sldfkja, issuer=C = AS, ST = ASDfkjdhf, L = lskdjf, O = saldfja, OU = skdjf, CN = localhost, emailAddress = sadjflkadsj): : certificate has expired
Google Test trace:
/data0/somelongdirectorytoavoidrpathissues/src/kudu/src/kudu/rpc/rpc-test.cc:267: Connecting to 0.0.0.0:35705
I20260924 16:01:12.852133 7068 test_util.cc:175] -----------------------------------------------
I20260924 16:01:12.852245 7068 test_util.cc:176] Had fatal failures, leaving test files at /tmp/dist-test-taskQjGAFo/test-tmp/rpc-test.5.Parameters_TestRpc.TestCallWithChainCertAndChainCA_SSL_TCP.1790265672725437-7068-0
[ FAILED ] Parameters/TestRpc.TestCallWithChainCertAndChainCA/SSL_TCP, where GetParam() = (true, false) (38 ms)
[ RUN ] Parameters/TestRpc.TestCallWithPasswordProtectedKey/SSL_TCP
I20260924 16:01:12.864965 7129 acceptor_pool.cc:254] collecting diagnostics on the listening RPC socket 0.0.0.0:37779 every 8 connection(s)
I20260924 16:01:12.865199 7130 acceptor_pool.cc:254] collecting diagnostics on the listening RPC socket 0.0.0.0:37779 every 8 connection(s)
[ OK ] Parameters/TestRpc.TestCallWithPasswordProtectedKey/SSL_TCP (47 ms)
[ RUN ] Parameters/TestRpc.TestCallToBadServer/SSL_TCP
I20260924 16:01:12.932078 7068 rpc-test.cc:394] Status: Network error: Client connection negotiation failed: client connection to 0.0.0.0:0: connect: Connection refused (error 111)
I20260924 16:01:12.932725 7068 rpc-test.cc:394] Status: Network error: Client connection negotiation failed: client connection to 0.0.0.0:0: connect: Connection refused (error 111)
I20260924 16:01:12.933306 7068 rpc-test.cc:394] Status: Network error: Client connection negotiation failed: client connection to 0.0.0.0:0: connect: Connection refused (error 111)
I20260924 16:01:12.934000 7068 rpc-test.cc:394] Status: Network error: Client connection negotiation failed: client connection to 0.0.0.0:0: connect: Connection refused (error 111)
I20260924 16:01:12.934645 7068 rpc-test.cc:394] Status: Network error: Client connection negotiation failed: client connection to 0.0.0.0:0: connect: Connection refused (error 111)
[ OK ] Parameters/TestRpc.TestCallToBadServer/SSL_TCP (36 ms)
[ RUN ] Parameters/TestRpc.TestWrongService/SSL_TCP
I20260924 16:01:12.959702 7165 acceptor_pool.cc:254] collecting diagnostics on the listening RPC socket 0.0.0.0:37227 every 8 connection(s)
I20260924 16:01:12.959985 7166 acceptor_pool.cc:254] collecting diagnostics on the listening RPC socket 0.0.0.0:37227 every 8 connection(s)
I20260924 16:01:12.981169 7164 messenger.cc:345] service WrongServiceName not registered on TestServer
[ OK ] Parameters/TestRpc.TestWrongService/SSL_TCP (50 ms)
[ RUN ] Parameters/TestRpc.TestConnectionKeepalive/SSL_TCP
I20260924 16:01:13.004647 7188 acceptor_pool.cc:254] collecting diagnostics on the listening RPC socket 0.0.0.0:33253 every 8 connection(s)
I20260924 16:01:13.004896 7189 acceptor_pool.cc:254] collecting diagnostics on the listening RPC socket 0.0.0.0:33253 every 8 connection(s)
I20260924 16:01:13.005908 7068 rpc-test.cc:488] Connecting to 0.0.0.0:33253
[ OK ] Parameters/TestRpc.TestConnectionKeepalive/SSL_TCP (1050 ms)
[ RUN ] Parameters/TestRpc.TestClientConnectionMetrics/SSL_TCP
I20260924 16:01:14.051901 7213 acceptor_pool.cc:254] collecting diagnostics on the listening RPC socket 0.0.0.0:38087 every 8 connection(s)
I20260924 16:01:14.052150 7214 acceptor_pool.cc:254] collecting diagnostics on the listening RPC socket 0.0.0.0:38087 every 8 connection(s)
I20260924 16:01:14.053121 7068 rpc-test.cc:569] Connecting to 0.0.0.0:38087
[ OK ] Parameters/TestRpc.TestClientConnectionMetrics/SSL_TCP (20252 ms)
[ RUN ] Parameters/TestRpc.TestCredentialsPolicy/SSL_TCP
I20260924 16:01:34.305442 7236 acceptor_pool.cc:254] collecting diagnostics on the listening RPC socket 0.0.0.0:37749 every 8 connection(s)
I20260924 16:01:34.305702 7237 acceptor_pool.cc:254] collecting diagnostics on the listening RPC socket 0.0.0.0:37749 every 8 connection(s)
I20260924 16:01:34.306674 7068 rpc-test.cc:700] Connecting to 0.0.0.0:37749
[ OK ] Parameters/TestRpc.TestCredentialsPolicy/SSL_TCP (58 ms)
[ RUN ] Parameters/TestRpc.TestCallLongerThanKeepalive/SSL_TCP
I20260924 16:01:34.364405 7261 acceptor_pool.cc:254] collecting diagnostics on the listening RPC socket 0.0.0.0:34165 every 8 connection(s)
I20260924 16:01:34.364710 7262 acceptor_pool.cc:254] collecting diagnostics on the listening RPC socket 0.0.0.0:34165 every 8 connection(s)
I20260924 16:01:34.392072 7265 rpc-test-base.h:222] got call: sleep_micros: 3000000 deferred: true
I20260924 16:01:37.393973 7265 rpcz_store.cc:275] Call kudu.rpc.GenericCalculatorService.Sleep from 127.0.0.1:53796 (request call id 0) took 3002 ms. Trace:
I20260924 16:01:37.394179 7265 rpcz_store.cc:276] 0924 16:01:34.391962 (+ 0us) service_pool.cc:170] Inserting onto call queue
0924 16:01:34.392024 (+ 62us) service_pool.cc:227] Handling call
0924 16:01:37.393922 (+3001898us) inbound_call.cc:173] Queueing success response
Metrics: {}
[ OK ] Parameters/TestRpc.TestCallLongerThanKeepalive/SSL_TCP (3051 ms)
[ RUN ] Parameters/TestRpc.TestRpcSidecar/SSL_TCP
I20260924 16:01:37.436988 7286 acceptor_pool.cc:254] collecting diagnostics on the listening RPC socket 0.0.0.0:38229 every 8 connection(s)
I20260924 16:01:37.437215 7287 acceptor_pool.cc:254] collecting diagnostics on the listening RPC socket 0.0.0.0:38229 every 8 connection(s)
[ OK ] Parameters/TestRpc.TestRpcSidecar/SSL_TCP (179 ms)
[ RUN ] Parameters/TestRpc.TestRpcSidecarLimits/SSL_TCP
I20260924 16:01:43.613281 7312 acceptor_pool.cc:254] collecting diagnostics on the listening RPC socket 0.0.0.0:42131 every 8 connection(s)
I20260924 16:01:43.614444 7313 acceptor_pool.cc:254] collecting diagnostics on the listening RPC socket 0.0.0.0:42131 every 8 connection(s)
W20260924 16:01:43.636767 7068 serialization.cc:72] Serialized kudu.rpc_test.PushStringsRequestPB (2147483654 bytes) is larger than the maximum configured RPC message size (52428800 bytes). Sending anyway, but peer may reject the data.
W20260924 16:01:43.645566 7311 connection.cc:535] server connection from 127.0.0.1:52610 recv error: Network error: RPC frame had a length of 2147483714, but we only support messages up to 52428800 bytes long.
W20260924 16:01:43.645742 7311 connection.cc:158] shutting down server connection from 127.0.0.1:52610 with pending inbound data: 4/2147483714 bytes received; last active 0 ns ago: status Network error: RPC frame had a length of 2147483714, but we only support messages up to 52428800 bytes long.
W20260924 16:01:43.646350 7325 connection.cc:196] Error closing socket: Network error: TlsSocket::Close: Connection reset by peer
I20260924 16:01:43.662979 7337 acceptor_pool.cc:254] collecting diagnostics on the listening RPC socket 0.0.0.0:36469 every 8 connection(s)
I20260924 16:01:43.663244 7338 acceptor_pool.cc:254] collecting diagnostics on the listening RPC socket 0.0.0.0:36469 every 8 connection(s)
W20260924 16:01:53.463653 7334 connection.cc:577] server connection from 127.0.0.1:53250: received bad data: 'Corruption: Invalid packet: message had a length of 2147483710, but we only support messages up to 2147483647 bytes
'
[ OK ] Parameters/TestRpc.TestRpcSidecarLimits/SSL_TCP (16426 ms)
[ RUN ] Parameters/TestRpc.TestCallTimeoutDoesntAffectNegotiation/SSL_TCP
I20260924 16:01:54.022861 7362 acceptor_pool.cc:254] collecting diagnostics on the listening RPC socket 0.0.0.0:36929 every 8 connection(s)
I20260924 16:01:54.023142 7363 acceptor_pool.cc:254] collecting diagnostics on the listening RPC socket 0.0.0.0:36929 every 8 connection(s)
W20260924 16:01:54.033962 7358 negotiation.cc:266] Injecting 500ms delay in negotiation
I20260924 16:01:54.084350 7068 rpc-test-base.h:595] status: Timed out: connection negotiation to 0.0.0.0:36929 for RPC Sleep timed out after 0.050s (ON_OUTBOUND_QUEUE), seconds elapsed: 0.0511683
[ OK ] Parameters/TestRpc.TestCallTimeoutDoesntAffectNegotiation/SSL_TCP (537 ms)
[ RUN ] Parameters/TestRpc.TestRpcHandlerLatencyMetric/SSL_TCP
I20260924 16:01:54.560055 7387 acceptor_pool.cc:254] collecting diagnostics on the listening RPC socket 0.0.0.0:37977 every 8 connection(s)
I20260924 16:01:54.560695 7388 acceptor_pool.cc:254] collecting diagnostics on the listening RPC socket 0.0.0.0:37977 every 8 connection(s)
I20260924 16:01:54.611385 7068 rpc-test.cc:1236] Sleep() min lat: 20617
I20260924 16:01:54.611471 7068 rpc-test.cc:1237] Sleep() mean lat: 20617
I20260924 16:01:54.611510 7068 rpc-test.cc:1238] Sleep() max lat: 20617
I20260924 16:01:54.611529 7068 rpc-test.cc:1239] Sleep() #calls: 1
[ OK ] Parameters/TestRpc.TestRpcHandlerLatencyMetric/SSL_TCP (71 ms)
[ RUN ] Parameters/TestRpc.TimedOutOnResponseMetricServiceQueue/SSL_TCP
I20260924 16:01:54.631240 7413 acceptor_pool.cc:254] collecting diagnostics on the listening RPC socket 0.0.0.0:38449 every 8 connection(s)
I20260924 16:01:54.631465 7414 acceptor_pool.cc:254] collecting diagnostics on the listening RPC socket 0.0.0.0:38449 every 8 connection(s)
W20260924 16:01:54.690583 7415 rpcz_store.cc:267] Call kudu.rpc_test.CalculatorService.Sleep from 127.0.0.1:36192 (request call id 2) took 20 ms (client timeout 20 ms). Trace:
W20260924 16:01:54.690788 7415 rpcz_store.cc:269] 0924 16:01:54.670132 (+ 0us) service_pool.cc:170] Inserting onto call queue
0924 16:01:54.690492 (+ 20360us) service_pool.cc:214] Skipping call since client already timed out
0924 16:01:54.690555 (+ 63us) inbound_call.cc:173] Queueing failure response
Metrics: {}
[ OK ] Parameters/TestRpc.TimedOutOnResponseMetricServiceQueue/SSL_TCP (79 ms)
[ RUN ] Parameters/TestRpc.RpcPendingConnectionsMetric/SSL_TCP
I20260924 16:01:54.701828 7436 acceptor_pool.cc:254] collecting diagnostics on the listening RPC socket 0.0.0.0:45791 every 8 connection(s)
I20260924 16:01:54.702061 7437 acceptor_pool.cc:254] collecting diagnostics on the listening RPC socket 0.0.0.0:45791 every 8 connection(s)
W20260924 16:01:54.704152 7432 negotiation.cc:337] Failed RPC negotiation. Trace:
0924 16:01:54.703519 (+ 0us) reactor.cc:625] Submitting negotiation task for server connection from 127.0.0.1:46248 (local address 127.0.0.1:45791)
0924 16:01:54.703669 (+ 150us) server_negotiation.cc:206] Beginning negotiation
0924 16:01:54.703673 (+ 4us) server_negotiation.cc:399] Waiting for connection header
0924 16:01:54.703821 (+ 148us) negotiation.cc:327] Negotiation complete: Network error: Server connection negotiation failed: server connection from 127.0.0.1:46248: BlockingRecv error: recv got EOF from 127.0.0.1:46248 (error 108)
Metrics: {"server-negotiator.queue_time_us":46}
[ OK ] Parameters/TestRpc.RpcPendingConnectionsMetric/SSL_TCP (19 ms)
[ RUN ] Parameters/TestRpc.TestRpcContextClientDeadline/SSL_TCP
I20260924 16:01:54.732635 7453 acceptor_pool.cc:254] collecting diagnostics on the listening RPC socket 0.0.0.0:37811 every 8 connection(s)
I20260924 16:01:54.732823 7454 acceptor_pool.cc:254] collecting diagnostics on the listening RPC socket 0.0.0.0:37811 every 8 connection(s)
[ OK ] Parameters/TestRpc.TestRpcContextClientDeadline/SSL_TCP (70 ms)
[ RUN ] Parameters/TestRpc.TestApplicationFeatureFlagUnsupportedServer/SSL_TCP
I20260924 16:01:54.804919 7478 acceptor_pool.cc:254] collecting diagnostics on the listening RPC socket 0.0.0.0:32909 every 8 connection(s)
I20260924 16:01:54.805132 7479 acceptor_pool.cc:254] collecting diagnostics on the listening RPC socket 0.0.0.0:32909 every 8 connection(s)
[ OK ] Parameters/TestRpc.TestApplicationFeatureFlagUnsupportedServer/SSL_TCP (60 ms)
[ RUN ] Parameters/TestRpc.TestCancellationAsync/SSL_TCP
I20260924 16:01:54.863677 7503 acceptor_pool.cc:254] collecting diagnostics on the listening RPC socket 0.0.0.0:38151 every 8 connection(s)
I20260924 16:01:54.863912 7504 acceptor_pool.cc:254] collecting diagnostics on the listening RPC socket 0.0.0.0:38151 every 8 connection(s)
I20260924 16:01:54.864770 7068 rpc-test.cc:1716] Connecting to 0.0.0.0:38151
I20260924 16:01:54.878363 7068 test_util.cc:268] Using random seed: -1208146053
I20260924 16:01:54.915681 7507 rpc-test-base.h:240] got call: sleep_micros: 500 pattern: 4294967295 num_repetitions: 2097152 sidecar_idx: 0
I20260924 16:01:54.936944 7506 rpc-test-base.h:240] got call: sleep_micros: 500 pattern: 4294967295 num_repetitions: 2097152 sidecar_idx: 0
I20260924 16:01:54.963091 7505 rpc-test-base.h:240] got call: sleep_micros: 500 pattern: 4294967295 num_repetitions: 2097152 sidecar_idx: 0
I20260924 16:01:54.989425 7507 rpc-test-base.h:240] got call: sleep_micros: 500 pattern: 4294967295 num_repetitions: 2097152 sidecar_idx: 0
I20260924 16:01:55.015866 7506 rpc-test-base.h:240] got call: sleep_micros: 500 pattern: 4294967295 num_repetitions: 2097152 sidecar_idx: 0
I20260924 16:01:55.052016 7505 rpc-test-base.h:240] got call: sleep_micros: 500 pattern: 4294967295 num_repetitions: 2097152 sidecar_idx: 0
W20260924 16:01:55.083681 7501 connection.cc:698] server connection from 127.0.0.1:41640 send error: Network error: failed to write to TLS socket: Broken pipe
W20260924 16:01:55.083822 7501 connection.cc:441] server connection from 127.0.0.1:41640 torn down before Call kudu.rpc.GenericCalculatorService.SleepWithSidecar from 127.0.0.1:41640 (request call id 9) could send its response
W20260924 16:01:55.084164 7501 connection.cc:196] Error closing socket: Network error: TlsSocket::Close: Success
W20260924 16:01:55.097957 7501 connection.cc:441] server connection from 127.0.0.1:41640 torn down before Call kudu.rpc.GenericCalculatorService.SleepWithSidecar from 127.0.0.1:41640 (request call id 8) could send its response
[ OK ] Parameters/TestRpc.TestCancellationAsync/SSL_TCP (253 ms)
[ RUN ] Parameters/TestRpc.TestPerformanceBySocketType/SSL_TCP
I20260924 16:01:55.130502 7528 acceptor_pool.cc:254] collecting diagnostics on the listening RPC socket 0.0.0.0:45501 every 8 connection(s)
I20260924 16:01:55.130764 7529 acceptor_pool.cc:254] collecting diagnostics on the listening RPC socket 0.0.0.0:45501 every 8 connection(s)
I20260924 16:01:55.131688 7068 rpc-test.cc:1846] Connecting to 0.0.0.0:45501
I20260924 16:01:58.221686 7068 rpc-test.cc:1859] Sending 1024MB via ssl-enabled tcp socket: real 3.078s user 2.799s sys 2.204s
I20260924 16:02:01.368371 7068 rpc-test.cc:1859] Sending 1024MB via ssl-enabled tcp socket: real 3.147s user 2.846s sys 2.265s
I20260924 16:02:04.563644 7068 rpc-test.cc:1859] Sending 1024MB via ssl-enabled tcp socket: real 3.195s user 2.938s sys 2.284s
I20260924 16:02:07.729206 7068 rpc-test.cc:1859] Sending 1024MB via ssl-enabled tcp socket: real 3.165s user 2.804s sys 2.346s
I20260924 16:02:10.827193 7068 rpc-test.cc:1859] Sending 1024MB via ssl-enabled tcp socket: real 3.098s user 2.774s sys 2.267s
[ OK ] Parameters/TestRpc.TestPerformanceBySocketType/SSL_TCP (15733 ms)
[----------] 20 tests from Parameters/TestRpc (58090 ms total)
[----------] 1 test from Parameters/TestRpcSocketTxRxQueue
[ RUN ] Parameters/TestRpcSocketTxRxQueue.OverCapacity/0
W20260924 16:02:11.135300 7563 negotiation.cc:337] Failed RPC negotiation. Trace:
0924 16:02:10.844461 (+ 0us) reactor.cc:625] Submitting negotiation task for client connection to 0.0.0.0:41235 (local address 127.0.0.1:39340)
0924 16:02:10.844624 (+ 163us) negotiation.cc:107] Waiting for socket to connect
0924 16:02:10.844642 (+ 18us) client_negotiation.cc:174] Beginning negotiation
0924 16:02:10.844754 (+ 112us) client_negotiation.cc:252] Sending NEGOTIATE NegotiatePB request
0924 16:02:11.134612 (+289858us) negotiation.cc:327] Negotiation complete: Network error: Client connection negotiation failed: client connection to 0.0.0.0:41235: BlockingRecv error: recv error from unknown peer: Transport endpoint is not connected (error 107)
Metrics: {"client-negotiator.queue_time_us":32}
W20260924 16:02:11.135329 7545 negotiation.cc:337] Failed RPC negotiation. Trace:
0924 16:02:10.839753 (+ 0us) reactor.cc:625] Submitting negotiation task for client connection to 0.0.0.0:41235 (local address 127.0.0.1:39322)
0924 16:02:10.839925 (+ 172us) negotiation.cc:107] Waiting for socket to connect
0924 16:02:10.839942 (+ 17us) client_negotiation.cc:174] Beginning negotiation
0924 16:02:10.840056 (+ 114us) client_negotiation.cc:252] Sending NEGOTIATE NegotiatePB request
0924 16:02:11.134585 (+294529us) negotiation.cc:327] Negotiation complete: Network error: Client connection negotiation failed: client connection to 0.0.0.0:41235: BlockingRecv error: recv error from unknown peer: Transport endpoint is not connected (error 107)
Metrics: {"client-negotiator.queue_time_us":52}
W20260924 16:02:11.135888 7572 negotiation.cc:337] Failed RPC negotiation. Trace:
0924 16:02:10.847494 (+ 0us) reactor.cc:625] Submitting negotiation task for client connection to 0.0.0.0:41235 (local address 127.0.0.1:39350)
0924 16:02:10.847723 (+ 229us) negotiation.cc:107] Waiting for socket to connect
0924 16:02:10.847741 (+ 18us) client_negotiation.cc:174] Beginning negotiation
0924 16:02:10.847872 (+ 131us) client_negotiation.cc:252] Sending NEGOTIATE NegotiatePB request
0924 16:02:11.135439 (+287567us) negotiation.cc:327] Negotiation complete: Network error: Client connection negotiation failed: client connection to 0.0.0.0:41235: BlockingRecv error: recv error from unknown peer: Transport endpoint is not connected (error 107)
Metrics: {"client-negotiator.queue_time_us":56}
W20260924 16:02:11.135955 7554 negotiation.cc:337] Failed RPC negotiation. Trace:
0924 16:02:10.842158 (+ 0us) reactor.cc:625] Submitting negotiation task for client connection to 0.0.0.0:41235 (local address 127.0.0.1:39330)
0924 16:02:10.842341 (+ 183us) negotiation.cc:107] Waiting for socket to connect
0924 16:02:10.842365 (+ 24us) client_negotiation.cc:174] Beginning negotiation
0924 16:02:10.842455 (+ 90us) client_negotiation.cc:252] Sending NEGOTIATE NegotiatePB request
0924 16:02:11.134585 (+292130us) negotiation.cc:327] Negotiation complete: Network error: Client connection negotiation failed: client connection to 0.0.0.0:41235: BlockingRecv error: recv error from unknown peer: Transport endpoint is not connected (error 107)
Metrics: {"client-negotiator.queue_time_us":59}
W20260924 16:02:11.136077 7581 negotiation.cc:337] Failed RPC negotiation. Trace:
0924 16:02:10.850647 (+ 0us) reactor.cc:625] Submitting negotiation task for client connection to 0.0.0.0:41235 (local address 127.0.0.1:39356)
0924 16:02:10.850891 (+ 244us) negotiation.cc:107] Waiting for socket to connect
0924 16:02:10.850908 (+ 17us) client_negotiation.cc:174] Beginning negotiation
0924 16:02:10.851030 (+ 122us) client_negotiation.cc:252] Sending NEGOTIATE NegotiatePB request
0924 16:02:11.135339 (+284309us) negotiation.cc:327] Negotiation complete: Network error: Client connection negotiation failed: client connection to 0.0.0.0:41235: BlockingRecv error: recv error from unknown peer: Transport endpoint is not connected (error 107)
Metrics: {"client-negotiator.queue_time_us":71}
W20260924 16:02:11.141531 7590 negotiation.cc:337] Failed RPC negotiation. Trace:
0924 16:02:10.853939 (+ 0us) reactor.cc:625] Submitting negotiation task for client connection to 0.0.0.0:41235 (local address 127.0.0.1:39368)
0924 16:02:10.854125 (+ 186us) negotiation.cc:107] Waiting for socket to connect
0924 16:02:10.854144 (+ 19us) client_negotiation.cc:174] Beginning negotiation
0924 16:02:10.854262 (+ 118us) client_negotiation.cc:252] Sending NEGOTIATE NegotiatePB request
0924 16:02:11.135271 (+281009us) negotiation.cc:327] Negotiation complete: Network error: Client connection negotiation failed: client connection to 0.0.0.0:41235: BlockingRecv error: recv error from unknown peer: Transport endpoint is not connected (error 107)
Metrics: {"client-negotiator.queue_time_us":44}
[ OK ] Parameters/TestRpcSocketTxRxQueue.OverCapacity/0 (1078 ms)
[----------] 1 test from Parameters/TestRpcSocketTxRxQueue (1078 ms total)
[----------] Global test environment tear-down
[==========] 21 tests from 2 test suites ran. (59168 ms total)
[ PASSED ] 20 tests.
[ FAILED ] 1 test, listed below:
[ FAILED ] Parameters/TestRpc.TestCallWithChainCertAndChainCA/SSL_TCP, where GetParam() = (true, false)
1 FAILED TEST