Diagnosed failure

Parameters/TestRpc.TestCallWithChainCertAndChainCA/SSL_UnixSocket: /data0/somelongdirectorytoavoidrpathissues/src/kudu/src/kudu/rpc/rpc-test.cc:270: Failure
Failed
Bad status: Runtime error: could not verify certificate chain (error with cert: subject=CN = localhost, ST = sadfjas, C = AS, emailAddress = sdflkdsajf, O = lskdfjlsad, OU = sldfkja, issuer=C = AS, ST = ASDfkjdhf, L = lskdjf, O = saldfja, OU = skdjf, CN = localhost, emailAddress = sadjflkadsj): : certificate has expired
Google Test trace:
/data0/somelongdirectorytoavoidrpathissues/src/kudu/src/kudu/rpc/rpc-test.cc:267: Connecting to unix:/tmp/dist-test-taskH4SUfK/test-tmp/rpc-test-c9888ec242a644e587affd8896bd53b5.sock
I20260925 21:58:26.260597  1220 test_util.cc:175] -----------------------------------------------
I20260925 21:58:26.260658  1220 test_util.cc:176] Had fatal failures, leaving test files at /tmp/dist-test-taskH4SUfK/test-tmp/rpc-test.6.Parameters_TestRpc.TestCallWithChainCertAndChainCA_SSL_UnixSocket.1790373506208586-1220-0

Full log

Note: This is test shard 7 of 8.
[==========] Running 21 tests from 2 test suites.
[----------] Global test environment set-up.
[----------] 20 tests from Parameters/TestRpc
[ RUN      ] Parameters/TestRpc.TestMessengerCreateDestroy/SSL_UnixSocket
WARNING: Logging before InitGoogleLogging() is written to STDERR
I20260925 21:58:26.231221  1220 rpc-test.cc:169] started messenger TestCreateDestroy
[       OK ] Parameters/TestRpc.TestMessengerCreateDestroy/SSL_UnixSocket (20 ms)
[ RUN      ] Parameters/TestRpc.TestNegotiationDeadlock/SSL_UnixSocket
I20260925 21:58:26.238618  1240 acceptor_pool.cc:254] collecting diagnostics on the listening RPC socket unix:/tmp/dist-test-taskH4SUfK/test-tmp/rpc-test-2ea785bc587d414d8ed8aee30bb7b1fa.sock every 8 connection(s)
I20260925 21:58:26.238634  1241 acceptor_pool.cc:254] collecting diagnostics on the listening RPC socket unix:/tmp/dist-test-taskH4SUfK/test-tmp/rpc-test-2ea785bc587d414d8ed8aee30bb7b1fa.sock every 8 connection(s)
[       OK ] Parameters/TestRpc.TestNegotiationDeadlock/SSL_UnixSocket (13 ms)
[ RUN      ] Parameters/TestRpc.TestCallWithChainCertAndChainCA/SSL_UnixSocket
I20260925 21:58:26.256270  1256 acceptor_pool.cc:254] collecting diagnostics on the listening RPC socket unix:/tmp/dist-test-taskH4SUfK/test-tmp/rpc-test-c9888ec242a644e587affd8896bd53b5.sock every 8 connection(s)
I20260925 21:58:26.256294  1257 acceptor_pool.cc:254] collecting diagnostics on the listening RPC socket unix:/tmp/dist-test-taskH4SUfK/test-tmp/rpc-test-c9888ec242a644e587affd8896bd53b5.sock every 8 connection(s)
/data0/somelongdirectorytoavoidrpathissues/src/kudu/src/kudu/rpc/rpc-test.cc:270: Failure
Failed
Bad status: Runtime error: could not verify certificate chain (error with cert: subject=CN = localhost, ST = sadfjas, C = AS, emailAddress = sdflkdsajf, O = lskdfjlsad, OU = sldfkja, issuer=C = AS, ST = ASDfkjdhf, L = lskdjf, O = saldfja, OU = skdjf, CN = localhost, emailAddress = sadjflkadsj): : certificate has expired
Google Test trace:
/data0/somelongdirectorytoavoidrpathissues/src/kudu/src/kudu/rpc/rpc-test.cc:267: Connecting to unix:/tmp/dist-test-taskH4SUfK/test-tmp/rpc-test-c9888ec242a644e587affd8896bd53b5.sock
I20260925 21:58:26.260597  1220 test_util.cc:175] -----------------------------------------------
I20260925 21:58:26.260658  1220 test_util.cc:176] Had fatal failures, leaving test files at /tmp/dist-test-taskH4SUfK/test-tmp/rpc-test.6.Parameters_TestRpc.TestCallWithChainCertAndChainCA_SSL_UnixSocket.1790373506208586-1220-0
[  FAILED  ] Parameters/TestRpc.TestCallWithChainCertAndChainCA/SSL_UnixSocket, where GetParam() = (true, true) (14 ms)
[ RUN      ] Parameters/TestRpc.TestCallWithPasswordProtectedKey/SSL_UnixSocket
I20260925 21:58:26.269594  1281 acceptor_pool.cc:254] collecting diagnostics on the listening RPC socket unix:/tmp/dist-test-taskH4SUfK/test-tmp/rpc-test-0467b911f297439280ad214218f18102.sock every 8 connection(s)
I20260925 21:58:26.269667  1282 acceptor_pool.cc:254] collecting diagnostics on the listening RPC socket unix:/tmp/dist-test-taskH4SUfK/test-tmp/rpc-test-0467b911f297439280ad214218f18102.sock every 8 connection(s)
W20260925 21:58:26.282124  1278 connection.cc:196] Error closing socket: Network error: TlsSocket::Close: Broken pipe
[       OK ] Parameters/TestRpc.TestCallWithPasswordProtectedKey/SSL_UnixSocket (23 ms)
[ RUN      ] Parameters/TestRpc.TestCallToBadServer/SSL_UnixSocket
I20260925 21:58:26.297729  1220 rpc-test.cc:394] Status: Network error: Client connection negotiation failed: client connection to 0.0.0.0:0: connect: Connection refused (error 111)
I20260925 21:58:26.298424  1220 rpc-test.cc:394] Status: Network error: Client connection negotiation failed: client connection to 0.0.0.0:0: connect: Connection refused (error 111)
I20260925 21:58:26.298763  1220 rpc-test.cc:394] Status: Network error: Client connection negotiation failed: client connection to 0.0.0.0:0: connect: Connection refused (error 111)
I20260925 21:58:26.299098  1220 rpc-test.cc:394] Status: Network error: Client connection negotiation failed: client connection to 0.0.0.0:0: connect: Connection refused (error 111)
I20260925 21:58:26.299312  1220 rpc-test.cc:394] Status: Network error: Client connection negotiation failed: client connection to 0.0.0.0:0: connect: Connection refused (error 111)
[       OK ] Parameters/TestRpc.TestCallToBadServer/SSL_UnixSocket (16 ms)
[ RUN      ] Parameters/TestRpc.TestWrongService/SSL_UnixSocket
I20260925 21:58:26.308530  1316 acceptor_pool.cc:254] collecting diagnostics on the listening RPC socket unix:/tmp/dist-test-taskH4SUfK/test-tmp/rpc-test-003c7ff7c74b4fb58fb0d5f9d7bd3109.sock every 8 connection(s)
I20260925 21:58:26.308561  1317 acceptor_pool.cc:254] collecting diagnostics on the listening RPC socket unix:/tmp/dist-test-taskH4SUfK/test-tmp/rpc-test-003c7ff7c74b4fb58fb0d5f9d7bd3109.sock every 8 connection(s)
I20260925 21:58:26.329952  1313 messenger.cc:345] service WrongServiceName not registered on TestServer
[       OK ] Parameters/TestRpc.TestWrongService/SSL_UnixSocket (31 ms)
[ RUN      ] Parameters/TestRpc.TestConnectionKeepalive/SSL_UnixSocket
I20260925 21:58:26.338900  1339 acceptor_pool.cc:254] collecting diagnostics on the listening RPC socket unix:/tmp/dist-test-taskH4SUfK/test-tmp/rpc-test-72d73fed732640b2af61a29aebccc2ae.sock every 8 connection(s)
I20260925 21:58:26.338935  1340 acceptor_pool.cc:254] collecting diagnostics on the listening RPC socket unix:/tmp/dist-test-taskH4SUfK/test-tmp/rpc-test-72d73fed732640b2af61a29aebccc2ae.sock every 8 connection(s)
I20260925 21:58:26.339154  1220 rpc-test.cc:488] Connecting to unix:/tmp/dist-test-taskH4SUfK/test-tmp/rpc-test-72d73fed732640b2af61a29aebccc2ae.sock
W20260925 21:58:26.832744  1352 connection.cc:196] Error closing socket: Network error: TlsSocket::Close: Broken pipe
[       OK ] Parameters/TestRpc.TestConnectionKeepalive/SSL_UnixSocket (1031 ms)
[ RUN      ] Parameters/TestRpc.TestClientConnectionMetrics/SSL_UnixSocket
I20260925 21:58:27.379444  1364 acceptor_pool.cc:254] collecting diagnostics on the listening RPC socket unix:/tmp/dist-test-taskH4SUfK/test-tmp/rpc-test-71101772464c4c17adedcb74d34cf773.sock every 8 connection(s)
I20260925 21:58:27.379483  1365 acceptor_pool.cc:254] collecting diagnostics on the listening RPC socket unix:/tmp/dist-test-taskH4SUfK/test-tmp/rpc-test-71101772464c4c17adedcb74d34cf773.sock every 8 connection(s)
I20260925 21:58:27.379719  1220 rpc-test.cc:569] Connecting to unix:/tmp/dist-test-taskH4SUfK/test-tmp/rpc-test-71101772464c4c17adedcb74d34cf773.sock
W20260925 21:58:36.637985  1361 connection.cc:196] Error closing socket: Network error: TlsSocket::Close: Broken pipe
[       OK ] Parameters/TestRpc.TestClientConnectionMetrics/SSL_UnixSocket (9275 ms)
[ RUN      ] Parameters/TestRpc.TestCredentialsPolicy/SSL_UnixSocket
I20260925 21:58:36.652772  1387 acceptor_pool.cc:254] collecting diagnostics on the listening RPC socket unix:/tmp/dist-test-taskH4SUfK/test-tmp/rpc-test-5237fe6b394043e0804d3aaad2ca0b1a.sock every 8 connection(s)
I20260925 21:58:36.652813  1388 acceptor_pool.cc:254] collecting diagnostics on the listening RPC socket unix:/tmp/dist-test-taskH4SUfK/test-tmp/rpc-test-5237fe6b394043e0804d3aaad2ca0b1a.sock every 8 connection(s)
I20260925 21:58:36.652982  1220 rpc-test.cc:700] Connecting to unix:/tmp/dist-test-taskH4SUfK/test-tmp/rpc-test-5237fe6b394043e0804d3aaad2ca0b1a.sock
W20260925 21:58:36.669167  1386 connection.cc:196] Error closing socket: Network error: TlsSocket::Close: Broken pipe
[       OK ] Parameters/TestRpc.TestCredentialsPolicy/SSL_UnixSocket (34 ms)
[ RUN      ] Parameters/TestRpc.TestCallLongerThanKeepalive/SSL_UnixSocket
I20260925 21:58:36.680773  1412 acceptor_pool.cc:254] collecting diagnostics on the listening RPC socket unix:/tmp/dist-test-taskH4SUfK/test-tmp/rpc-test-be94daf8df574dba82f1bd287b70a817.sock every 8 connection(s)
I20260925 21:58:36.680809  1413 acceptor_pool.cc:254] collecting diagnostics on the listening RPC socket unix:/tmp/dist-test-taskH4SUfK/test-tmp/rpc-test-be94daf8df574dba82f1bd287b70a817.sock every 8 connection(s)
I20260925 21:58:36.695807  1416 rpc-test-base.h:222] got call: sleep_micros: 3000000 deferred: true
I20260925 21:58:39.696511  1416 rpcz_store.cc:275] Call kudu.rpc.GenericCalculatorService.Sleep from unix:<unnamed> (request call id 0) took 3000 ms. Trace:
I20260925 21:58:39.696621  1416 rpcz_store.cc:276] 0925 21:58:36.695732 (+     0us) service_pool.cc:170] Inserting onto call queue
0925 21:58:36.695789 (+    57us) service_pool.cc:227] Handling call
0925 21:58:39.696493 (+3000704us) inbound_call.cc:173] Queueing success response
Metrics: {}
W20260925 21:58:39.698110  1409 connection.cc:196] Error closing socket: Network error: TlsSocket::Close: Broken pipe
[       OK ] Parameters/TestRpc.TestCallLongerThanKeepalive/SSL_UnixSocket (3025 ms)
[ RUN      ] Parameters/TestRpc.TestRpcSidecar/SSL_UnixSocket
I20260925 21:58:39.712726  1437 acceptor_pool.cc:254] collecting diagnostics on the listening RPC socket unix:/tmp/dist-test-taskH4SUfK/test-tmp/rpc-test-528b0f6802d54a95b0d9f28fccd31e35.sock every 8 connection(s)
I20260925 21:58:39.712738  1438 acceptor_pool.cc:254] collecting diagnostics on the listening RPC socket unix:/tmp/dist-test-taskH4SUfK/test-tmp/rpc-test-528b0f6802d54a95b0d9f28fccd31e35.sock every 8 connection(s)
W20260925 21:58:39.757304  1434 connection.cc:196] Error closing socket: Network error: TlsSocket::Close: Broken pipe
[       OK ] Parameters/TestRpc.TestRpcSidecar/SSL_UnixSocket (59 ms)
[ RUN      ] Parameters/TestRpc.TestRpcSidecarLimits/SSL_UnixSocket
I20260925 21:58:41.722517  1462 acceptor_pool.cc:254] collecting diagnostics on the listening RPC socket unix:/tmp/dist-test-taskH4SUfK/test-tmp/rpc-test-a11f4153828d4296ae0de50e0a9d174c.sock every 8 connection(s)
I20260925 21:58:41.722527  1463 acceptor_pool.cc:254] collecting diagnostics on the listening RPC socket unix:/tmp/dist-test-taskH4SUfK/test-tmp/rpc-test-a11f4153828d4296ae0de50e0a9d174c.sock every 8 connection(s)
W20260925 21:58:41.734288  1220 serialization.cc:72] Serialized kudu.rpc_test.PushStringsRequestPB (2147483654 bytes) is larger than the maximum configured RPC message size (52428800 bytes). Sending anyway, but peer may reject the data.
W20260925 21:58:41.737919  1459 connection.cc:535] server connection from unix:<unnamed> recv error: Network error: RPC frame had a length of 2147483714, but we only support messages up to 52428800 bytes long.
W20260925 21:58:41.737986  1459 connection.cc:158] shutting down server connection from unix:<unnamed> with pending inbound data: 4/2147483714 bytes received; last active 0 ns ago: status Network error: RPC frame had a length of 2147483714, but we only support messages up to 52428800 bytes long.
W20260925 21:58:41.738255  1475 connection.cc:196] Error closing socket: Network error: TlsSocket::Close: Broken pipe
I20260925 21:58:41.759804  1487 acceptor_pool.cc:254] collecting diagnostics on the listening RPC socket unix:/tmp/dist-test-taskH4SUfK/test-tmp/rpc-test-a11f4153828d4296ae0de50e0a9d174c.sock every 8 connection(s)
I20260925 21:58:41.759902  1488 acceptor_pool.cc:254] collecting diagnostics on the listening RPC socket unix:/tmp/dist-test-taskH4SUfK/test-tmp/rpc-test-a11f4153828d4296ae0de50e0a9d174c.sock every 8 connection(s)
W20260925 21:58:46.276185  1484 connection.cc:577] server connection from unix:<unnamed>: received bad data: 'Corruption: Invalid packet: message had a length of 2147483710, but we only support messages up to 2147483647 bytes
'
W20260925 21:58:46.276497  1500 connection.cc:196] Error closing socket: Network error: TlsSocket::Close: Broken pipe
[       OK ] Parameters/TestRpc.TestRpcSidecarLimits/SSL_UnixSocket (6519 ms)
[ RUN      ] Parameters/TestRpc.TestCallTimeoutDoesntAffectNegotiation/SSL_UnixSocket
I20260925 21:58:46.289772  1512 acceptor_pool.cc:254] collecting diagnostics on the listening RPC socket unix:/tmp/dist-test-taskH4SUfK/test-tmp/rpc-test-4c15877cea57456daa86d57596b671c7.sock every 8 connection(s)
I20260925 21:58:46.289906  1513 acceptor_pool.cc:254] collecting diagnostics on the listening RPC socket unix:/tmp/dist-test-taskH4SUfK/test-tmp/rpc-test-4c15877cea57456daa86d57596b671c7.sock every 8 connection(s)
W20260925 21:58:46.310021  1508 negotiation.cc:266] Injecting 500ms delay in negotiation
I20260925 21:58:46.360337  1220 rpc-test-base.h:595] status: Timed out: connection negotiation to unix:/tmp/dist-test-taskH4SUfK/test-tmp/rpc-test-4c15877cea57456daa86d57596b671c7.sock for RPC Sleep timed out after 0.050s (ON_OUTBOUND_QUEUE), seconds elapsed: 0.050705
[       OK ] Parameters/TestRpc.TestCallTimeoutDoesntAffectNegotiation/SSL_UnixSocket (541 ms)
[ RUN      ] Parameters/TestRpc.TestRpcHandlerLatencyMetric/SSL_UnixSocket
I20260925 21:58:46.829696  1537 acceptor_pool.cc:254] collecting diagnostics on the listening RPC socket unix:/tmp/dist-test-taskH4SUfK/test-tmp/rpc-test-5e1f5bf7b26e4679ad129cf711d7e429.sock every 8 connection(s)
I20260925 21:58:46.829804  1538 acceptor_pool.cc:254] collecting diagnostics on the listening RPC socket unix:/tmp/dist-test-taskH4SUfK/test-tmp/rpc-test-5e1f5bf7b26e4679ad129cf711d7e429.sock every 8 connection(s)
I20260925 21:58:46.861059  1220 rpc-test.cc:1236] Sleep() min lat: 20324
I20260925 21:58:46.861156  1220 rpc-test.cc:1237] Sleep() mean lat: 20324
I20260925 21:58:46.861212  1220 rpc-test.cc:1238] Sleep() max lat: 20324
I20260925 21:58:46.861267  1220 rpc-test.cc:1239] Sleep() #calls: 1
W20260925 21:58:46.861930  1534 connection.cc:196] Error closing socket: Network error: TlsSocket::Close: Broken pipe
[       OK ] Parameters/TestRpc.TestRpcHandlerLatencyMetric/SSL_UnixSocket (42 ms)
[ RUN      ] Parameters/TestRpc.TimedOutOnResponseMetricServiceQueue/SSL_UnixSocket
I20260925 21:58:46.877182  1563 acceptor_pool.cc:254] collecting diagnostics on the listening RPC socket unix:/tmp/dist-test-taskH4SUfK/test-tmp/rpc-test-1b34049500e44a8294fb6a7e41929bff.sock every 8 connection(s)
I20260925 21:58:46.877221  1564 acceptor_pool.cc:254] collecting diagnostics on the listening RPC socket unix:/tmp/dist-test-taskH4SUfK/test-tmp/rpc-test-1b34049500e44a8294fb6a7e41929bff.sock every 8 connection(s)
W20260925 21:58:46.932404  1565 rpcz_store.cc:267] Call kudu.rpc_test.CalculatorService.Sleep from unix:<unnamed> (request call id 2) took 20 ms (client timeout 20 ms). Trace:
W20260925 21:58:46.932541  1565 rpcz_store.cc:269] 0925 21:58:46.912102 (+     0us) service_pool.cc:170] Inserting onto call queue
0925 21:58:46.932376 (+ 20274us) service_pool.cc:214] Skipping call since client already timed out
0925 21:58:46.932388 (+    12us) inbound_call.cc:173] Queueing failure response
Metrics: {}
W20260925 21:58:46.933147  1560 connection.cc:196] Error closing socket: Network error: TlsSocket::Close: Broken pipe
[       OK ] Parameters/TestRpc.TimedOutOnResponseMetricServiceQueue/SSL_UnixSocket (71 ms)
[ RUN      ] Parameters/TestRpc.RpcPendingConnectionsMetric/SSL_UnixSocket
I20260925 21:58:46.936136  1586 acceptor_pool.cc:254] collecting diagnostics on the listening RPC socket 0.0.0.0:45365 every 8 connection(s)
I20260925 21:58:46.936203  1587 acceptor_pool.cc:254] collecting diagnostics on the listening RPC socket 0.0.0.0:45365 every 8 connection(s)
W20260925 21:58:46.946501  1582 negotiation.cc:337] Failed RPC negotiation. Trace:
0925 21:58:46.946178 (+     0us) reactor.cc:625] Submitting negotiation task for server connection from 127.0.0.1:59026 (local address 127.0.0.1:45365)
0925 21:58:46.946311 (+   133us) server_negotiation.cc:206] Beginning negotiation
0925 21:58:46.946313 (+     2us) server_negotiation.cc:399] Waiting for connection header
0925 21:58:46.946398 (+    85us) negotiation.cc:327] Negotiation complete: Network error: Server connection negotiation failed: server connection from 127.0.0.1:59026: BlockingRecv error: recv got EOF from 127.0.0.1:59026 (error 108)
Metrics: {"server-negotiator.queue_time_us":94}
[       OK ] Parameters/TestRpc.RpcPendingConnectionsMetric/SSL_UnixSocket (23 ms)
[ RUN      ] Parameters/TestRpc.TestRpcContextClientDeadline/SSL_UnixSocket
I20260925 21:58:46.983278  1603 acceptor_pool.cc:254] collecting diagnostics on the listening RPC socket unix:/tmp/dist-test-taskH4SUfK/test-tmp/rpc-test-fc5a47cead2345789081c61fc8fabc49.sock every 8 connection(s)
I20260925 21:58:46.983304  1602 acceptor_pool.cc:254] collecting diagnostics on the listening RPC socket unix:/tmp/dist-test-taskH4SUfK/test-tmp/rpc-test-fc5a47cead2345789081c61fc8fabc49.sock every 8 connection(s)
[       OK ] Parameters/TestRpc.TestRpcContextClientDeadline/SSL_UnixSocket (77 ms)
[ RUN      ] Parameters/TestRpc.TestApplicationFeatureFlagUnsupportedServer/SSL_UnixSocket
I20260925 21:58:47.055004  1627 acceptor_pool.cc:254] collecting diagnostics on the listening RPC socket unix:/tmp/dist-test-taskH4SUfK/test-tmp/rpc-test-362d22ac23a84db2a87e65f16a897521.sock every 8 connection(s)
I20260925 21:58:47.055022  1628 acceptor_pool.cc:254] collecting diagnostics on the listening RPC socket unix:/tmp/dist-test-taskH4SUfK/test-tmp/rpc-test-362d22ac23a84db2a87e65f16a897521.sock every 8 connection(s)
[       OK ] Parameters/TestRpc.TestApplicationFeatureFlagUnsupportedServer/SSL_UnixSocket (40 ms)
[ RUN      ] Parameters/TestRpc.TestCancellationAsync/SSL_UnixSocket
I20260925 21:58:47.084673  1653 acceptor_pool.cc:254] collecting diagnostics on the listening RPC socket unix:/tmp/dist-test-taskH4SUfK/test-tmp/rpc-test-60be113c88f146beb17e61e3d301229d.sock every 8 connection(s)
I20260925 21:58:47.084657  1652 acceptor_pool.cc:254] collecting diagnostics on the listening RPC socket unix:/tmp/dist-test-taskH4SUfK/test-tmp/rpc-test-60be113c88f146beb17e61e3d301229d.sock every 8 connection(s)
I20260925 21:58:47.084868  1220 rpc-test.cc:1716] Connecting to unix:/tmp/dist-test-taskH4SUfK/test-tmp/rpc-test-60be113c88f146beb17e61e3d301229d.sock
I20260925 21:58:47.095183  1220 test_util.cc:268] Using random seed: -770111604
I20260925 21:58:47.108768  1655 rpc-test-base.h:240] got call: sleep_micros: 500 pattern: 4294967295 num_repetitions: 2097152 sidecar_idx: 0
I20260925 21:58:47.119503  1655 rpc-test-base.h:240] got call: sleep_micros: 500 pattern: 4294967295 num_repetitions: 2097152 sidecar_idx: 0
I20260925 21:58:47.130287  1655 rpc-test-base.h:240] got call: sleep_micros: 500 pattern: 4294967295 num_repetitions: 2097152 sidecar_idx: 0
I20260925 21:58:47.140977  1655 rpc-test-base.h:240] got call: sleep_micros: 500 pattern: 4294967295 num_repetitions: 2097152 sidecar_idx: 0
I20260925 21:58:47.152272  1655 rpc-test-base.h:240] got call: sleep_micros: 500 pattern: 4294967295 num_repetitions: 2097152 sidecar_idx: 0
I20260925 21:58:47.163103  1655 rpc-test-base.h:240] got call: sleep_micros: 500 pattern: 4294967295 num_repetitions: 2097152 sidecar_idx: 0
I20260925 21:58:47.173978  1655 rpc-test-base.h:240] got call: sleep_micros: 500 pattern: 4294967295 num_repetitions: 2097152 sidecar_idx: 0
I20260925 21:58:47.184790  1655 rpc-test-base.h:240] got call: sleep_micros: 500 pattern: 4294967295 num_repetitions: 2097152 sidecar_idx: 0
W20260925 21:58:47.186546  1649 connection.cc:196] Error closing socket: Network error: TlsSocket::Close: Broken pipe
W20260925 21:58:47.188138  1649 connection.cc:441] server connection from unix:<unnamed> torn down before Call kudu.rpc.GenericCalculatorService.SleepWithSidecar from unix:<unnamed> (request call id 9) could send its response
[       OK ] Parameters/TestRpc.TestCancellationAsync/SSL_UnixSocket (113 ms)
[ RUN      ] Parameters/TestRpc.TestPerformanceBySocketType/SSL_UnixSocket
I20260925 21:58:47.209635  1677 acceptor_pool.cc:254] collecting diagnostics on the listening RPC socket unix:/tmp/dist-test-taskH4SUfK/test-tmp/rpc-test-73b0e1ca06b74be39a6f5e40df6a7815.sock every 8 connection(s)
I20260925 21:58:47.209688  1678 acceptor_pool.cc:254] collecting diagnostics on the listening RPC socket unix:/tmp/dist-test-taskH4SUfK/test-tmp/rpc-test-73b0e1ca06b74be39a6f5e40df6a7815.sock every 8 connection(s)
I20260925 21:58:47.209851  1220 rpc-test.cc:1846] Connecting to unix:/tmp/dist-test-taskH4SUfK/test-tmp/rpc-test-73b0e1ca06b74be39a6f5e40df6a7815.sock
I20260925 21:58:48.627907  1220 rpc-test.cc:1859] Sending 1024MB via ssl-enabled unix socket: real 1.393s	user 1.567s	sys 0.908s
I20260925 21:58:50.006764  1220 rpc-test.cc:1859] Sending 1024MB via ssl-enabled unix socket: real 1.379s	user 1.533s	sys 0.912s
I20260925 21:58:51.405405  1220 rpc-test.cc:1859] Sending 1024MB via ssl-enabled unix socket: real 1.399s	user 1.536s	sys 0.953s
I20260925 21:58:52.809875  1220 rpc-test.cc:1859] Sending 1024MB via ssl-enabled unix socket: real 1.404s	user 1.674s	sys 0.815s
I20260925 21:58:54.185249  1220 rpc-test.cc:1859] Sending 1024MB via ssl-enabled unix socket: real 1.375s	user 1.467s	sys 0.967s
W20260925 21:58:54.185985  1674 connection.cc:196] Error closing socket: Network error: TlsSocket::Close: Broken pipe
[       OK ] Parameters/TestRpc.TestPerformanceBySocketType/SSL_UnixSocket (6997 ms)
[----------] 20 tests from Parameters/TestRpc (27975 ms total)

[----------] 1 test from Parameters/TestRpcSocketTxRxQueue
[ RUN      ] Parameters/TestRpcSocketTxRxQueue.AcceptorRxQueueSizeMetric/0
I20260925 21:58:54.194311  1702 acceptor_pool.cc:254] collecting diagnostics on the listening RPC socket 0.0.0.0:35531 every 1 connection(s)
I20260925 21:58:54.194386  1703 acceptor_pool.cc:254] collecting diagnostics on the listening RPC socket 0.0.0.0:35531 every 1 connection(s)
W20260925 21:58:54.195101  1698 negotiation.cc:337] Failed RPC negotiation. Trace:
0925 21:58:54.194899 (+     0us) reactor.cc:625] Submitting negotiation task for server connection from 127.0.0.1:54830 (local address 127.0.0.1:35531)
0925 21:58:54.194986 (+    87us) server_negotiation.cc:206] Beginning negotiation
0925 21:58:54.194993 (+     7us) server_negotiation.cc:399] Waiting for connection header
0925 21:58:54.195065 (+    72us) negotiation.cc:327] Negotiation complete: Network error: Server connection negotiation failed: server connection from 127.0.0.1:54830: BlockingRecv error: recv got EOF from 127.0.0.1:54830 (error 108)
Metrics: {"server-negotiator.queue_time_us":47}
[       OK ] Parameters/TestRpcSocketTxRxQueue.AcceptorRxQueueSizeMetric/0 (10 ms)
[----------] 1 test from Parameters/TestRpcSocketTxRxQueue (10 ms total)

[----------] Global test environment tear-down
[==========] 21 tests from 2 test suites ran. (27986 ms total)
[  PASSED  ] 20 tests.
[  FAILED  ] 1 test, listed below:
[  FAILED  ] Parameters/TestRpc.TestCallWithChainCertAndChainCA/SSL_UnixSocket, where GetParam() = (true, true)

 1 FAILED TEST