Diagnosed failure
Parameters/TestRpc.TestCallWithChainCertAndChainCA/SSL_UnixSocket: /data0/somelongdirectorytoavoidrpathissues/src/kudu/src/kudu/rpc/rpc-test.cc:270: Failure
Failed
Bad status: Runtime error: could not verify certificate chain (error with cert: subject=CN = localhost, ST = sadfjas, C = AS, emailAddress = sdflkdsajf, O = lskdfjlsad, OU = sldfkja, issuer=C = AS, ST = ASDfkjdhf, L = lskdjf, O = saldfja, OU = skdjf, CN = localhost, emailAddress = sadjflkadsj): : certificate has expired
Google Test trace:
/data0/somelongdirectorytoavoidrpathissues/src/kudu/src/kudu/rpc/rpc-test.cc:267: Connecting to unix:/tmp/dist-test-taskg3KWW8/test-tmp/rpc-test-ff723234a97e47ca9b377c031c61c774.sock
I20260927 01:38:44.657840 4850 test_util.cc:175] -----------------------------------------------
I20260927 01:38:44.657982 4850 test_util.cc:176] Had fatal failures, leaving test files at /tmp/dist-test-taskg3KWW8/test-tmp/rpc-test.6.Parameters_TestRpc.TestCallWithChainCertAndChainCA_SSL_UnixSocket.1790473124514147-4850-0
Full log
Note: This is test shard 7 of 8.
[==========] Running 21 tests from 2 test suites.
[----------] Global test environment set-up.
[----------] 20 tests from Parameters/TestRpc
[ RUN ] Parameters/TestRpc.TestMessengerCreateDestroy/SSL_UnixSocket
WARNING: Logging before InitGoogleLogging() is written to STDERR
I20260927 01:38:44.567236 4850 rpc-test.cc:169] started messenger TestCreateDestroy
[ OK ] Parameters/TestRpc.TestMessengerCreateDestroy/SSL_UnixSocket (36 ms)
[ RUN ] Parameters/TestRpc.TestNegotiationDeadlock/SSL_UnixSocket
I20260927 01:38:44.586599 4870 acceptor_pool.cc:254] collecting diagnostics on the listening RPC socket unix:/tmp/dist-test-taskg3KWW8/test-tmp/rpc-test-1a55584a7b0844c99af742f1dcc3b7b8.sock every 8 connection(s)
I20260927 01:38:44.586881 4871 acceptor_pool.cc:254] collecting diagnostics on the listening RPC socket unix:/tmp/dist-test-taskg3KWW8/test-tmp/rpc-test-1a55584a7b0844c99af742f1dcc3b7b8.sock every 8 connection(s)
[ OK ] Parameters/TestRpc.TestNegotiationDeadlock/SSL_UnixSocket (36 ms)
[ RUN ] Parameters/TestRpc.TestCallWithChainCertAndChainCA/SSL_UnixSocket
I20260927 01:38:44.633332 4886 acceptor_pool.cc:254] collecting diagnostics on the listening RPC socket unix:/tmp/dist-test-taskg3KWW8/test-tmp/rpc-test-ff723234a97e47ca9b377c031c61c774.sock every 8 connection(s)
I20260927 01:38:44.633621 4887 acceptor_pool.cc:254] collecting diagnostics on the listening RPC socket unix:/tmp/dist-test-taskg3KWW8/test-tmp/rpc-test-ff723234a97e47ca9b377c031c61c774.sock every 8 connection(s)
/data0/somelongdirectorytoavoidrpathissues/src/kudu/src/kudu/rpc/rpc-test.cc:270: Failure
Failed
Bad status: Runtime error: could not verify certificate chain (error with cert: subject=CN = localhost, ST = sadfjas, C = AS, emailAddress = sdflkdsajf, O = lskdfjlsad, OU = sldfkja, issuer=C = AS, ST = ASDfkjdhf, L = lskdjf, O = saldfja, OU = skdjf, CN = localhost, emailAddress = sadjflkadsj): : certificate has expired
Google Test trace:
/data0/somelongdirectorytoavoidrpathissues/src/kudu/src/kudu/rpc/rpc-test.cc:267: Connecting to unix:/tmp/dist-test-taskg3KWW8/test-tmp/rpc-test-ff723234a97e47ca9b377c031c61c774.sock
I20260927 01:38:44.657840 4850 test_util.cc:175] -----------------------------------------------
I20260927 01:38:44.657982 4850 test_util.cc:176] Had fatal failures, leaving test files at /tmp/dist-test-taskg3KWW8/test-tmp/rpc-test.6.Parameters_TestRpc.TestCallWithChainCertAndChainCA_SSL_UnixSocket.1790473124514147-4850-0
[ FAILED ] Parameters/TestRpc.TestCallWithChainCertAndChainCA/SSL_UnixSocket, where GetParam() = (true, true) (50 ms)
[ RUN ] Parameters/TestRpc.TestCallWithPasswordProtectedKey/SSL_UnixSocket
I20260927 01:38:44.682396 4911 acceptor_pool.cc:254] collecting diagnostics on the listening RPC socket unix:/tmp/dist-test-taskg3KWW8/test-tmp/rpc-test-adbcf3e1084f4e658c491f0c45c5c205.sock every 8 connection(s)
I20260927 01:38:44.682770 4912 acceptor_pool.cc:254] collecting diagnostics on the listening RPC socket unix:/tmp/dist-test-taskg3KWW8/test-tmp/rpc-test-adbcf3e1084f4e658c491f0c45c5c205.sock every 8 connection(s)
W20260927 01:38:44.715008 4908 connection.cc:196] Error closing socket: Network error: TlsSocket::Close: Broken pipe
[ OK ] Parameters/TestRpc.TestCallWithPasswordProtectedKey/SSL_UnixSocket (61 ms)
[ RUN ] Parameters/TestRpc.TestCallToBadServer/SSL_UnixSocket
I20260927 01:38:44.730592 4850 rpc-test.cc:394] Status: Network error: Client connection negotiation failed: client connection to 0.0.0.0:0: connect: Connection refused (error 111)
I20260927 01:38:44.731340 4850 rpc-test.cc:394] Status: Network error: Client connection negotiation failed: client connection to 0.0.0.0:0: connect: Connection refused (error 111)
I20260927 01:38:44.731935 4850 rpc-test.cc:394] Status: Network error: Client connection negotiation failed: client connection to 0.0.0.0:0: connect: Connection refused (error 111)
I20260927 01:38:44.732601 4850 rpc-test.cc:394] Status: Network error: Client connection negotiation failed: client connection to 0.0.0.0:0: connect: Connection refused (error 111)
I20260927 01:38:44.733157 4850 rpc-test.cc:394] Status: Network error: Client connection negotiation failed: client connection to 0.0.0.0:0: connect: Connection refused (error 111)
[ OK ] Parameters/TestRpc.TestCallToBadServer/SSL_UnixSocket (16 ms)
[ RUN ] Parameters/TestRpc.TestWrongService/SSL_UnixSocket
I20260927 01:38:44.750092 4946 acceptor_pool.cc:254] collecting diagnostics on the listening RPC socket unix:/tmp/dist-test-taskg3KWW8/test-tmp/rpc-test-29f6571c01984079be8c3761f959c3e3.sock every 8 connection(s)
I20260927 01:38:44.750376 4947 acceptor_pool.cc:254] collecting diagnostics on the listening RPC socket unix:/tmp/dist-test-taskg3KWW8/test-tmp/rpc-test-29f6571c01984079be8c3761f959c3e3.sock every 8 connection(s)
I20260927 01:38:44.774835 4943 messenger.cc:345] service WrongServiceName not registered on TestServer
[ OK ] Parameters/TestRpc.TestWrongService/SSL_UnixSocket (44 ms)
[ RUN ] Parameters/TestRpc.TestConnectionKeepalive/SSL_UnixSocket
I20260927 01:38:44.797538 4969 acceptor_pool.cc:254] collecting diagnostics on the listening RPC socket unix:/tmp/dist-test-taskg3KWW8/test-tmp/rpc-test-eb09c7c5c0a145ee837b4b0808655183.sock every 8 connection(s)
I20260927 01:38:44.797765 4970 acceptor_pool.cc:254] collecting diagnostics on the listening RPC socket unix:/tmp/dist-test-taskg3KWW8/test-tmp/rpc-test-eb09c7c5c0a145ee837b4b0808655183.sock every 8 connection(s)
I20260927 01:38:44.798718 4850 rpc-test.cc:488] Connecting to unix:/tmp/dist-test-taskg3KWW8/test-tmp/rpc-test-eb09c7c5c0a145ee837b4b0808655183.sock
W20260927 01:38:45.281893 4982 connection.cc:196] Error closing socket: Network error: TlsSocket::Close: Broken pipe
[ OK ] Parameters/TestRpc.TestConnectionKeepalive/SSL_UnixSocket (1052 ms)
[ RUN ] Parameters/TestRpc.TestClientConnectionMetrics/SSL_UnixSocket
I20260927 01:38:45.862751 4994 acceptor_pool.cc:254] collecting diagnostics on the listening RPC socket unix:/tmp/dist-test-taskg3KWW8/test-tmp/rpc-test-c848bfa455204ade88e608bd2a78d846.sock every 8 connection(s)
I20260927 01:38:45.863006 4995 acceptor_pool.cc:254] collecting diagnostics on the listening RPC socket unix:/tmp/dist-test-taskg3KWW8/test-tmp/rpc-test-c848bfa455204ade88e608bd2a78d846.sock every 8 connection(s)
I20260927 01:38:45.863989 4850 rpc-test.cc:569] Connecting to unix:/tmp/dist-test-taskg3KWW8/test-tmp/rpc-test-c848bfa455204ade88e608bd2a78d846.sock
W20260927 01:39:07.558290 4991 connection.cc:196] Error closing socket: Network error: TlsSocket::Close: Broken pipe
[ OK ] Parameters/TestRpc.TestClientConnectionMetrics/SSL_UnixSocket (21732 ms)
[ RUN ] Parameters/TestRpc.TestCredentialsPolicy/SSL_UnixSocket
I20260927 01:39:07.589916 5017 acceptor_pool.cc:254] collecting diagnostics on the listening RPC socket unix:/tmp/dist-test-taskg3KWW8/test-tmp/rpc-test-e1fc6eb9cd6a4339881ed246c337a5c9.sock every 8 connection(s)
I20260927 01:39:07.590188 5018 acceptor_pool.cc:254] collecting diagnostics on the listening RPC socket unix:/tmp/dist-test-taskg3KWW8/test-tmp/rpc-test-e1fc6eb9cd6a4339881ed246c337a5c9.sock every 8 connection(s)
I20260927 01:39:07.591157 4850 rpc-test.cc:700] Connecting to unix:/tmp/dist-test-taskg3KWW8/test-tmp/rpc-test-e1fc6eb9cd6a4339881ed246c337a5c9.sock
W20260927 01:39:07.621418 5016 connection.cc:196] Error closing socket: Network error: TlsSocket::Close: Broken pipe
[ OK ] Parameters/TestRpc.TestCredentialsPolicy/SSL_UnixSocket (67 ms)
[ RUN ] Parameters/TestRpc.TestCallLongerThanKeepalive/SSL_UnixSocket
I20260927 01:39:07.652518 5042 acceptor_pool.cc:254] collecting diagnostics on the listening RPC socket unix:/tmp/dist-test-taskg3KWW8/test-tmp/rpc-test-3025b9acc9aa48278fc4ee036619189d.sock every 8 connection(s)
I20260927 01:39:07.652765 5043 acceptor_pool.cc:254] collecting diagnostics on the listening RPC socket unix:/tmp/dist-test-taskg3KWW8/test-tmp/rpc-test-3025b9acc9aa48278fc4ee036619189d.sock every 8 connection(s)
I20260927 01:39:07.672551 5046 rpc-test-base.h:222] got call: sleep_micros: 3000000 deferred: true
I20260927 01:39:10.674369 5046 rpcz_store.cc:275] Call kudu.rpc.GenericCalculatorService.Sleep from unix:<unnamed> (request call id 0) took 3002 ms. Trace:
I20260927 01:39:10.674567 5046 rpcz_store.cc:276] 0927 01:39:07.672422 (+ 0us) service_pool.cc:170] Inserting onto call queue
0927 01:39:07.672496 (+ 74us) service_pool.cc:227] Handling call
0927 01:39:10.674325 (+3001829us) inbound_call.cc:173] Queueing success response
Metrics: {}
[ OK ] Parameters/TestRpc.TestCallLongerThanKeepalive/SSL_UnixSocket (3049 ms)
[ RUN ] Parameters/TestRpc.TestRpcSidecar/SSL_UnixSocket
I20260927 01:39:10.690532 5067 acceptor_pool.cc:254] collecting diagnostics on the listening RPC socket unix:/tmp/dist-test-taskg3KWW8/test-tmp/rpc-test-ef3b85109ffa4f4eb5e309cf6a73df4f.sock every 8 connection(s)
I20260927 01:39:10.690882 5068 acceptor_pool.cc:254] collecting diagnostics on the listening RPC socket unix:/tmp/dist-test-taskg3KWW8/test-tmp/rpc-test-ef3b85109ffa4f4eb5e309cf6a73df4f.sock every 8 connection(s)
W20260927 01:39:10.789534 5064 connection.cc:196] Error closing socket: Network error: TlsSocket::Close: Broken pipe
[ OK ] Parameters/TestRpc.TestRpcSidecar/SSL_UnixSocket (112 ms)
[ RUN ] Parameters/TestRpc.TestRpcSidecarLimits/SSL_UnixSocket
I20260927 01:39:12.819577 5092 acceptor_pool.cc:254] collecting diagnostics on the listening RPC socket unix:/tmp/dist-test-taskg3KWW8/test-tmp/rpc-test-04fad88f9a0e46e4b9397561951a3a6e.sock every 8 connection(s)
I20260927 01:39:12.819880 5093 acceptor_pool.cc:254] collecting diagnostics on the listening RPC socket unix:/tmp/dist-test-taskg3KWW8/test-tmp/rpc-test-04fad88f9a0e46e4b9397561951a3a6e.sock every 8 connection(s)
W20260927 01:39:12.837980 4850 serialization.cc:72] Serialized kudu.rpc_test.PushStringsRequestPB (2147483654 bytes) is larger than the maximum configured RPC message size (52428800 bytes). Sending anyway, but peer may reject the data.
W20260927 01:39:12.843607 5089 connection.cc:535] server connection from unix:<unnamed> recv error: Network error: RPC frame had a length of 2147483714, but we only support messages up to 52428800 bytes long.
W20260927 01:39:12.843716 5089 connection.cc:158] shutting down server connection from unix:<unnamed> with pending inbound data: 4/2147483714 bytes received; last active 0 ns ago: status Network error: RPC frame had a length of 2147483714, but we only support messages up to 52428800 bytes long.
W20260927 01:39:12.844169 5105 connection.cc:196] Error closing socket: Network error: TlsSocket::Close: Broken pipe
I20260927 01:39:12.863991 5117 acceptor_pool.cc:254] collecting diagnostics on the listening RPC socket unix:/tmp/dist-test-taskg3KWW8/test-tmp/rpc-test-04fad88f9a0e46e4b9397561951a3a6e.sock every 8 connection(s)
I20260927 01:39:12.864360 5118 acceptor_pool.cc:254] collecting diagnostics on the listening RPC socket unix:/tmp/dist-test-taskg3KWW8/test-tmp/rpc-test-04fad88f9a0e46e4b9397561951a3a6e.sock every 8 connection(s)
W20260927 01:39:18.774271 5114 connection.cc:577] server connection from unix:<unnamed>: received bad data: 'Corruption: Invalid packet: message had a length of 2147483710, but we only support messages up to 2147483647 bytes
'
W20260927 01:39:18.775014 5130 connection.cc:196] Error closing socket: Network error: TlsSocket::Close: Broken pipe
[ OK ] Parameters/TestRpc.TestRpcSidecarLimits/SSL_UnixSocket (8442 ms)
[ RUN ] Parameters/TestRpc.TestCallTimeoutDoesntAffectNegotiation/SSL_UnixSocket
I20260927 01:39:19.262055 5142 acceptor_pool.cc:254] collecting diagnostics on the listening RPC socket unix:/tmp/dist-test-taskg3KWW8/test-tmp/rpc-test-6481a57a08d148289d6fe2cd4d96eae3.sock every 8 connection(s)
I20260927 01:39:19.262363 5143 acceptor_pool.cc:254] collecting diagnostics on the listening RPC socket unix:/tmp/dist-test-taskg3KWW8/test-tmp/rpc-test-6481a57a08d148289d6fe2cd4d96eae3.sock every 8 connection(s)
W20260927 01:39:19.285239 5138 negotiation.cc:266] Injecting 500ms delay in negotiation
I20260927 01:39:19.335773 4850 rpc-test-base.h:595] status: Timed out: connection negotiation to unix:/tmp/dist-test-taskg3KWW8/test-tmp/rpc-test-6481a57a08d148289d6fe2cd4d96eae3.sock for RPC Sleep timed out after 0.050s (ON_OUTBOUND_QUEUE), seconds elapsed: 0.0512578
[ OK ] Parameters/TestRpc.TestCallTimeoutDoesntAffectNegotiation/SSL_UnixSocket (559 ms)
[ RUN ] Parameters/TestRpc.TestRpcHandlerLatencyMetric/SSL_UnixSocket
I20260927 01:39:19.810770 5167 acceptor_pool.cc:254] collecting diagnostics on the listening RPC socket unix:/tmp/dist-test-taskg3KWW8/test-tmp/rpc-test-186686c6268b4e7d8e5b79a6379f41cc.sock every 8 connection(s)
I20260927 01:39:19.811013 5168 acceptor_pool.cc:254] collecting diagnostics on the listening RPC socket unix:/tmp/dist-test-taskg3KWW8/test-tmp/rpc-test-186686c6268b4e7d8e5b79a6379f41cc.sock every 8 connection(s)
I20260927 01:39:19.864899 4850 rpc-test.cc:1236] Sleep() min lat: 20680
I20260927 01:39:19.865018 4850 rpc-test.cc:1237] Sleep() mean lat: 20680
I20260927 01:39:19.865087 4850 rpc-test.cc:1238] Sleep() max lat: 20680
I20260927 01:39:19.865108 4850 rpc-test.cc:1239] Sleep() #calls: 1
W20260927 01:39:19.866469 5164 connection.cc:196] Error closing socket: Network error: TlsSocket::Close: Broken pipe
[ OK ] Parameters/TestRpc.TestRpcHandlerLatencyMetric/SSL_UnixSocket (73 ms)
[ RUN ] Parameters/TestRpc.TimedOutOnResponseMetricServiceQueue/SSL_UnixSocket
I20260927 01:39:19.889086 5193 acceptor_pool.cc:254] collecting diagnostics on the listening RPC socket unix:/tmp/dist-test-taskg3KWW8/test-tmp/rpc-test-ae3b04fcef4447e6b6e675b9600c6e2b.sock every 8 connection(s)
I20260927 01:39:19.889369 5194 acceptor_pool.cc:254] collecting diagnostics on the listening RPC socket unix:/tmp/dist-test-taskg3KWW8/test-tmp/rpc-test-ae3b04fcef4447e6b6e675b9600c6e2b.sock every 8 connection(s)
W20260927 01:39:19.966998 5195 rpcz_store.cc:267] Call kudu.rpc_test.CalculatorService.Sleep from unix:<unnamed> (request call id 2) took 20 ms (client timeout 20 ms). Trace:
W20260927 01:39:19.967134 5195 rpcz_store.cc:269] 0927 01:39:19.946528 (+ 0us) service_pool.cc:170] Inserting onto call queue
0927 01:39:19.966922 (+ 20394us) service_pool.cc:214] Skipping call since client already timed out
0927 01:39:19.966974 (+ 52us) inbound_call.cc:173] Queueing failure response
Metrics: {}
[ OK ] Parameters/TestRpc.TimedOutOnResponseMetricServiceQueue/SSL_UnixSocket (102 ms)
[ RUN ] Parameters/TestRpc.RpcPendingConnectionsMetric/SSL_UnixSocket
I20260927 01:39:19.977378 5216 acceptor_pool.cc:254] collecting diagnostics on the listening RPC socket 0.0.0.0:42325 every 8 connection(s)
I20260927 01:39:19.977587 5217 acceptor_pool.cc:254] collecting diagnostics on the listening RPC socket 0.0.0.0:42325 every 8 connection(s)
W20260927 01:39:19.979741 5212 negotiation.cc:337] Failed RPC negotiation. Trace:
0927 01:39:19.979026 (+ 0us) reactor.cc:625] Submitting negotiation task for server connection from 127.0.0.1:36328 (local address 127.0.0.1:42325)
0927 01:39:19.979217 (+ 191us) server_negotiation.cc:206] Beginning negotiation
0927 01:39:19.979265 (+ 48us) server_negotiation.cc:399] Waiting for connection header
0927 01:39:19.979409 (+ 144us) negotiation.cc:327] Negotiation complete: Network error: Server connection negotiation failed: server connection from 127.0.0.1:36328: BlockingRecv error: recv got EOF from 127.0.0.1:36328 (error 108)
Metrics: {"server-negotiator.queue_time_us":72}
[ OK ] Parameters/TestRpc.RpcPendingConnectionsMetric/SSL_UnixSocket (19 ms)
[ RUN ] Parameters/TestRpc.TestRpcContextClientDeadline/SSL_UnixSocket
I20260927 01:39:20.007879 5232 acceptor_pool.cc:254] collecting diagnostics on the listening RPC socket unix:/tmp/dist-test-taskg3KWW8/test-tmp/rpc-test-67d09931c5f747a5981b7096b5f594ab.sock every 8 connection(s)
I20260927 01:39:20.008093 5233 acceptor_pool.cc:254] collecting diagnostics on the listening RPC socket unix:/tmp/dist-test-taskg3KWW8/test-tmp/rpc-test-67d09931c5f747a5981b7096b5f594ab.sock every 8 connection(s)
W20260927 01:39:20.058424 5229 connection.cc:196] Error closing socket: Network error: TlsSocket::Close: Broken pipe
[ OK ] Parameters/TestRpc.TestRpcContextClientDeadline/SSL_UnixSocket (69 ms)
[ RUN ] Parameters/TestRpc.TestApplicationFeatureFlagUnsupportedServer/SSL_UnixSocket
I20260927 01:39:20.086892 5257 acceptor_pool.cc:254] collecting diagnostics on the listening RPC socket unix:/tmp/dist-test-taskg3KWW8/test-tmp/rpc-test-b5ed139e07ce429795a460574d00a336.sock every 8 connection(s)
I20260927 01:39:20.087117 5258 acceptor_pool.cc:254] collecting diagnostics on the listening RPC socket unix:/tmp/dist-test-taskg3KWW8/test-tmp/rpc-test-b5ed139e07ce429795a460574d00a336.sock every 8 connection(s)
[ OK ] Parameters/TestRpc.TestApplicationFeatureFlagUnsupportedServer/SSL_UnixSocket (48 ms)
[ RUN ] Parameters/TestRpc.TestCancellationAsync/SSL_UnixSocket
I20260927 01:39:20.134505 5282 acceptor_pool.cc:254] collecting diagnostics on the listening RPC socket unix:/tmp/dist-test-taskg3KWW8/test-tmp/rpc-test-fffcbc60873942d2a7956d65e8b34dd7.sock every 8 connection(s)
I20260927 01:39:20.134774 5283 acceptor_pool.cc:254] collecting diagnostics on the listening RPC socket unix:/tmp/dist-test-taskg3KWW8/test-tmp/rpc-test-fffcbc60873942d2a7956d65e8b34dd7.sock every 8 connection(s)
I20260927 01:39:20.135695 4850 rpc-test.cc:1716] Connecting to unix:/tmp/dist-test-taskg3KWW8/test-tmp/rpc-test-fffcbc60873942d2a7956d65e8b34dd7.sock
I20260927 01:39:20.164247 4850 test_util.cc:268] Using random seed: 78709626
I20260927 01:39:20.198036 5286 rpc-test-base.h:240] got call: sleep_micros: 500 pattern: 4294967295 num_repetitions: 2097152 sidecar_idx: 0
I20260927 01:39:20.219235 5285 rpc-test-base.h:240] got call: sleep_micros: 500 pattern: 4294967295 num_repetitions: 2097152 sidecar_idx: 0
I20260927 01:39:20.248437 5284 rpc-test-base.h:240] got call: sleep_micros: 500 pattern: 4294967295 num_repetitions: 2097152 sidecar_idx: 0
I20260927 01:39:20.283211 5285 rpc-test-base.h:240] got call: sleep_micros: 500 pattern: 4294967295 num_repetitions: 2097152 sidecar_idx: 0
I20260927 01:39:20.315557 5284 rpc-test-base.h:240] got call: sleep_micros: 500 pattern: 4294967295 num_repetitions: 2097152 sidecar_idx: 0
I20260927 01:39:20.347811 5285 rpc-test-base.h:240] got call: sleep_micros: 500 pattern: 4294967295 num_repetitions: 2097152 sidecar_idx: 0
I20260927 01:39:20.379873 5284 rpc-test-base.h:240] got call: sleep_micros: 500 pattern: 4294967295 num_repetitions: 2097152 sidecar_idx: 0
W20260927 01:39:20.382081 5279 connection.cc:196] Error closing socket: Network error: TlsSocket::Close: Broken pipe
W20260927 01:39:20.404557 5279 connection.cc:441] server connection from unix:<unnamed> torn down before Call kudu.rpc.GenericCalculatorService.SleepWithSidecar from unix:<unnamed> (request call id 8) could send its response
W20260927 01:39:20.425150 5279 connection.cc:441] server connection from unix:<unnamed> torn down before Call kudu.rpc.GenericCalculatorService.SleepWithSidecar from unix:<unnamed> (request call id 9) could send its response
[ OK ] Parameters/TestRpc.TestCancellationAsync/SSL_UnixSocket (317 ms)
[ RUN ] Parameters/TestRpc.TestPerformanceBySocketType/SSL_UnixSocket
I20260927 01:39:20.450786 5307 acceptor_pool.cc:254] collecting diagnostics on the listening RPC socket unix:/tmp/dist-test-taskg3KWW8/test-tmp/rpc-test-2b6b891e353e4133aa67fc346075b755.sock every 8 connection(s)
I20260927 01:39:20.450992 5308 acceptor_pool.cc:254] collecting diagnostics on the listening RPC socket unix:/tmp/dist-test-taskg3KWW8/test-tmp/rpc-test-2b6b891e353e4133aa67fc346075b755.sock every 8 connection(s)
I20260927 01:39:20.451959 4850 rpc-test.cc:1846] Connecting to unix:/tmp/dist-test-taskg3KWW8/test-tmp/rpc-test-2b6b891e353e4133aa67fc346075b755.sock
I20260927 01:39:23.692490 4850 rpc-test.cc:1859] Sending 1024MB via ssl-enabled unix socket: real 3.229s user 3.238s sys 2.214s
I20260927 01:39:26.983240 4850 rpc-test.cc:1859] Sending 1024MB via ssl-enabled unix socket: real 3.291s user 3.254s sys 2.328s
I20260927 01:39:30.243703 4850 rpc-test.cc:1859] Sending 1024MB via ssl-enabled unix socket: real 3.260s user 3.112s sys 2.379s
I20260927 01:39:33.537586 4850 rpc-test.cc:1859] Sending 1024MB via ssl-enabled unix socket: real 3.294s user 3.273s sys 2.298s
I20260927 01:39:36.808660 4850 rpc-test.cc:1859] Sending 1024MB via ssl-enabled unix socket: real 3.271s user 3.238s sys 2.298s
W20260927 01:39:36.809707 5304 connection.cc:196] Error closing socket: Network error: TlsSocket::Close: Broken pipe
[ OK ] Parameters/TestRpc.TestPerformanceBySocketType/SSL_UnixSocket (16388 ms)
[----------] 20 tests from Parameters/TestRpc (52283 ms total)
[----------] 1 test from Parameters/TestRpcSocketTxRxQueue
[ RUN ] Parameters/TestRpcSocketTxRxQueue.AcceptorRxQueueSizeMetric/0
I20260927 01:39:36.831439 5332 acceptor_pool.cc:254] collecting diagnostics on the listening RPC socket 0.0.0.0:39957 every 1 connection(s)
I20260927 01:39:36.831732 5333 acceptor_pool.cc:254] collecting diagnostics on the listening RPC socket 0.0.0.0:39957 every 1 connection(s)
W20260927 01:39:36.833648 5328 negotiation.cc:337] Failed RPC negotiation. Trace:
0927 01:39:36.833243 (+ 0us) reactor.cc:625] Submitting negotiation task for server connection from 127.0.0.1:43714 (local address 127.0.0.1:39957)
0927 01:39:36.833415 (+ 172us) server_negotiation.cc:206] Beginning negotiation
0927 01:39:36.833420 (+ 5us) server_negotiation.cc:399] Waiting for connection header
0927 01:39:36.833533 (+ 113us) negotiation.cc:327] Negotiation complete: Network error: Server connection negotiation failed: server connection from 127.0.0.1:43714: BlockingRecv error: recv got EOF from 127.0.0.1:43714 (error 108)
Metrics: {"server-negotiator.queue_time_us":72}
[ OK ] Parameters/TestRpcSocketTxRxQueue.AcceptorRxQueueSizeMetric/0 (20 ms)
[----------] 1 test from Parameters/TestRpcSocketTxRxQueue (20 ms total)
[----------] Global test environment tear-down
[==========] 21 tests from 2 test suites ran. (52304 ms total)
[ PASSED ] 20 tests.
[ FAILED ] 1 test, listed below:
[ FAILED ] Parameters/TestRpc.TestCallWithChainCertAndChainCA/SSL_UnixSocket, where GetParam() = (true, true)
1 FAILED TEST