Diagnosed failure

Parameters/TestRpc.TestCallWithChainCertAndRootCA/SSL_UnixSocket: /data0/somelongdirectorytoavoidrpathissues/src/kudu/src/kudu/rpc/rpc-test.cc:303: Failure
Failed
Bad status: Runtime error: could not verify certificate chain (error with cert: subject=CN = localhost, ST = sadfjas, C = AS, emailAddress = sdflkdsajf, O = lskdfjlsad, OU = sldfkja, issuer=C = AS, ST = ASDfkjdhf, L = lskdjf, O = saldfja, OU = skdjf, CN = localhost, emailAddress = sadjflkadsj): : certificate has expired
Google Test trace:
/data0/somelongdirectorytoavoidrpathissues/src/kudu/src/kudu/rpc/rpc-test.cc:300: Connecting to unix:/tmp/dist-test-task6henh7/test-tmp/rpc-test-0367bbcc05284921a4fa7bfd1edf5e87.sock
I20260927 10:00:01.608579  3622 test_util.cc:175] -----------------------------------------------
I20260927 10:00:01.608735  3622 test_util.cc:176] Had fatal failures, leaving test files at /tmp/dist-test-task6henh7/test-tmp/rpc-test.2.Parameters_TestRpc.TestCallWithChainCertAndRootCA_SSL_UnixSocket.1790503198006301-3622-0

Full log

Note: This is test shard 3 of 8.
[==========] Running 21 tests from 2 test suites.
[----------] Global test environment set-up.
[----------] 1 test from TestRpc
[ RUN      ] TestRpc.TestNegotiationTimeout
WARNING: Logging before InitGoogleLogging() is written to STDERR
I20260927 09:59:58.190951  3622 rpc-test-base.h:595] status: Timed out: connection negotiation to 0.0.0.0:38301 for RPC Sleep timed out after 0.100s (ON_OUTBOUND_QUEUE), seconds elapsed: 0.101689
W20260927 10:00:01.279443  3632 negotiation.cc:337] Failed RPC negotiation. Trace:
0927 09:59:58.090156 (+     0us) reactor.cc:625] Submitting negotiation task for client connection to 0.0.0.0:38301 (local address 127.0.0.1:37154)
0927 09:59:58.090763 (+   607us) negotiation.cc:107] Waiting for socket to connect
0927 09:59:58.090806 (+    43us) client_negotiation.cc:174] Beginning negotiation
0927 09:59:58.102557 (+ 11751us) client_negotiation.cc:252] Sending NEGOTIATE NegotiatePB request
0927 10:00:01.278362 (+3175805us) negotiation.cc:327] Negotiation complete: Timed out: Client connection negotiation failed: client connection to 0.0.0.0:38301: received 0 of 4 requested bytes
Metrics: {"client-negotiator.queue_time_us":195}
[       OK ] TestRpc.TestNegotiationTimeout (3227 ms)
[----------] 1 test from TestRpc (3227 ms total)

[----------] 20 tests from Parameters/TestRpc
[ RUN      ] Parameters/TestRpc.TestAcceptorPoolStartStop/SSL_UnixSocket
I20260927 10:00:01.339560  3648 acceptor_pool.cc:254] collecting diagnostics on the listening RPC socket unix:/tmp/dist-test-task6henh7/test-tmp/rpc-test-a3666afe378a4431acfe992ad47f0bd1.sock every 8 connection(s)
I20260927 10:00:01.341104  3649 acceptor_pool.cc:254] collecting diagnostics on the listening RPC socket unix:/tmp/dist-test-task6henh7/test-tmp/rpc-test-a3666afe378a4431acfe992ad47f0bd1.sock every 8 connection(s)
I20260927 10:00:01.378459  3659 acceptor_pool.cc:254] collecting diagnostics on the listening RPC socket unix:/tmp/dist-test-task6henh7/test-tmp/rpc-test-a3666afe378a4431acfe992ad47f0bd1.sock every 8 connection(s)
I20260927 10:00:01.380331  3660 acceptor_pool.cc:254] collecting diagnostics on the listening RPC socket unix:/tmp/dist-test-task6henh7/test-tmp/rpc-test-a3666afe378a4431acfe992ad47f0bd1.sock every 8 connection(s)
I20260927 10:00:01.418715  3670 acceptor_pool.cc:254] collecting diagnostics on the listening RPC socket unix:/tmp/dist-test-task6henh7/test-tmp/rpc-test-a3666afe378a4431acfe992ad47f0bd1.sock every 8 connection(s)
I20260927 10:00:01.419467  3671 acceptor_pool.cc:254] collecting diagnostics on the listening RPC socket unix:/tmp/dist-test-task6henh7/test-tmp/rpc-test-a3666afe378a4431acfe992ad47f0bd1.sock every 8 connection(s)
I20260927 10:00:01.449074  3681 acceptor_pool.cc:254] collecting diagnostics on the listening RPC socket unix:/tmp/dist-test-task6henh7/test-tmp/rpc-test-a3666afe378a4431acfe992ad47f0bd1.sock every 8 connection(s)
I20260927 10:00:01.449862  3682 acceptor_pool.cc:254] collecting diagnostics on the listening RPC socket unix:/tmp/dist-test-task6henh7/test-tmp/rpc-test-a3666afe378a4431acfe992ad47f0bd1.sock every 8 connection(s)
I20260927 10:00:01.464509  3692 acceptor_pool.cc:254] collecting diagnostics on the listening RPC socket unix:/tmp/dist-test-task6henh7/test-tmp/rpc-test-a3666afe378a4431acfe992ad47f0bd1.sock every 8 connection(s)
I20260927 10:00:01.465189  3693 acceptor_pool.cc:254] collecting diagnostics on the listening RPC socket unix:/tmp/dist-test-task6henh7/test-tmp/rpc-test-a3666afe378a4431acfe992ad47f0bd1.sock every 8 connection(s)
[       OK ] Parameters/TestRpc.TestAcceptorPoolStartStop/SSL_UnixSocket (185 ms)
[ RUN      ] Parameters/TestRpc.TestCall/SSL_UnixSocket
I20260927 10:00:01.496596  3705 acceptor_pool.cc:254] collecting diagnostics on the listening RPC socket unix:/tmp/dist-test-task6henh7/test-tmp/rpc-test-c413fddb52ee4cbba86ed2fa5b98361d.sock every 8 connection(s)
I20260927 10:00:01.499003  3706 acceptor_pool.cc:254] collecting diagnostics on the listening RPC socket unix:/tmp/dist-test-task6henh7/test-tmp/rpc-test-c413fddb52ee4cbba86ed2fa5b98361d.sock every 8 connection(s)
I20260927 10:00:01.503533  3622 rpc-test.cc:234] Connecting to unix:/tmp/dist-test-task6henh7/test-tmp/rpc-test-c413fddb52ee4cbba86ed2fa5b98361d.sock
W20260927 10:00:01.565830  3702 connection.cc:196] Error closing socket: Network error: TlsSocket::Close: Broken pipe
[       OK ] Parameters/TestRpc.TestCall/SSL_UnixSocket (101 ms)
[ RUN      ] Parameters/TestRpc.TestCallWithChainCertAndRootCA/SSL_UnixSocket
I20260927 10:00:01.588937  3730 acceptor_pool.cc:254] collecting diagnostics on the listening RPC socket unix:/tmp/dist-test-task6henh7/test-tmp/rpc-test-0367bbcc05284921a4fa7bfd1edf5e87.sock every 8 connection(s)
I20260927 10:00:01.589704  3731 acceptor_pool.cc:254] collecting diagnostics on the listening RPC socket unix:/tmp/dist-test-task6henh7/test-tmp/rpc-test-0367bbcc05284921a4fa7bfd1edf5e87.sock every 8 connection(s)
/data0/somelongdirectorytoavoidrpathissues/src/kudu/src/kudu/rpc/rpc-test.cc:303: Failure
Failed
Bad status: Runtime error: could not verify certificate chain (error with cert: subject=CN = localhost, ST = sadfjas, C = AS, emailAddress = sdflkdsajf, O = lskdfjlsad, OU = sldfkja, issuer=C = AS, ST = ASDfkjdhf, L = lskdjf, O = saldfja, OU = skdjf, CN = localhost, emailAddress = sadjflkadsj): : certificate has expired
Google Test trace:
/data0/somelongdirectorytoavoidrpathissues/src/kudu/src/kudu/rpc/rpc-test.cc:300: Connecting to unix:/tmp/dist-test-task6henh7/test-tmp/rpc-test-0367bbcc05284921a4fa7bfd1edf5e87.sock
I20260927 10:00:01.608579  3622 test_util.cc:175] -----------------------------------------------
I20260927 10:00:01.608735  3622 test_util.cc:176] Had fatal failures, leaving test files at /tmp/dist-test-task6henh7/test-tmp/rpc-test.2.Parameters_TestRpc.TestCallWithChainCertAndRootCA_SSL_UnixSocket.1790503198006301-3622-0
[  FAILED  ] Parameters/TestRpc.TestCallWithChainCertAndRootCA/SSL_UnixSocket, where GetParam() = (true, true) (38 ms)
[ RUN      ] Parameters/TestRpc.TestCallWithBadPasswordProtectedKey/SSL_UnixSocket
[       OK ] Parameters/TestRpc.TestCallWithBadPasswordProtectedKey/SSL_UnixSocket (29 ms)
[ RUN      ] Parameters/TestRpc.TestInvalidMethodCall/SSL_UnixSocket
I20260927 10:00:01.662125  3767 acceptor_pool.cc:254] collecting diagnostics on the listening RPC socket unix:/tmp/dist-test-task6henh7/test-tmp/rpc-test-7087225cbee04d03b908fb2b3b7eeb10.sock every 8 connection(s)
I20260927 10:00:01.662979  3768 acceptor_pool.cc:254] collecting diagnostics on the listening RPC socket unix:/tmp/dist-test-task6henh7/test-tmp/rpc-test-7087225cbee04d03b908fb2b3b7eeb10.sock every 8 connection(s)
I20260927 10:00:01.666344  3622 rpc-test.cc:406] Connecting to unix:/tmp/dist-test-task6henh7/test-tmp/rpc-test-7087225cbee04d03b908fb2b3b7eeb10.sock
W20260927 10:00:01.726817  3764 connection.cc:196] Error closing socket: Network error: TlsSocket::Close: Broken pipe
[       OK ] Parameters/TestRpc.TestInvalidMethodCall/SSL_UnixSocket (94 ms)
[ RUN      ] Parameters/TestRpc.TestHighFDs/SSL_UnixSocket
I20260927 10:00:01.940701  3792 acceptor_pool.cc:254] collecting diagnostics on the listening RPC socket unix:/tmp/dist-test-task6henh7/test-tmp/rpc-test-3dd8e473b6264934856ed681b3bc4d92.sock every 8 connection(s)
I20260927 10:00:01.941387  3793 acceptor_pool.cc:254] collecting diagnostics on the listening RPC socket unix:/tmp/dist-test-task6henh7/test-tmp/rpc-test-3dd8e473b6264934856ed681b3bc4d92.sock every 8 connection(s)
[       OK ] Parameters/TestRpc.TestHighFDs/SSL_UnixSocket (255 ms)
[ RUN      ] Parameters/TestRpc.TestConnectionAlwaysKeepalive/SSL_UnixSocket
I20260927 10:00:02.005345  3815 acceptor_pool.cc:254] collecting diagnostics on the listening RPC socket unix:/tmp/dist-test-task6henh7/test-tmp/rpc-test-d3c3ed44cb70415fa27fd44d43f52962.sock every 8 connection(s)
I20260927 10:00:02.006096  3816 acceptor_pool.cc:254] collecting diagnostics on the listening RPC socket unix:/tmp/dist-test-task6henh7/test-tmp/rpc-test-d3c3ed44cb70415fa27fd44d43f52962.sock every 8 connection(s)
I20260927 10:00:02.008977  3622 rpc-test.cc:532] Connecting to unix:/tmp/dist-test-task6henh7/test-tmp/rpc-test-d3c3ed44cb70415fa27fd44d43f52962.sock
W20260927 10:00:05.037935  3814 connection.cc:196] Error closing socket: Network error: TlsSocket::Close: Broken pipe
[       OK ] Parameters/TestRpc.TestConnectionAlwaysKeepalive/SSL_UnixSocket (3054 ms)
[ RUN      ] Parameters/TestRpc.TestReopenOutboundConnections/SSL_UnixSocket
I20260927 10:00:05.067524  3838 acceptor_pool.cc:254] collecting diagnostics on the listening RPC socket unix:/tmp/dist-test-task6henh7/test-tmp/rpc-test-d1b022011eea4089945677a38d47a7dd.sock every 8 connection(s)
I20260927 10:00:05.068253  3839 acceptor_pool.cc:254] collecting diagnostics on the listening RPC socket unix:/tmp/dist-test-task6henh7/test-tmp/rpc-test-d1b022011eea4089945677a38d47a7dd.sock every 8 connection(s)
I20260927 10:00:05.071167  3622 rpc-test.cc:658] Connecting to unix:/tmp/dist-test-task6henh7/test-tmp/rpc-test-d1b022011eea4089945677a38d47a7dd.sock
W20260927 10:00:05.091204  3837 connection.cc:196] Error closing socket: Network error: TlsSocket::Close: Broken pipe
W20260927 10:00:05.099898  3837 connection.cc:196] Error closing socket: Network error: TlsSocket::Close: Broken pipe
W20260927 10:00:05.108556  3837 connection.cc:196] Error closing socket: Network error: TlsSocket::Close: Broken pipe
W20260927 10:00:05.117396  3837 connection.cc:196] Error closing socket: Network error: TlsSocket::Close: Broken pipe
W20260927 10:00:05.127488  3837 connection.cc:196] Error closing socket: Network error: TlsSocket::Close: Broken pipe
W20260927 10:00:05.137288  3837 connection.cc:196] Error closing socket: Network error: TlsSocket::Close: Broken pipe
W20260927 10:00:05.147027  3837 connection.cc:196] Error closing socket: Network error: TlsSocket::Close: Broken pipe
W20260927 10:00:05.157074  3837 connection.cc:196] Error closing socket: Network error: TlsSocket::Close: Broken pipe
W20260927 10:00:05.166661  3837 connection.cc:196] Error closing socket: Network error: TlsSocket::Close: Broken pipe
W20260927 10:00:05.176419  3837 connection.cc:196] Error closing socket: Network error: TlsSocket::Close: Broken pipe
W20260927 10:00:05.186645  3837 connection.cc:196] Error closing socket: Network error: TlsSocket::Close: Broken pipe
W20260927 10:00:05.196424  3837 connection.cc:196] Error closing socket: Network error: TlsSocket::Close: Broken pipe
W20260927 10:00:05.206331  3837 connection.cc:196] Error closing socket: Network error: TlsSocket::Close: Broken pipe
W20260927 10:00:05.216480  3837 connection.cc:196] Error closing socket: Network error: TlsSocket::Close: Broken pipe
W20260927 10:00:05.216508  3838 acceptor_pool.cc:285] unable to collect diagnostics on RPC socket unix:/tmp/dist-test-task6henh7/test-tmp/rpc-test-d1b022011eea4089945677a38d47a7dd.sock: Not implemented: netlink diagnostics is currently supported only on IPv4 TCP sockets
W20260927 10:00:05.226400  3837 connection.cc:196] Error closing socket: Network error: TlsSocket::Close: Broken pipe
W20260927 10:00:05.236332  3837 connection.cc:196] Error closing socket: Network error: TlsSocket::Close: Broken pipe
W20260927 10:00:05.245738  3837 connection.cc:196] Error closing socket: Network error: TlsSocket::Close: Broken pipe
W20260927 10:00:05.255718  3837 connection.cc:196] Error closing socket: Network error: TlsSocket::Close: Broken pipe
W20260927 10:00:05.265638  3837 connection.cc:196] Error closing socket: Network error: TlsSocket::Close: Broken pipe
W20260927 10:00:05.275673  3837 connection.cc:196] Error closing socket: Network error: TlsSocket::Close: Broken pipe
W20260927 10:00:05.286062  3837 connection.cc:196] Error closing socket: Network error: TlsSocket::Close: Broken pipe
W20260927 10:00:05.296367  3837 connection.cc:196] Error closing socket: Network error: TlsSocket::Close: Broken pipe
W20260927 10:00:05.306129  3837 connection.cc:196] Error closing socket: Network error: TlsSocket::Close: Broken pipe
W20260927 10:00:05.316282  3837 connection.cc:196] Error closing socket: Network error: TlsSocket::Close: Broken pipe
W20260927 10:00:05.326002  3837 connection.cc:196] Error closing socket: Network error: TlsSocket::Close: Broken pipe
W20260927 10:00:05.335554  3837 connection.cc:196] Error closing socket: Network error: TlsSocket::Close: Broken pipe
W20260927 10:00:05.345252  3837 connection.cc:196] Error closing socket: Network error: TlsSocket::Close: Broken pipe
W20260927 10:00:05.352931  3837 connection.cc:196] Error closing socket: Network error: TlsSocket::Close: Broken pipe
W20260927 10:00:05.360760  3837 connection.cc:196] Error closing socket: Network error: TlsSocket::Close: Broken pipe
W20260927 10:00:05.369779  3837 connection.cc:196] Error closing socket: Network error: TlsSocket::Close: Broken pipe
W20260927 10:00:05.378281  3837 connection.cc:196] Error closing socket: Network error: TlsSocket::Close: Broken pipe
W20260927 10:00:05.388818  3837 connection.cc:196] Error closing socket: Network error: TlsSocket::Close: Broken pipe
[       OK ] Parameters/TestRpc.TestReopenOutboundConnections/SSL_UnixSocket (350 ms)
[ RUN      ] Parameters/TestRpc.TestConnectionNetworkPlane/SSL_UnixSocket
I20260927 10:00:05.419517  3861 acceptor_pool.cc:254] collecting diagnostics on the listening RPC socket unix:/tmp/dist-test-task6henh7/test-tmp/rpc-test-d04092cbfc0c4a90bd17024f81f8834b.sock every 8 connection(s)
I20260927 10:00:05.420224  3862 acceptor_pool.cc:254] collecting diagnostics on the listening RPC socket unix:/tmp/dist-test-task6henh7/test-tmp/rpc-test-d04092cbfc0c4a90bd17024f81f8834b.sock every 8 connection(s)
I20260927 10:00:05.423125  3622 rpc-test.cc:772] Connecting to unix:/tmp/dist-test-task6henh7/test-tmp/rpc-test-d04092cbfc0c4a90bd17024f81f8834b.sock
W20260927 10:00:05.461992  3860 connection.cc:196] Error closing socket: Network error: TlsSocket::Close: Broken pipe
W20260927 10:00:05.462670  3860 connection.cc:196] Error closing socket: Network error: TlsSocket::Close: Broken pipe
[       OK ] Parameters/TestRpc.TestConnectionNetworkPlane/SSL_UnixSocket (74 ms)
[ RUN      ] Parameters/TestRpc.TestTCPKeepalive/SSL_UnixSocket
I20260927 10:00:05.485989  3886 acceptor_pool.cc:254] collecting diagnostics on the listening RPC socket unix:/tmp/dist-test-task6henh7/test-tmp/rpc-test-f5e3bab0befa416b9927e7141ea4e51c.sock every 8 connection(s)
I20260927 10:00:05.486671  3887 acceptor_pool.cc:254] collecting diagnostics on the listening RPC socket unix:/tmp/dist-test-task6henh7/test-tmp/rpc-test-f5e3bab0befa416b9927e7141ea4e51c.sock every 8 connection(s)
I20260927 10:00:05.515167  3890 rpc-test-base.h:222] got call: sleep_micros: 8000000 deferred: true
I20260927 10:00:13.519057  3890 rpcz_store.cc:275] Call kudu.rpc.GenericCalculatorService.Sleep from unix:<unnamed> (request call id 0) took 8003 ms. Trace:
I20260927 10:00:13.519459  3890 rpcz_store.cc:276] 0927 10:00:05.515031 (+     0us) service_pool.cc:170] Inserting onto call queue
0927 10:00:05.515121 (+    90us) service_pool.cc:227] Handling call
0927 10:00:13.518893 (+8003772us) inbound_call.cc:173] Queueing success response
Metrics: {}
W20260927 10:00:13.525596  3883 connection.cc:196] Error closing socket: Network error: TlsSocket::Close: Broken pipe
[       OK ] Parameters/TestRpc.TestTCPKeepalive/SSL_UnixSocket (8064 ms)
[ RUN      ] Parameters/TestRpc.TestMaxSmallSidecars/SSL_UnixSocket
I20260927 10:00:13.567169  3912 acceptor_pool.cc:254] collecting diagnostics on the listening RPC socket unix:/tmp/dist-test-task6henh7/test-tmp/rpc-test-84bb7bcdc5cd4a3bbf2dfaea7abf360e.sock every 8 connection(s)
I20260927 10:00:13.568048  3913 acceptor_pool.cc:254] collecting diagnostics on the listening RPC socket unix:/tmp/dist-test-task6henh7/test-tmp/rpc-test-84bb7bcdc5cd4a3bbf2dfaea7abf360e.sock every 8 connection(s)
[       OK ] Parameters/TestRpc.TestMaxSmallSidecars/SSL_UnixSocket (201 ms)
[ RUN      ] Parameters/TestRpc.TestCallTimeout/SSL_UnixSocket
I20260927 10:00:13.751156  3937 acceptor_pool.cc:254] collecting diagnostics on the listening RPC socket unix:/tmp/dist-test-task6henh7/test-tmp/rpc-test-1fe5a89f0bab4aeab2b718264dec722f.sock every 8 connection(s)
I20260927 10:00:13.751964  3938 acceptor_pool.cc:254] collecting diagnostics on the listening RPC socket unix:/tmp/dist-test-task6henh7/test-tmp/rpc-test-1fe5a89f0bab4aeab2b718264dec722f.sock every 8 connection(s)
I20260927 10:00:13.776252  3622 rpc-test-base.h:595] status: Timed out: connection negotiation to unix:/tmp/dist-test-task6henh7/test-tmp/rpc-test-1fe5a89f0bab4aeab2b718264dec722f.sock for RPC Sleep timed out after 0.000s (ON_OUTBOUND_QUEUE), seconds elapsed: 0.00230776
I20260927 10:00:13.782853  3941 rpc-test-base.h:222] got call: sleep_micros: 700000
I20260927 10:00:13.977690  3622 rpc-test-base.h:595] status: Timed out: Sleep RPC to unix:/tmp/dist-test-task6henh7/test-tmp/rpc-test-1fe5a89f0bab4aeab2b718264dec722f.sock timed out after 0.200s (SENT), seconds elapsed: 0.201088
I20260927 10:00:13.978919  3940 rpc-test-base.h:222] got call: sleep_micros: 2000000
W20260927 10:00:14.483472  3941 rpcz_store.cc:267] Call kudu.rpc.GenericCalculatorService.Sleep from unix:<unnamed> (request call id 1) took 700 ms (client timeout 200 ms). Trace:
W20260927 10:00:14.483850  3941 rpcz_store.cc:269] 0927 10:00:13.782638 (+     0us) service_pool.cc:170] Inserting onto call queue
0927 10:00:13.782735 (+    97us) service_pool.cc:227] Handling call
0927 10:00:14.483419 (+700684us) inbound_call.cc:173] Queueing success response
Metrics: {}
I20260927 10:00:15.479820  3622 rpc-test-base.h:595] status: Timed out: Sleep RPC to unix:/tmp/dist-test-task6henh7/test-tmp/rpc-test-1fe5a89f0bab4aeab2b718264dec722f.sock timed out after 1.500s (SENT), seconds elapsed: 1.5018
W20260927 10:00:15.979396  3940 rpcz_store.cc:267] Call kudu.rpc.GenericCalculatorService.Sleep from unix:<unnamed> (request call id 2) took 2000 ms (client timeout 1500 ms). Trace:
W20260927 10:00:15.979718  3940 rpcz_store.cc:269] 0927 10:00:13.978757 (+     0us) service_pool.cc:170] Inserting onto call queue
0927 10:00:13.978864 (+   107us) service_pool.cc:227] Handling call
0927 10:00:15.979340 (+2000476us) inbound_call.cc:173] Queueing success response
Metrics: {}
W20260927 10:00:15.980262  3934 connection.cc:441] server connection from unix:<unnamed> torn down before Call kudu.rpc.GenericCalculatorService.Sleep from unix:<unnamed> (request call id 2) could send its response
[       OK ] Parameters/TestRpc.TestCallTimeout/SSL_UnixSocket (2251 ms)
[ RUN      ] Parameters/TestRpc.TestServerShutsDown/SSL_UnixSocket
I20260927 10:00:15.987329  3622 rpc-test.cc:1125] Connecting to 0.0.0.0:41883
W20260927 10:00:15.996803  3954 negotiation.cc:337] Failed RPC negotiation. Trace:
0927 10:00:15.995316 (+     0us) reactor.cc:625] Submitting negotiation task for client connection to 0.0.0.0:41883 (local address 127.0.0.1:52980)
0927 10:00:15.995842 (+   526us) negotiation.cc:107] Waiting for socket to connect
0927 10:00:15.995873 (+    31us) client_negotiation.cc:174] Beginning negotiation
0927 10:00:15.996100 (+   227us) client_negotiation.cc:252] Sending NEGOTIATE NegotiatePB request
0927 10:00:15.996302 (+   202us) negotiation.cc:327] Negotiation complete: Network error: Client connection negotiation failed: client connection to 0.0.0.0:41883: BlockingWrite error: write error: Broken pipe (error 32)
Metrics: {"client-negotiator.queue_time_us":214}
[       OK ] Parameters/TestRpc.TestServerShutsDown/SSL_UnixSocket (13 ms)
[ RUN      ] Parameters/TestRpc.TimedOutOnResponseMetric/SSL_UnixSocket
I20260927 10:00:16.036859  3971 acceptor_pool.cc:254] collecting diagnostics on the listening RPC socket unix:/tmp/dist-test-task6henh7/test-tmp/rpc-test-610bbdac2001498b805f91bb7d2e3042.sock every 8 connection(s)
I20260927 10:00:16.037519  3972 acceptor_pool.cc:254] collecting diagnostics on the listening RPC socket unix:/tmp/dist-test-task6henh7/test-tmp/rpc-test-610bbdac2001498b805f91bb7d2e3042.sock every 8 connection(s)
W20260927 10:00:16.267800  3975 rpcz_store.cc:267] Call kudu.rpc_test.CalculatorService.Sleep from unix:<unnamed> (request call id 3) took 50 ms (client timeout 25 ms). Trace:
W20260927 10:00:16.268071  3975 rpcz_store.cc:269] 0927 10:00:16.217300 (+     0us) service_pool.cc:170] Inserting onto call queue
0927 10:00:16.217387 (+    87us) service_pool.cc:227] Handling call
0927 10:00:16.267737 (+ 50350us) inbound_call.cc:173] Queueing success response
Related trace 'test_child':
Metrics: {"test_sleep_us":50000,"child_traces":[["test_child",{"related_trace_metric":1}]]}
W20260927 10:00:16.326922  3975 rpcz_store.cc:267] Call kudu.rpc_test.CalculatorService.Sleep from unix:<unnamed> (request call id 4) took 50 ms (client timeout 50 ms). Trace:
W20260927 10:00:16.327220  3975 rpcz_store.cc:269] 0927 10:00:16.276403 (+     0us) service_pool.cc:170] Inserting onto call queue
0927 10:00:16.276503 (+   100us) service_pool.cc:227] Handling call
0927 10:00:16.326860 (+ 50357us) inbound_call.cc:173] Queueing success response
Related trace 'test_child':
Metrics: {"test_sleep_us":50000,"child_traces":[["test_child",{"related_trace_metric":1}]]}
[       OK ] Parameters/TestRpc.TimedOutOnResponseMetric/SSL_UnixSocket (335 ms)
[ RUN      ] Parameters/TestRpc.AcceptorDispatchingTimesMetric/SSL_UnixSocket
I20260927 10:00:16.346226  3996 acceptor_pool.cc:254] collecting diagnostics on the listening RPC socket 0.0.0.0:43105 every 8 connection(s)
I20260927 10:00:16.346956  3997 acceptor_pool.cc:254] collecting diagnostics on the listening RPC socket 0.0.0.0:43105 every 8 connection(s)
W20260927 10:00:16.351928  3992 negotiation.cc:337] Failed RPC negotiation. Trace:
0927 10:00:16.350813 (+     0us) reactor.cc:625] Submitting negotiation task for server connection from 127.0.0.1:35482 (local address 127.0.0.1:43105)
0927 10:00:16.351270 (+   457us) server_negotiation.cc:206] Beginning negotiation
0927 10:00:16.351284 (+    14us) server_negotiation.cc:399] Waiting for connection header
0927 10:00:16.351512 (+   228us) negotiation.cc:327] Negotiation complete: Network error: Server connection negotiation failed: server connection from 127.0.0.1:35482: BlockingRecv error: recv got EOF from 127.0.0.1:35482 (error 108)
Metrics: {"server-negotiator.queue_time_us":132}
[       OK ] Parameters/TestRpc.AcceptorDispatchingTimesMetric/SSL_UnixSocket (21 ms)
[ RUN      ] Parameters/TestRpc.TestRpcCallbackDestroysMessenger/SSL_UnixSocket
[       OK ] Parameters/TestRpc.TestRpcCallbackDestroysMessenger/SSL_UnixSocket (25 ms)
[ RUN      ] Parameters/TestRpc.TestApplicationFeatureFlag/SSL_UnixSocket
I20260927 10:00:16.405498  4021 acceptor_pool.cc:254] collecting diagnostics on the listening RPC socket unix:/tmp/dist-test-task6henh7/test-tmp/rpc-test-db3ec41bf9e74567a2548bdcf3194723.sock every 8 connection(s)
I20260927 10:00:16.406173  4022 acceptor_pool.cc:254] collecting diagnostics on the listening RPC socket unix:/tmp/dist-test-task6henh7/test-tmp/rpc-test-db3ec41bf9e74567a2548bdcf3194723.sock every 8 connection(s)
W20260927 10:00:16.442417  4018 messenger.cc:357] Unable to handle RPC call: Not implemented: call requires unsupported application feature flags: 99
[       OK ] Parameters/TestRpc.TestApplicationFeatureFlag/SSL_UnixSocket (67 ms)
[ RUN      ] Parameters/TestRpc.TestCancellation/SSL_UnixSocket
I20260927 10:00:16.474875  4046 acceptor_pool.cc:254] collecting diagnostics on the listening RPC socket unix:/tmp/dist-test-task6henh7/test-tmp/rpc-test-e56c63db369645668fb2ba4de26e51c8.sock every 8 connection(s)
I20260927 10:00:16.475507  4047 acceptor_pool.cc:254] collecting diagnostics on the listening RPC socket unix:/tmp/dist-test-task6henh7/test-tmp/rpc-test-e56c63db369645668fb2ba4de26e51c8.sock every 8 connection(s)
I20260927 10:00:16.478194  3622 rpc-test.cc:1648] Connecting to unix:/tmp/dist-test-task6henh7/test-tmp/rpc-test-e56c63db369645668fb2ba4de26e51c8.sock
I20260927 10:00:16.582597  3622 rpc-test-base.h:595] status: Aborted: Sleep RPC to unix:/tmp/dist-test-task6henh7/test-tmp/rpc-test-e56c63db369645668fb2ba4de26e51c8.sock is cancelled in state READY, seconds elapsed: 0.00030811
I20260927 10:00:16.783278  3622 rpc-test-base.h:595] status: Aborted: Sleep RPC to unix:/tmp/dist-test-task6henh7/test-tmp/rpc-test-e56c63db369645668fb2ba4de26e51c8.sock is cancelled in state SENT, seconds elapsed: 0.000783022
I20260927 10:00:16.783474  4049 rpc-test-base.h:222] got call: sleep_micros: 510000
I20260927 10:00:16.950660  3622 rpc-test-base.h:595] status: Aborted: Sleep RPC to unix:/tmp/dist-test-task6henh7/test-tmp/rpc-test-e56c63db369645668fb2ba4de26e51c8.sock is cancelled in state SENT, seconds elapsed: 0.000809268
I20260927 10:00:16.950840  4048 rpc-test-base.h:222] got call: sleep_micros: 510000
I20260927 10:00:17.127492  3622 rpc-test-base.h:595] status: Aborted: Sleep RPC to unix:/tmp/dist-test-task6henh7/test-tmp/rpc-test-e56c63db369645668fb2ba4de26e51c8.sock is cancelled in state SENT, seconds elapsed: 0.000649531
W20260927 10:00:17.138151  4050 rpcz_store.cc:267] Call kudu.rpc.GenericCalculatorService.Sleep from unix:<unnamed> (request call id 11) took 10 ms (client timeout 10 ms). Trace:
W20260927 10:00:17.138424  4050 rpcz_store.cc:269] 0927 10:00:17.127637 (+     0us) service_pool.cc:170] Inserting onto call queue
0927 10:00:17.137871 (+ 10234us) service_pool.cc:214] Skipping call since client already timed out
0927 10:00:17.137987 (+   116us) inbound_call.cc:173] Queueing failure response
Metrics: {}
I20260927 10:00:17.138960  4050 rpc-test-base.h:222] got call: sleep_micros: 1500000
W20260927 10:00:17.294123  4049 rpcz_store.cc:267] Call kudu.rpc.GenericCalculatorService.Sleep from unix:<unnamed> (request call id 3) took 510 ms (client timeout 10 ms). Trace:
W20260927 10:00:17.294413  4049 rpcz_store.cc:269] 0927 10:00:16.783282 (+     0us) service_pool.cc:170] Inserting onto call queue
0927 10:00:16.783422 (+   140us) service_pool.cc:227] Handling call
0927 10:00:17.294067 (+510645us) inbound_call.cc:173] Queueing success response
Metrics: {}
W20260927 10:00:17.461403  4048 rpcz_store.cc:267] Call kudu.rpc.GenericCalculatorService.Sleep from unix:<unnamed> (request call id 7) took 510 ms (client timeout 10 ms). Trace:
W20260927 10:00:17.461696  4048 rpcz_store.cc:269] 0927 10:00:16.950666 (+     0us) service_pool.cc:170] Inserting onto call queue
0927 10:00:16.950787 (+   121us) service_pool.cc:227] Handling call
0927 10:00:17.461353 (+510566us) inbound_call.cc:173] Queueing success response
Metrics: {}
I20260927 10:00:18.129571  3622 rpc-test-base.h:595] status: Timed out: Sleep RPC to unix:/tmp/dist-test-task6henh7/test-tmp/rpc-test-e56c63db369645668fb2ba4de26e51c8.sock timed out after 1.000s (SENT), seconds elapsed: 1.00166
I20260927 10:00:18.131436  4048 rpc-test-base.h:222] got call: sleep_micros: 1500000
W20260927 10:00:18.639599  4050 rpcz_store.cc:267] Call kudu.rpc.GenericCalculatorService.Sleep from unix:<unnamed> (request call id 12) took 1511 ms (client timeout 1000 ms). Trace:
W20260927 10:00:18.639919  4050 rpcz_store.cc:269] 0927 10:00:17.128484 (+     0us) service_pool.cc:170] Inserting onto call queue
0927 10:00:17.138929 (+ 10445us) service_pool.cc:227] Handling call
0927 10:00:18.639469 (+1500540us) inbound_call.cc:173] Queueing success response
Metrics: {}
I20260927 10:00:19.132058  3622 rpc-test-base.h:595] status: Timed out: Sleep RPC to unix:/tmp/dist-test-task6henh7/test-tmp/rpc-test-e56c63db369645668fb2ba4de26e51c8.sock timed out after 1.000s (SENT), seconds elapsed: 1.002
W20260927 10:00:19.133359  4043 messenger.cc:357] Unable to handle RPC call: Not implemented: call requires unsupported application feature flags: 99, 1
W20260927 10:00:19.134630  4043 messenger.cc:357] Unable to handle RPC call: Not implemented: call requires unsupported application feature flags: 99, 1
W20260927 10:00:19.342437  4043 connection.cc:196] Error closing socket: Network error: TlsSocket::Close: Broken pipe
W20260927 10:00:19.632033  4048 rpcz_store.cc:267] Call kudu.rpc.GenericCalculatorService.Sleep from unix:<unnamed> (request call id 13) took 1501 ms (client timeout 1000 ms). Trace:
W20260927 10:00:19.632380  4048 rpcz_store.cc:269] 0927 10:00:18.131143 (+     0us) service_pool.cc:170] Inserting onto call queue
0927 10:00:18.131328 (+   185us) service_pool.cc:227] Handling call
0927 10:00:19.631980 (+1500652us) inbound_call.cc:173] Queueing success response
Metrics: {}
W20260927 10:00:19.632988  4043 connection.cc:441] server connection from unix:<unnamed> torn down before Call kudu.rpc.GenericCalculatorService.Sleep from unix:<unnamed> (request call id 13) could send its response
[       OK ] Parameters/TestRpc.TestCancellation/SSL_UnixSocket (3190 ms)
[ RUN      ] Parameters/TestRpc.TestCancellationMultiThreads/SSL_UnixSocket
I20260927 10:00:19.671777  4072 acceptor_pool.cc:254] collecting diagnostics on the listening RPC socket unix:/tmp/dist-test-task6henh7/test-tmp/rpc-test-f88b4e16153246e0853befd12ded4a90.sock every 8 connection(s)
I20260927 10:00:19.672626  4073 acceptor_pool.cc:254] collecting diagnostics on the listening RPC socket unix:/tmp/dist-test-task6henh7/test-tmp/rpc-test-f88b4e16153246e0853befd12ded4a90.sock every 8 connection(s)
I20260927 10:00:19.675604  3622 rpc-test.cc:1808] Connecting to unix:/tmp/dist-test-task6henh7/test-tmp/rpc-test-f88b4e16153246e0853befd12ded4a90.sock
I20260927 10:00:19.818720  4086 test_util.cc:268] Using random seed: 73592955
I20260927 10:00:19.819861  4087 test_util.cc:268] Using random seed: 73594174
I20260927 10:00:19.821784  4088 test_util.cc:268] Using random seed: 73596095
I20260927 10:00:19.823382  4089 test_util.cc:268] Using random seed: 73597564
I20260927 10:00:19.825014  4090 test_util.cc:268] Using random seed: 73599183
I20260927 10:00:19.827035  4091 test_util.cc:268] Using random seed: 73601217
I20260927 10:00:19.828821  4092 test_util.cc:268] Using random seed: 73603005
I20260927 10:00:19.830899  4093 test_util.cc:268] Using random seed: 73605129
I20260927 10:00:19.833230  4094 test_util.cc:268] Using random seed: 73606999
I20260927 10:00:19.834466  4095 test_util.cc:268] Using random seed: 73608645
I20260927 10:00:19.836341  4096 test_util.cc:268] Using random seed: 73610544
I20260927 10:00:19.838768  4097 test_util.cc:268] Using random seed: 73612864
I20260927 10:00:19.841971  4098 test_util.cc:268] Using random seed: 73616145
I20260927 10:00:19.845170  4099 test_util.cc:268] Using random seed: 73619317
I20260927 10:00:19.849133  4100 test_util.cc:268] Using random seed: 73622849
I20260927 10:00:19.850492  4101 test_util.cc:268] Using random seed: 73624685
I20260927 10:00:19.852445  4102 test_util.cc:268] Using random seed: 73626627
I20260927 10:00:19.855309  4103 test_util.cc:268] Using random seed: 73629486
I20260927 10:00:19.858912  4104 test_util.cc:268] Using random seed: 73633090
I20260927 10:00:19.860885  4105 test_util.cc:268] Using random seed: 73635081
I20260927 10:00:19.863037  4106 test_util.cc:268] Using random seed: 73636746
I20260927 10:00:19.865468  4107 test_util.cc:268] Using random seed: 73639288
I20260927 10:00:19.866866  4108 test_util.cc:268] Using random seed: 73641085
I20260927 10:00:19.868538  4109 test_util.cc:268] Using random seed: 73642744
I20260927 10:00:19.870210  4110 test_util.cc:268] Using random seed: 73644378
I20260927 10:00:19.872216  4111 test_util.cc:268] Using random seed: 73645992
I20260927 10:00:19.873924  4112 test_util.cc:268] Using random seed: 73648069
I20260927 10:00:19.875777  4113 test_util.cc:268] Using random seed: 73649964
I20260927 10:00:19.877838  4114 test_util.cc:268] Using random seed: 73651992
I20260927 10:00:19.879707  4115 test_util.cc:268] Using random seed: 73653861
W20260927 10:00:39.782476  4069 connection.cc:196] Error closing socket: Network error: TlsSocket::Close: Broken pipe
[       OK ] Parameters/TestRpc.TestCancellationMultiThreads/SSL_UnixSocket (20159 ms)
[ RUN      ] Parameters/TestRpc.TestCallId/SSL_UnixSocket
I20260927 10:00:39.834307  4129 acceptor_pool.cc:254] collecting diagnostics on the listening RPC socket unix:/tmp/dist-test-task6henh7/test-tmp/rpc-test-b69c1fe7d3f345c3a21adbfcc47f10ae.sock every 8 connection(s)
I20260927 10:00:39.835218  4130 acceptor_pool.cc:254] collecting diagnostics on the listening RPC socket unix:/tmp/dist-test-task6henh7/test-tmp/rpc-test-b69c1fe7d3f345c3a21adbfcc47f10ae.sock every 8 connection(s)
W20260927 10:00:39.877954  4126 connection.cc:196] Error closing socket: Network error: TlsSocket::Close: Broken pipe
[       OK ] Parameters/TestRpc.TestCallId/SSL_UnixSocket (84 ms)
[----------] 20 tests from Parameters/TestRpc (38602 ms total)

[----------] Global test environment tear-down
[==========] 21 tests from 2 test suites ran. (41830 ms total)
[  PASSED  ] 20 tests.
[  FAILED  ] 1 test, listed below:
[  FAILED  ] Parameters/TestRpc.TestCallWithChainCertAndRootCA/SSL_UnixSocket, where GetParam() = (true, true)

 1 FAILED TEST
I20260927 10:00:39.904914  3622 logging.cc:424] LogThrottler /data0/somelongdirectorytoavoidrpathissues/src/kudu/src/kudu/rpc/acceptor_pool.cc:285: suppressed but not reported on 3 messages since previous log ~34 seconds ago