Diagnosed failure

Parameters/TestRpc.TestCallWithChainCertAndRootCA/SSL_TCP: /data0/somelongdirectorytoavoidrpathissues/src/kudu/src/kudu/rpc/rpc-test.cc:303: Failure
Failed
Bad status: Runtime error: could not verify certificate chain (error with cert: subject=CN = localhost, ST = sadfjas, C = AS, emailAddress = sdflkdsajf, O = lskdfjlsad, OU = sldfkja, issuer=C = AS, ST = ASDfkjdhf, L = lskdjf, O = saldfja, OU = skdjf, CN = localhost, emailAddress = sadjflkadsj): : certificate has expired
Google Test trace:
/data0/somelongdirectorytoavoidrpathissues/src/kudu/src/kudu/rpc/rpc-test.cc:300: Connecting to 0.0.0.0:42509
I20260924 14:28:28.622663 14650 test_util.cc:175] -----------------------------------------------
I20260924 14:28:28.622829 14650 test_util.cc:176] Had fatal failures, leaving test files at /tmp/dist-test-taskUFGf9u/test-tmp/rpc-test.1.Parameters_TestRpc.TestCallWithChainCertAndRootCA_SSL_TCP.1790260107101899-14650-0

Full log

Note: This is test shard 2 of 8.
[==========] Running 21 tests from 2 test suites.
[----------] Global test environment set-up.
[----------] 1 test from TestRpc
[ RUN      ] TestRpc.TestMethodsByName
[       OK ] TestRpc.TestMethodsByName (7 ms)
[----------] 1 test from TestRpc (7 ms total)

[----------] 20 tests from Parameters/TestRpc
[ RUN      ] Parameters/TestRpc.TestAcceptorPoolStartStop/SSL_TCP
WARNING: Logging before InitGoogleLogging() is written to STDERR
I20260924 14:28:27.207608 14665 acceptor_pool.cc:254] collecting diagnostics on the listening RPC socket 0.0.0.0:34409 every 8 connection(s)
I20260924 14:28:27.209339 14666 acceptor_pool.cc:254] collecting diagnostics on the listening RPC socket 0.0.0.0:34409 every 8 connection(s)
I20260924 14:28:28.385772 14677 acceptor_pool.cc:254] collecting diagnostics on the listening RPC socket 0.0.0.0:45589 every 8 connection(s)
I20260924 14:28:28.387365 14678 acceptor_pool.cc:254] collecting diagnostics on the listening RPC socket 0.0.0.0:45589 every 8 connection(s)
I20260924 14:28:28.412717 14688 acceptor_pool.cc:254] collecting diagnostics on the listening RPC socket 0.0.0.0:43347 every 8 connection(s)
I20260924 14:28:28.414356 14689 acceptor_pool.cc:254] collecting diagnostics on the listening RPC socket 0.0.0.0:43347 every 8 connection(s)
I20260924 14:28:28.436769 14699 acceptor_pool.cc:254] collecting diagnostics on the listening RPC socket 0.0.0.0:41613 every 8 connection(s)
I20260924 14:28:28.437494 14700 acceptor_pool.cc:254] collecting diagnostics on the listening RPC socket 0.0.0.0:41613 every 8 connection(s)
I20260924 14:28:28.463474 14710 acceptor_pool.cc:254] collecting diagnostics on the listening RPC socket 0.0.0.0:36401 every 8 connection(s)
I20260924 14:28:28.464238 14711 acceptor_pool.cc:254] collecting diagnostics on the listening RPC socket 0.0.0.0:36401 every 8 connection(s)
[       OK ] Parameters/TestRpc.TestAcceptorPoolStartStop/SSL_TCP (1307 ms)
[ RUN      ] Parameters/TestRpc.TestCall/SSL_TCP
I20260924 14:28:28.491779 14723 acceptor_pool.cc:254] collecting diagnostics on the listening RPC socket 0.0.0.0:34483 every 8 connection(s)
I20260924 14:28:28.494077 14724 acceptor_pool.cc:254] collecting diagnostics on the listening RPC socket 0.0.0.0:34483 every 8 connection(s)
I20260924 14:28:28.499452 14650 rpc-test.cc:234] Connecting to 0.0.0.0:34483
[       OK ] Parameters/TestRpc.TestCall/SSL_TCP (114 ms)
[ RUN      ] Parameters/TestRpc.TestCallWithChainCertAndRootCA/SSL_TCP
I20260924 14:28:28.601320 14748 acceptor_pool.cc:254] collecting diagnostics on the listening RPC socket 0.0.0.0:42509 every 8 connection(s)
I20260924 14:28:28.602072 14749 acceptor_pool.cc:254] collecting diagnostics on the listening RPC socket 0.0.0.0:42509 every 8 connection(s)
/data0/somelongdirectorytoavoidrpathissues/src/kudu/src/kudu/rpc/rpc-test.cc:303: Failure
Failed
Bad status: Runtime error: could not verify certificate chain (error with cert: subject=CN = localhost, ST = sadfjas, C = AS, emailAddress = sdflkdsajf, O = lskdfjlsad, OU = sldfkja, issuer=C = AS, ST = ASDfkjdhf, L = lskdjf, O = saldfja, OU = skdjf, CN = localhost, emailAddress = sadjflkadsj): : certificate has expired
Google Test trace:
/data0/somelongdirectorytoavoidrpathissues/src/kudu/src/kudu/rpc/rpc-test.cc:300: Connecting to 0.0.0.0:42509
I20260924 14:28:28.622663 14650 test_util.cc:175] -----------------------------------------------
I20260924 14:28:28.622829 14650 test_util.cc:176] Had fatal failures, leaving test files at /tmp/dist-test-taskUFGf9u/test-tmp/rpc-test.1.Parameters_TestRpc.TestCallWithChainCertAndRootCA_SSL_TCP.1790260107101899-14650-0
[  FAILED  ] Parameters/TestRpc.TestCallWithChainCertAndRootCA/SSL_TCP, where GetParam() = (true, false) (39 ms)
[ RUN      ] Parameters/TestRpc.TestCallWithBadPasswordProtectedKey/SSL_TCP
[       OK ] Parameters/TestRpc.TestCallWithBadPasswordProtectedKey/SSL_TCP (32 ms)
[ RUN      ] Parameters/TestRpc.TestInvalidMethodCall/SSL_TCP
I20260924 14:28:28.687094 14785 acceptor_pool.cc:254] collecting diagnostics on the listening RPC socket 0.0.0.0:44583 every 8 connection(s)
I20260924 14:28:28.687973 14786 acceptor_pool.cc:254] collecting diagnostics on the listening RPC socket 0.0.0.0:44583 every 8 connection(s)
I20260924 14:28:28.691515 14650 rpc-test.cc:406] Connecting to 0.0.0.0:44583
[       OK ] Parameters/TestRpc.TestInvalidMethodCall/SSL_TCP (69 ms)
[ RUN      ] Parameters/TestRpc.TestHighFDs/SSL_TCP
I20260924 14:28:28.947829 14810 acceptor_pool.cc:254] collecting diagnostics on the listening RPC socket 0.0.0.0:38237 every 8 connection(s)
I20260924 14:28:28.948570 14811 acceptor_pool.cc:254] collecting diagnostics on the listening RPC socket 0.0.0.0:38237 every 8 connection(s)
[       OK ] Parameters/TestRpc.TestHighFDs/SSL_TCP (270 ms)
[ RUN      ] Parameters/TestRpc.TestConnectionAlwaysKeepalive/SSL_TCP
I20260924 14:28:29.031878 14833 acceptor_pool.cc:254] collecting diagnostics on the listening RPC socket 0.0.0.0:37665 every 8 connection(s)
I20260924 14:28:29.032639 14834 acceptor_pool.cc:254] collecting diagnostics on the listening RPC socket 0.0.0.0:37665 every 8 connection(s)
I20260924 14:28:29.035794 14650 rpc-test.cc:532] Connecting to 0.0.0.0:37665
[       OK ] Parameters/TestRpc.TestConnectionAlwaysKeepalive/SSL_TCP (3071 ms)
[ RUN      ] Parameters/TestRpc.TestReopenOutboundConnections/SSL_TCP
I20260924 14:28:32.085318 14856 acceptor_pool.cc:254] collecting diagnostics on the listening RPC socket 0.0.0.0:35945 every 8 connection(s)
I20260924 14:28:32.086098 14857 acceptor_pool.cc:254] collecting diagnostics on the listening RPC socket 0.0.0.0:35945 every 8 connection(s)
I20260924 14:28:32.089689 14650 rpc-test.cc:658] Connecting to 0.0.0.0:35945
[       OK ] Parameters/TestRpc.TestReopenOutboundConnections/SSL_TCP (417 ms)
[ RUN      ] Parameters/TestRpc.TestConnectionNetworkPlane/SSL_TCP
I20260924 14:28:32.521272 14880 acceptor_pool.cc:254] collecting diagnostics on the listening RPC socket 0.0.0.0:37701 every 8 connection(s)
I20260924 14:28:32.522095 14881 acceptor_pool.cc:254] collecting diagnostics on the listening RPC socket 0.0.0.0:37701 every 8 connection(s)
I20260924 14:28:32.525822 14650 rpc-test.cc:772] Connecting to 0.0.0.0:37701
[       OK ] Parameters/TestRpc.TestConnectionNetworkPlane/SSL_TCP (91 ms)
[ RUN      ] Parameters/TestRpc.TestTCPKeepalive/SSL_TCP
I20260924 14:28:32.614639 14905 acceptor_pool.cc:254] collecting diagnostics on the listening RPC socket 0.0.0.0:46185 every 8 connection(s)
I20260924 14:28:32.615496 14906 acceptor_pool.cc:254] collecting diagnostics on the listening RPC socket 0.0.0.0:46185 every 8 connection(s)
I20260924 14:28:32.653462 14909 rpc-test-base.h:222] got call: sleep_micros: 8000000 deferred: true
I20260924 14:28:40.657763 14909 rpcz_store.cc:275] Call kudu.rpc.GenericCalculatorService.Sleep from 127.0.0.1:59058 (request call id 0) took 8004 ms. Trace:
I20260924 14:28:40.658278 14909 rpcz_store.cc:276] 0924 14:28:32.653170 (+     0us) service_pool.cc:170] Inserting onto call queue
0924 14:28:32.653280 (+   110us) service_pool.cc:227] Handling call
0924 14:28:40.657530 (+8004250us) inbound_call.cc:173] Queueing success response
Metrics: {}
[       OK ] Parameters/TestRpc.TestTCPKeepalive/SSL_TCP (8098 ms)
[ RUN      ] Parameters/TestRpc.TestMaxSmallSidecars/SSL_TCP
I20260924 14:28:40.703437 14931 acceptor_pool.cc:254] collecting diagnostics on the listening RPC socket 0.0.0.0:45135 every 8 connection(s)
I20260924 14:28:40.704276 14932 acceptor_pool.cc:254] collecting diagnostics on the listening RPC socket 0.0.0.0:45135 every 8 connection(s)
[       OK ] Parameters/TestRpc.TestMaxSmallSidecars/SSL_TCP (211 ms)
[ RUN      ] Parameters/TestRpc.TestCallTimeout/SSL_TCP
I20260924 14:28:40.904973 14956 acceptor_pool.cc:254] collecting diagnostics on the listening RPC socket 0.0.0.0:37599 every 8 connection(s)
I20260924 14:28:40.905663 14957 acceptor_pool.cc:254] collecting diagnostics on the listening RPC socket 0.0.0.0:37599 every 8 connection(s)
I20260924 14:28:40.956436 14650 rpc-test-base.h:595] status: Timed out: connection negotiation to 0.0.0.0:37599 for RPC Sleep timed out after 0.000s (ON_OUTBOUND_QUEUE), seconds elapsed: 0.00307658
I20260924 14:28:40.964315 14960 rpc-test-base.h:222] got call: sleep_micros: 700000
I20260924 14:28:41.158118 14650 rpc-test-base.h:595] status: Timed out: Sleep RPC to 0.0.0.0:37599 timed out after 0.200s (SENT), seconds elapsed: 0.201314
I20260924 14:28:41.159799 14959 rpc-test-base.h:222] got call: sleep_micros: 2000000
W20260924 14:28:41.665004 14960 rpcz_store.cc:267] Call kudu.rpc.GenericCalculatorService.Sleep from 127.0.0.1:37338 (request call id 1) took 700 ms (client timeout 200 ms). Trace:
W20260924 14:28:41.665398 14960 rpcz_store.cc:269] 0924 14:28:40.964138 (+     0us) service_pool.cc:170] Inserting onto call queue
0924 14:28:40.964251 (+   113us) service_pool.cc:227] Handling call
0924 14:28:41.664921 (+700670us) inbound_call.cc:173] Queueing success response
Metrics: {}
I20260924 14:28:42.660619 14650 rpc-test-base.h:595] status: Timed out: Sleep RPC to 0.0.0.0:37599 timed out after 1.500s (SENT), seconds elapsed: 1.5021
W20260924 14:28:43.160436 14959 rpcz_store.cc:267] Call kudu.rpc.GenericCalculatorService.Sleep from 127.0.0.1:37338 (request call id 2) took 2001 ms (client timeout 1500 ms). Trace:
W20260924 14:28:43.160827 14959 rpcz_store.cc:269] 0924 14:28:41.159458 (+     0us) service_pool.cc:170] Inserting onto call queue
0924 14:28:41.159621 (+   163us) service_pool.cc:227] Handling call
0924 14:28:43.160350 (+2000729us) inbound_call.cc:173] Queueing success response
Metrics: {}
W20260924 14:28:43.161600 14953 connection.cc:441] server connection from 127.0.0.1:37338 torn down before Call kudu.rpc.GenericCalculatorService.Sleep from 127.0.0.1:37338 (request call id 2) could send its response
[       OK ] Parameters/TestRpc.TestCallTimeout/SSL_TCP (2280 ms)
[ RUN      ] Parameters/TestRpc.TestServerShutsDown/SSL_TCP
I20260924 14:28:43.169803 14650 rpc-test.cc:1125] Connecting to 0.0.0.0:36659
W20260924 14:28:43.180135 14973 negotiation.cc:337] Failed RPC negotiation. Trace:
0924 14:28:43.178009 (+     0us) reactor.cc:625] Submitting negotiation task for client connection to 0.0.0.0:36659 (local address 127.0.0.1:54108)
0924 14:28:43.178706 (+   697us) negotiation.cc:107] Waiting for socket to connect
0924 14:28:43.178764 (+    58us) client_negotiation.cc:174] Beginning negotiation
0924 14:28:43.179127 (+   363us) client_negotiation.cc:252] Sending NEGOTIATE NegotiatePB request
0924 14:28:43.179418 (+   291us) negotiation.cc:327] Negotiation complete: Network error: Client connection negotiation failed: client connection to 0.0.0.0:36659: BlockingWrite error: write error: Broken pipe (error 32)
Metrics: {"client-negotiator.queue_time_us":259}
[       OK ] Parameters/TestRpc.TestServerShutsDown/SSL_TCP (15 ms)
[ RUN      ] Parameters/TestRpc.TimedOutOnResponseMetric/SSL_TCP
I20260924 14:28:43.236150 14990 acceptor_pool.cc:254] collecting diagnostics on the listening RPC socket 0.0.0.0:36593 every 8 connection(s)
I20260924 14:28:43.237008 14991 acceptor_pool.cc:254] collecting diagnostics on the listening RPC socket 0.0.0.0:36593 every 8 connection(s)
W20260924 14:28:43.491698 14994 rpcz_store.cc:267] Call kudu.rpc_test.CalculatorService.Sleep from 127.0.0.1:53466 (request call id 3) took 50 ms (client timeout 25 ms). Trace:
W20260924 14:28:43.492102 14994 rpcz_store.cc:269] 0924 14:28:43.440941 (+     0us) service_pool.cc:170] Inserting onto call queue
0924 14:28:43.441078 (+   137us) service_pool.cc:227] Handling call
0924 14:28:43.491585 (+ 50507us) inbound_call.cc:173] Queueing success response
Related trace 'test_child':
Metrics: {"test_sleep_us":50000,"child_traces":[["test_child",{"related_trace_metric":1}]]}
W20260924 14:28:43.551383 14994 rpcz_store.cc:267] Call kudu.rpc_test.CalculatorService.Sleep from 127.0.0.1:53466 (request call id 4) took 50 ms (client timeout 50 ms). Trace:
W20260924 14:28:43.551770 14994 rpcz_store.cc:269] 0924 14:28:43.500648 (+     0us) service_pool.cc:170] Inserting onto call queue
0924 14:28:43.500774 (+   126us) service_pool.cc:227] Handling call
0924 14:28:43.551294 (+ 50520us) inbound_call.cc:173] Queueing success response
Related trace 'test_child':
Metrics: {"test_sleep_us":50000,"child_traces":[["test_child",{"related_trace_metric":1}]]}
[       OK ] Parameters/TestRpc.TimedOutOnResponseMetric/SSL_TCP (379 ms)
[ RUN      ] Parameters/TestRpc.AcceptorDispatchingTimesMetric/SSL_TCP
I20260924 14:28:43.576817 15015 acceptor_pool.cc:254] collecting diagnostics on the listening RPC socket 0.0.0.0:38339 every 8 connection(s)
I20260924 14:28:43.577767 15016 acceptor_pool.cc:254] collecting diagnostics on the listening RPC socket 0.0.0.0:38339 every 8 connection(s)
W20260924 14:28:43.583817 15011 negotiation.cc:337] Failed RPC negotiation. Trace:
0924 14:28:43.582323 (+     0us) reactor.cc:625] Submitting negotiation task for server connection from 127.0.0.1:41152 (local address 127.0.0.1:38339)
0924 14:28:43.582839 (+   516us) server_negotiation.cc:206] Beginning negotiation
0924 14:28:43.582858 (+    19us) server_negotiation.cc:399] Waiting for connection header
0924 14:28:43.583199 (+   341us) negotiation.cc:327] Negotiation complete: Network error: Server connection negotiation failed: server connection from 127.0.0.1:41152: BlockingRecv error: recv got EOF from 127.0.0.1:41152 (error 108)
Metrics: {"server-negotiator.queue_time_us":159}
[       OK ] Parameters/TestRpc.AcceptorDispatchingTimesMetric/SSL_TCP (26 ms)
[ RUN      ] Parameters/TestRpc.TestRpcCallbackDestroysMessenger/SSL_TCP
[       OK ] Parameters/TestRpc.TestRpcCallbackDestroysMessenger/SSL_TCP (29 ms)
[ RUN      ] Parameters/TestRpc.TestApplicationFeatureFlag/SSL_TCP
I20260924 14:28:43.635663 15040 acceptor_pool.cc:254] collecting diagnostics on the listening RPC socket 0.0.0.0:42947 every 8 connection(s)
I20260924 14:28:43.636467 15041 acceptor_pool.cc:254] collecting diagnostics on the listening RPC socket 0.0.0.0:42947 every 8 connection(s)
W20260924 14:28:43.675024 15037 messenger.cc:357] Unable to handle RPC call: Not implemented: call requires unsupported application feature flags: 99
[       OK ] Parameters/TestRpc.TestApplicationFeatureFlag/SSL_TCP (65 ms)
[ RUN      ] Parameters/TestRpc.TestCancellation/SSL_TCP
I20260924 14:28:43.717784 15065 acceptor_pool.cc:254] collecting diagnostics on the listening RPC socket 0.0.0.0:34793 every 8 connection(s)
I20260924 14:28:43.718621 15066 acceptor_pool.cc:254] collecting diagnostics on the listening RPC socket 0.0.0.0:34793 every 8 connection(s)
I20260924 14:28:43.722353 14650 rpc-test.cc:1648] Connecting to 0.0.0.0:34793
I20260924 14:28:43.867359 14650 rpc-test-base.h:595] status: Aborted: Sleep RPC to 0.0.0.0:34793 is cancelled in state READY, seconds elapsed: 0.000411438
I20260924 14:28:44.018803 14650 rpc-test-base.h:595] status: Aborted: Sleep RPC to 0.0.0.0:34793 is cancelled in state SENT, seconds elapsed: 0.000940297
I20260924 14:28:44.059330 15068 rpc-test-base.h:222] got call: sleep_micros: 510000
I20260924 14:28:44.188176 14650 rpc-test-base.h:595] status: Aborted: Sleep RPC to 0.0.0.0:34793 is cancelled in state SENT, seconds elapsed: 0.000952852
I20260924 14:28:44.242209 15067 rpc-test-base.h:222] got call: sleep_micros: 510000
I20260924 14:28:44.373325 14650 rpc-test-base.h:595] status: Aborted: Sleep RPC to 0.0.0.0:34793 is cancelled in state SENT, seconds elapsed: 0.00105436
W20260924 14:28:44.410718 15069 rpcz_store.cc:267] Call kudu.rpc.GenericCalculatorService.Sleep from 127.0.0.1:36386 (request call id 11) took 15 ms (client timeout 10 ms). Trace:
W20260924 14:28:44.411150 15069 rpcz_store.cc:269] 0924 14:28:44.394701 (+     0us) service_pool.cc:170] Inserting onto call queue
0924 14:28:44.410439 (+ 15738us) service_pool.cc:214] Skipping call since client already timed out
0924 14:28:44.410523 (+    84us) inbound_call.cc:173] Queueing failure response
Metrics: {}
I20260924 14:28:44.411684 15069 rpc-test-base.h:222] got call: sleep_micros: 1500000
W20260924 14:28:44.570006 15068 rpcz_store.cc:267] Call kudu.rpc.GenericCalculatorService.Sleep from 127.0.0.1:36386 (request call id 3) took 510 ms (client timeout 10 ms). Trace:
W20260924 14:28:44.570398 15068 rpcz_store.cc:269] 0924 14:28:44.059114 (+     0us) service_pool.cc:170] Inserting onto call queue
0924 14:28:44.059266 (+   152us) service_pool.cc:227] Handling call
0924 14:28:44.569943 (+510677us) inbound_call.cc:173] Queueing success response
Metrics: {}
W20260924 14:28:44.752976 15067 rpcz_store.cc:267] Call kudu.rpc.GenericCalculatorService.Sleep from 127.0.0.1:36386 (request call id 7) took 511 ms (client timeout 10 ms). Trace:
W20260924 14:28:44.753295 15067 rpcz_store.cc:269] 0924 14:28:44.241968 (+     0us) service_pool.cc:170] Inserting onto call queue
0924 14:28:44.242130 (+   162us) service_pool.cc:227] Handling call
0924 14:28:44.752914 (+510784us) inbound_call.cc:173] Queueing success response
Metrics: {}
I20260924 14:28:45.375355 14650 rpc-test-base.h:595] status: Timed out: Sleep RPC to 0.0.0.0:34793 timed out after 1.000s (SENT), seconds elapsed: 1.00157
I20260924 14:28:45.376737 15067 rpc-test-base.h:222] got call: sleep_micros: 1500000
W20260924 14:28:45.912164 15069 rpcz_store.cc:267] Call kudu.rpc.GenericCalculatorService.Sleep from 127.0.0.1:36386 (request call id 12) took 1517 ms (client timeout 1000 ms). Trace:
W20260924 14:28:45.912474 15069 rpcz_store.cc:269] 0924 14:28:44.395006 (+     0us) service_pool.cc:170] Inserting onto call queue
0924 14:28:44.411651 (+ 16645us) service_pool.cc:227] Handling call
0924 14:28:45.912109 (+1500458us) inbound_call.cc:173] Queueing success response
Metrics: {}
I20260924 14:28:46.376899 14650 rpc-test-base.h:595] status: Timed out: Sleep RPC to 0.0.0.0:34793 timed out after 1.000s (SENT), seconds elapsed: 1.00119
W20260924 14:28:46.378332 15064 messenger.cc:357] Unable to handle RPC call: Not implemented: call requires unsupported application feature flags: 99, 1
W20260924 14:28:46.379737 15064 messenger.cc:357] Unable to handle RPC call: Not implemented: call requires unsupported application feature flags: 99, 1
W20260924 14:28:46.877210 15067 rpcz_store.cc:267] Call kudu.rpc.GenericCalculatorService.Sleep from 127.0.0.1:36386 (request call id 13) took 1500 ms (client timeout 1000 ms). Trace:
W20260924 14:28:46.877534 15067 rpcz_store.cc:269] 0924 14:28:45.376556 (+     0us) service_pool.cc:170] Inserting onto call queue
0924 14:28:45.376685 (+   129us) service_pool.cc:227] Handling call
0924 14:28:46.877160 (+1500475us) inbound_call.cc:173] Queueing success response
Metrics: {}
W20260924 14:28:46.878067 15064 connection.cc:441] server connection from 127.0.0.1:36386 torn down before Call kudu.rpc.GenericCalculatorService.Sleep from 127.0.0.1:36386 (request call id 13) could send its response
[       OK ] Parameters/TestRpc.TestCancellation/SSL_TCP (3200 ms)
[ RUN      ] Parameters/TestRpc.TestCancellationMultiThreads/SSL_TCP
I20260924 14:28:46.921929 15090 acceptor_pool.cc:254] collecting diagnostics on the listening RPC socket 0.0.0.0:42195 every 8 connection(s)
I20260924 14:28:46.922698 15091 acceptor_pool.cc:254] collecting diagnostics on the listening RPC socket 0.0.0.0:42195 every 8 connection(s)
I20260924 14:28:46.925843 14650 rpc-test.cc:1808] Connecting to 0.0.0.0:42195
I20260924 14:28:47.068928 15104 test_util.cc:268] Using random seed: 1793979100
I20260924 14:28:47.070055 15105 test_util.cc:268] Using random seed: 1793980240
I20260924 14:28:47.071467 15106 test_util.cc:268] Using random seed: 1793981644
I20260924 14:28:47.072734 15107 test_util.cc:268] Using random seed: 1793982898
I20260924 14:28:47.074452 15108 test_util.cc:268] Using random seed: 1793984470
I20260924 14:28:47.076100 15109 test_util.cc:268] Using random seed: 1793986176
I20260924 14:28:47.077405 15110 test_util.cc:268] Using random seed: 1793987467
I20260924 14:28:47.078984 15111 test_util.cc:268] Using random seed: 1793988980
I20260924 14:28:47.080361 15112 test_util.cc:268] Using random seed: 1793990437
I20260924 14:28:47.081707 15113 test_util.cc:268] Using random seed: 1793991787
I20260924 14:28:47.083187 15114 test_util.cc:268] Using random seed: 1793993202
I20260924 14:28:47.084867 15115 test_util.cc:268] Using random seed: 1793994893
I20260924 14:28:47.086297 15116 test_util.cc:268] Using random seed: 1793996372
I20260924 14:28:47.087779 15117 test_util.cc:268] Using random seed: 1793997820
I20260924 14:28:47.089628 15118 test_util.cc:268] Using random seed: 1793999652
I20260924 14:28:47.091923 15119 test_util.cc:268] Using random seed: 1794001943
I20260924 14:28:47.094132 15120 test_util.cc:268] Using random seed: 1794004020
I20260924 14:28:47.096186 15121 test_util.cc:268] Using random seed: 1794006185
I20260924 14:28:47.098048 15122 test_util.cc:268] Using random seed: 1794008040
I20260924 14:28:47.100387 15123 test_util.cc:268] Using random seed: 1794010323
I20260924 14:28:47.102145 15124 test_util.cc:268] Using random seed: 1794012151
I20260924 14:28:47.103905 15125 test_util.cc:268] Using random seed: 1794013941
I20260924 14:28:47.105537 15126 test_util.cc:268] Using random seed: 1794015573
I20260924 14:28:47.107553 15127 test_util.cc:268] Using random seed: 1794017581
I20260924 14:28:47.109297 15128 test_util.cc:268] Using random seed: 1794019321
I20260924 14:28:47.111285 15129 test_util.cc:268] Using random seed: 1794021310
I20260924 14:28:47.113041 15130 test_util.cc:268] Using random seed: 1794023037
I20260924 14:28:47.114671 15131 test_util.cc:268] Using random seed: 1794024694
I20260924 14:28:47.116466 15132 test_util.cc:268] Using random seed: 1794026482
I20260924 14:28:47.118999 15133 test_util.cc:268] Using random seed: 1794028984
[       OK ] Parameters/TestRpc.TestCancellationMultiThreads/SSL_TCP (17696 ms)
[ RUN      ] Parameters/TestRpc.TestCallId/SSL_TCP
I20260924 14:29:04.602615 15147 acceptor_pool.cc:254] collecting diagnostics on the listening RPC socket 0.0.0.0:35461 every 8 connection(s)
I20260924 14:29:04.603456 15148 acceptor_pool.cc:254] collecting diagnostics on the listening RPC socket 0.0.0.0:35461 every 8 connection(s)
[       OK ] Parameters/TestRpc.TestCallId/SSL_TCP (72 ms)
[----------] 20 tests from Parameters/TestRpc (37494 ms total)

[----------] Global test environment tear-down
[==========] 21 tests from 2 test suites ran. (37502 ms total)
[  PASSED  ] 20 tests.
[  FAILED  ] 1 test, listed below:
[  FAILED  ] Parameters/TestRpc.TestCallWithChainCertAndRootCA/SSL_TCP, where GetParam() = (true, false)

 1 FAILED TEST