Diagnosed failure

Parameters/TestRpc.TestCallWithChainCertAndChainCA/SSL_UnixSocket: /data0/somelongdirectorytoavoidrpathissues/src/kudu/src/kudu/rpc/rpc-test.cc:270: Failure
Failed
Bad status: Runtime error: could not verify certificate chain (error with cert: subject=CN = localhost, ST = sadfjas, C = AS, emailAddress = sdflkdsajf, O = lskdfjlsad, OU = sldfkja, issuer=C = AS, ST = ASDfkjdhf, L = lskdjf, O = saldfja, OU = skdjf, CN = localhost, emailAddress = sadjflkadsj): : certificate has expired
Google Test trace:
/data0/somelongdirectorytoavoidrpathissues/src/kudu/src/kudu/rpc/rpc-test.cc:267: Connecting to unix:/tmp/dist-test-taskUlkMRo/test-tmp/rpc-test-c46632443a834c4a916caccfeee46d0c.sock
I20260928 06:31:26.348971  9030 test_util.cc:175] -----------------------------------------------
I20260928 06:31:26.349066  9030 test_util.cc:176] Had fatal failures, leaving test files at /tmp/dist-test-taskUlkMRo/test-tmp/rpc-test.6.Parameters_TestRpc.TestCallWithChainCertAndChainCA_SSL_UnixSocket.1790577086280867-9030-0

Full log

Note: This is test shard 7 of 8.
[==========] Running 21 tests from 2 test suites.
[----------] Global test environment set-up.
[----------] 20 tests from Parameters/TestRpc
[ RUN      ] Parameters/TestRpc.TestMessengerCreateDestroy/SSL_UnixSocket
WARNING: Logging before InitGoogleLogging() is written to STDERR
I20260928 06:31:26.299932  9030 rpc-test.cc:169] started messenger TestCreateDestroy
[       OK ] Parameters/TestRpc.TestMessengerCreateDestroy/SSL_UnixSocket (17 ms)
[ RUN      ] Parameters/TestRpc.TestNegotiationDeadlock/SSL_UnixSocket
I20260928 06:31:26.313268  9050 acceptor_pool.cc:254] collecting diagnostics on the listening RPC socket unix:/tmp/dist-test-taskUlkMRo/test-tmp/rpc-test-2acb140ac81940a8b2e0168efe8fa51e.sock every 8 connection(s)
I20260928 06:31:26.313294  9051 acceptor_pool.cc:254] collecting diagnostics on the listening RPC socket unix:/tmp/dist-test-taskUlkMRo/test-tmp/rpc-test-2acb140ac81940a8b2e0168efe8fa51e.sock every 8 connection(s)
[       OK ] Parameters/TestRpc.TestNegotiationDeadlock/SSL_UnixSocket (19 ms)
[ RUN      ] Parameters/TestRpc.TestCallWithChainCertAndChainCA/SSL_UnixSocket
I20260928 06:31:26.344852  9066 acceptor_pool.cc:254] collecting diagnostics on the listening RPC socket unix:/tmp/dist-test-taskUlkMRo/test-tmp/rpc-test-c46632443a834c4a916caccfeee46d0c.sock every 8 connection(s)
I20260928 06:31:26.344898  9067 acceptor_pool.cc:254] collecting diagnostics on the listening RPC socket unix:/tmp/dist-test-taskUlkMRo/test-tmp/rpc-test-c46632443a834c4a916caccfeee46d0c.sock every 8 connection(s)
/data0/somelongdirectorytoavoidrpathissues/src/kudu/src/kudu/rpc/rpc-test.cc:270: Failure
Failed
Bad status: Runtime error: could not verify certificate chain (error with cert: subject=CN = localhost, ST = sadfjas, C = AS, emailAddress = sdflkdsajf, O = lskdfjlsad, OU = sldfkja, issuer=C = AS, ST = ASDfkjdhf, L = lskdjf, O = saldfja, OU = skdjf, CN = localhost, emailAddress = sadjflkadsj): : certificate has expired
Google Test trace:
/data0/somelongdirectorytoavoidrpathissues/src/kudu/src/kudu/rpc/rpc-test.cc:267: Connecting to unix:/tmp/dist-test-taskUlkMRo/test-tmp/rpc-test-c46632443a834c4a916caccfeee46d0c.sock
I20260928 06:31:26.348971  9030 test_util.cc:175] -----------------------------------------------
I20260928 06:31:26.349066  9030 test_util.cc:176] Had fatal failures, leaving test files at /tmp/dist-test-taskUlkMRo/test-tmp/rpc-test.6.Parameters_TestRpc.TestCallWithChainCertAndChainCA_SSL_UnixSocket.1790577086280867-9030-0
[  FAILED  ] Parameters/TestRpc.TestCallWithChainCertAndChainCA/SSL_UnixSocket, where GetParam() = (true, true) (28 ms)
[ RUN      ] Parameters/TestRpc.TestCallWithPasswordProtectedKey/SSL_UnixSocket
I20260928 06:31:26.387251  9091 acceptor_pool.cc:254] collecting diagnostics on the listening RPC socket unix:/tmp/dist-test-taskUlkMRo/test-tmp/rpc-test-4c4e234539f140689c42dce416dcaae3.sock every 8 connection(s)
I20260928 06:31:26.387275  9092 acceptor_pool.cc:254] collecting diagnostics on the listening RPC socket unix:/tmp/dist-test-taskUlkMRo/test-tmp/rpc-test-4c4e234539f140689c42dce416dcaae3.sock every 8 connection(s)
W20260928 06:31:26.420312  9088 connection.cc:196] Error closing socket: Network error: TlsSocket::Close: Broken pipe
[       OK ] Parameters/TestRpc.TestCallWithPasswordProtectedKey/SSL_UnixSocket (72 ms)
[ RUN      ] Parameters/TestRpc.TestCallToBadServer/SSL_UnixSocket
I20260928 06:31:26.430882  9030 rpc-test.cc:394] Status: Network error: Client connection negotiation failed: client connection to 0.0.0.0:0: connect: Connection refused (error 111)
I20260928 06:31:26.431231  9030 rpc-test.cc:394] Status: Network error: Client connection negotiation failed: client connection to 0.0.0.0:0: connect: Connection refused (error 111)
I20260928 06:31:26.431512  9030 rpc-test.cc:394] Status: Network error: Client connection negotiation failed: client connection to 0.0.0.0:0: connect: Connection refused (error 111)
I20260928 06:31:26.431777  9030 rpc-test.cc:394] Status: Network error: Client connection negotiation failed: client connection to 0.0.0.0:0: connect: Connection refused (error 111)
I20260928 06:31:26.432027  9030 rpc-test.cc:394] Status: Network error: Client connection negotiation failed: client connection to 0.0.0.0:0: connect: Connection refused (error 111)
[       OK ] Parameters/TestRpc.TestCallToBadServer/SSL_UnixSocket (10 ms)
[ RUN      ] Parameters/TestRpc.TestWrongService/SSL_UnixSocket
I20260928 06:31:26.466405  9126 acceptor_pool.cc:254] collecting diagnostics on the listening RPC socket unix:/tmp/dist-test-taskUlkMRo/test-tmp/rpc-test-7143611ce92b4bc39dc2b503eadc8db9.sock every 8 connection(s)
I20260928 06:31:26.466451  9127 acceptor_pool.cc:254] collecting diagnostics on the listening RPC socket unix:/tmp/dist-test-taskUlkMRo/test-tmp/rpc-test-7143611ce92b4bc39dc2b503eadc8db9.sock every 8 connection(s)
I20260928 06:31:26.490268  9123 messenger.cc:345] service WrongServiceName not registered on TestServer
[       OK ] Parameters/TestRpc.TestWrongService/SSL_UnixSocket (59 ms)
[ RUN      ] Parameters/TestRpc.TestConnectionKeepalive/SSL_UnixSocket
I20260928 06:31:26.500593  9149 acceptor_pool.cc:254] collecting diagnostics on the listening RPC socket unix:/tmp/dist-test-taskUlkMRo/test-tmp/rpc-test-2b403383fc30483580cc7ae394c6ec22.sock every 8 connection(s)
I20260928 06:31:26.500640  9150 acceptor_pool.cc:254] collecting diagnostics on the listening RPC socket unix:/tmp/dist-test-taskUlkMRo/test-tmp/rpc-test-2b403383fc30483580cc7ae394c6ec22.sock every 8 connection(s)
I20260928 06:31:26.500846  9030 rpc-test.cc:488] Connecting to unix:/tmp/dist-test-taskUlkMRo/test-tmp/rpc-test-2b403383fc30483580cc7ae394c6ec22.sock
W20260928 06:31:26.993290  9162 connection.cc:196] Error closing socket: Network error: TlsSocket::Close: Broken pipe
[       OK ] Parameters/TestRpc.TestConnectionKeepalive/SSL_UnixSocket (1034 ms)
[ RUN      ] Parameters/TestRpc.TestClientConnectionMetrics/SSL_UnixSocket
I20260928 06:31:27.532130  9174 acceptor_pool.cc:254] collecting diagnostics on the listening RPC socket unix:/tmp/dist-test-taskUlkMRo/test-tmp/rpc-test-21333f918b2e4247ae86e80c42e79c18.sock every 8 connection(s)
I20260928 06:31:27.532183  9175 acceptor_pool.cc:254] collecting diagnostics on the listening RPC socket unix:/tmp/dist-test-taskUlkMRo/test-tmp/rpc-test-21333f918b2e4247ae86e80c42e79c18.sock every 8 connection(s)
I20260928 06:31:27.532361  9030 rpc-test.cc:569] Connecting to unix:/tmp/dist-test-taskUlkMRo/test-tmp/rpc-test-21333f918b2e4247ae86e80c42e79c18.sock
W20260928 06:31:35.645339  9171 connection.cc:196] Error closing socket: Network error: TlsSocket::Close: Broken pipe
[       OK ] Parameters/TestRpc.TestClientConnectionMetrics/SSL_UnixSocket (8119 ms)
[ RUN      ] Parameters/TestRpc.TestCredentialsPolicy/SSL_UnixSocket
I20260928 06:31:35.666252  9197 acceptor_pool.cc:254] collecting diagnostics on the listening RPC socket unix:/tmp/dist-test-taskUlkMRo/test-tmp/rpc-test-bbf98cd8c3b041beb840940dd1d74512.sock every 8 connection(s)
I20260928 06:31:35.666307  9198 acceptor_pool.cc:254] collecting diagnostics on the listening RPC socket unix:/tmp/dist-test-taskUlkMRo/test-tmp/rpc-test-bbf98cd8c3b041beb840940dd1d74512.sock every 8 connection(s)
I20260928 06:31:35.666496  9030 rpc-test.cc:700] Connecting to unix:/tmp/dist-test-taskUlkMRo/test-tmp/rpc-test-bbf98cd8c3b041beb840940dd1d74512.sock
W20260928 06:31:35.681968  9196 connection.cc:196] Error closing socket: Network error: TlsSocket::Close: Broken pipe
[       OK ] Parameters/TestRpc.TestCredentialsPolicy/SSL_UnixSocket (40 ms)
[ RUN      ] Parameters/TestRpc.TestCallLongerThanKeepalive/SSL_UnixSocket
I20260928 06:31:35.701385  9222 acceptor_pool.cc:254] collecting diagnostics on the listening RPC socket unix:/tmp/dist-test-taskUlkMRo/test-tmp/rpc-test-73f95167ad8144e0848f8e6a90873ace.sock every 8 connection(s)
I20260928 06:31:35.701453  9223 acceptor_pool.cc:254] collecting diagnostics on the listening RPC socket unix:/tmp/dist-test-taskUlkMRo/test-tmp/rpc-test-73f95167ad8144e0848f8e6a90873ace.sock every 8 connection(s)
I20260928 06:31:35.721575  9224 rpc-test-base.h:222] got call: sleep_micros: 3000000 deferred: true
I20260928 06:31:38.722254  9224 rpcz_store.cc:275] Call kudu.rpc.GenericCalculatorService.Sleep from unix:<unnamed> (request call id 0) took 3000 ms. Trace:
I20260928 06:31:38.722357  9224 rpcz_store.cc:276] 0928 06:31:35.721522 (+     0us) service_pool.cc:170] Inserting onto call queue
0928 06:31:35.721558 (+    36us) service_pool.cc:227] Handling call
0928 06:31:38.722237 (+3000679us) inbound_call.cc:173] Queueing success response
Metrics: {}
[       OK ] Parameters/TestRpc.TestCallLongerThanKeepalive/SSL_UnixSocket (3038 ms)
[ RUN      ] Parameters/TestRpc.TestRpcSidecar/SSL_UnixSocket
I20260928 06:31:38.737325  9247 acceptor_pool.cc:254] collecting diagnostics on the listening RPC socket unix:/tmp/dist-test-taskUlkMRo/test-tmp/rpc-test-b40885495d9c46828a39179a6033617f.sock every 8 connection(s)
I20260928 06:31:38.737376  9248 acceptor_pool.cc:254] collecting diagnostics on the listening RPC socket unix:/tmp/dist-test-taskUlkMRo/test-tmp/rpc-test-b40885495d9c46828a39179a6033617f.sock every 8 connection(s)
[       OK ] Parameters/TestRpc.TestRpcSidecar/SSL_UnixSocket (54 ms)
[ RUN      ] Parameters/TestRpc.TestRpcSidecarLimits/SSL_UnixSocket
I20260928 06:31:41.413199  9272 acceptor_pool.cc:254] collecting diagnostics on the listening RPC socket unix:/tmp/dist-test-taskUlkMRo/test-tmp/rpc-test-fc8b8828aec545588a30a91bad28487c.sock every 8 connection(s)
I20260928 06:31:41.413211  9273 acceptor_pool.cc:254] collecting diagnostics on the listening RPC socket unix:/tmp/dist-test-taskUlkMRo/test-tmp/rpc-test-fc8b8828aec545588a30a91bad28487c.sock every 8 connection(s)
W20260928 06:31:41.425110  9030 serialization.cc:72] Serialized kudu.rpc_test.PushStringsRequestPB (2147483654 bytes) is larger than the maximum configured RPC message size (52428800 bytes). Sending anyway, but peer may reject the data.
W20260928 06:31:41.428058  9269 connection.cc:535] server connection from unix:<unnamed> recv error: Network error: RPC frame had a length of 2147483714, but we only support messages up to 52428800 bytes long.
W20260928 06:31:41.428107  9269 connection.cc:158] shutting down server connection from unix:<unnamed> with pending inbound data: 4/2147483714 bytes received; last active 0 ns ago: status Network error: RPC frame had a length of 2147483714, but we only support messages up to 52428800 bytes long.
W20260928 06:31:41.428225  9285 connection.cc:698] client connection to unix:/tmp/dist-test-taskUlkMRo/test-tmp/rpc-test-fc8b8828aec545588a30a91bad28487c.sock send error: Network error: failed to write to TLS socket: Broken pipe
W20260928 06:31:41.428365  9285 connection.cc:196] Error closing socket: Network error: TlsSocket::Close: Success
I20260928 06:31:41.433653  9297 acceptor_pool.cc:254] collecting diagnostics on the listening RPC socket unix:/tmp/dist-test-taskUlkMRo/test-tmp/rpc-test-fc8b8828aec545588a30a91bad28487c.sock every 8 connection(s)
I20260928 06:31:41.433676  9298 acceptor_pool.cc:254] collecting diagnostics on the listening RPC socket unix:/tmp/dist-test-taskUlkMRo/test-tmp/rpc-test-fc8b8828aec545588a30a91bad28487c.sock every 8 connection(s)
W20260928 06:31:46.137790  9294 connection.cc:577] server connection from unix:<unnamed>: received bad data: 'Corruption: Invalid packet: message had a length of 2147483710, but we only support messages up to 2147483647 bytes
'
W20260928 06:31:46.138155  9310 connection.cc:196] Error closing socket: Network error: TlsSocket::Close: Broken pipe
[       OK ] Parameters/TestRpc.TestRpcSidecarLimits/SSL_UnixSocket (7362 ms)
[ RUN      ] Parameters/TestRpc.TestCallTimeoutDoesntAffectNegotiation/SSL_UnixSocket
I20260928 06:31:46.190315  9322 acceptor_pool.cc:254] collecting diagnostics on the listening RPC socket unix:/tmp/dist-test-taskUlkMRo/test-tmp/rpc-test-ae195dbbcf5e437d926944332cb16437.sock every 8 connection(s)
I20260928 06:31:46.190358  9323 acceptor_pool.cc:254] collecting diagnostics on the listening RPC socket unix:/tmp/dist-test-taskUlkMRo/test-tmp/rpc-test-ae195dbbcf5e437d926944332cb16437.sock every 8 connection(s)
W20260928 06:31:46.203570  9318 negotiation.cc:266] Injecting 500ms delay in negotiation
I20260928 06:31:46.253822  9030 rpc-test-base.h:595] status: Timed out: connection negotiation to unix:/tmp/dist-test-taskUlkMRo/test-tmp/rpc-test-ae195dbbcf5e437d926944332cb16437.sock for RPC Sleep timed out after 0.050s (ON_OUTBOUND_QUEUE), seconds elapsed: 0.050588
W20260928 06:31:46.712849  9319 connection.cc:196] Error closing socket: Network error: TlsSocket::Close: Broken pipe
[       OK ] Parameters/TestRpc.TestCallTimeoutDoesntAffectNegotiation/SSL_UnixSocket (572 ms)
[ RUN      ] Parameters/TestRpc.TestRpcHandlerLatencyMetric/SSL_UnixSocket
I20260928 06:31:46.723222  9347 acceptor_pool.cc:254] collecting diagnostics on the listening RPC socket unix:/tmp/dist-test-taskUlkMRo/test-tmp/rpc-test-8b016923589a4c2f88e980708a88e715.sock every 8 connection(s)
I20260928 06:31:46.723258  9348 acceptor_pool.cc:254] collecting diagnostics on the listening RPC socket unix:/tmp/dist-test-taskUlkMRo/test-tmp/rpc-test-8b016923589a4c2f88e980708a88e715.sock every 8 connection(s)
I20260928 06:31:46.754571  9030 rpc-test.cc:1236] Sleep() min lat: 20274
I20260928 06:31:46.754645  9030 rpc-test.cc:1237] Sleep() mean lat: 20274
I20260928 06:31:46.754671  9030 rpc-test.cc:1238] Sleep() max lat: 20274
I20260928 06:31:46.754684  9030 rpc-test.cc:1239] Sleep() #calls: 1
[       OK ] Parameters/TestRpc.TestRpcHandlerLatencyMetric/SSL_UnixSocket (42 ms)
[ RUN      ] Parameters/TestRpc.TimedOutOnResponseMetricServiceQueue/SSL_UnixSocket
I20260928 06:31:46.767170  9373 acceptor_pool.cc:254] collecting diagnostics on the listening RPC socket unix:/tmp/dist-test-taskUlkMRo/test-tmp/rpc-test-022bbdd1e29f4da1b73ec00d0c7613ac.sock every 8 connection(s)
I20260928 06:31:46.767218  9374 acceptor_pool.cc:254] collecting diagnostics on the listening RPC socket unix:/tmp/dist-test-taskUlkMRo/test-tmp/rpc-test-022bbdd1e29f4da1b73ec00d0c7613ac.sock every 8 connection(s)
W20260928 06:31:46.819867  9375 rpcz_store.cc:267] Call kudu.rpc_test.CalculatorService.Sleep from unix:<unnamed> (request call id 2) took 20 ms (client timeout 20 ms). Trace:
W20260928 06:31:46.819988  9375 rpcz_store.cc:269] 0928 06:31:46.799594 (+     0us) service_pool.cc:170] Inserting onto call queue
0928 06:31:46.819814 (+ 20220us) service_pool.cc:214] Skipping call since client already timed out
0928 06:31:46.819826 (+    12us) inbound_call.cc:173] Queueing failure response
Metrics: {}
W20260928 06:31:46.820568  9370 connection.cc:196] Error closing socket: Network error: TlsSocket::Close: Broken pipe
[       OK ] Parameters/TestRpc.TimedOutOnResponseMetricServiceQueue/SSL_UnixSocket (64 ms)
[ RUN      ] Parameters/TestRpc.RpcPendingConnectionsMetric/SSL_UnixSocket
I20260928 06:31:46.823182  9396 acceptor_pool.cc:254] collecting diagnostics on the listening RPC socket 0.0.0.0:45237 every 8 connection(s)
I20260928 06:31:46.823246  9397 acceptor_pool.cc:254] collecting diagnostics on the listening RPC socket 0.0.0.0:45237 every 8 connection(s)
W20260928 06:31:46.823863  9392 negotiation.cc:337] Failed RPC negotiation. Trace:
0928 06:31:46.823685 (+     0us) reactor.cc:625] Submitting negotiation task for server connection from 127.0.0.1:57658 (local address 127.0.0.1:45237)
0928 06:31:46.823741 (+    56us) server_negotiation.cc:206] Beginning negotiation
0928 06:31:46.823743 (+     2us) server_negotiation.cc:399] Waiting for connection header
0928 06:31:46.823816 (+    73us) negotiation.cc:327] Negotiation complete: Network error: Server connection negotiation failed: server connection from 127.0.0.1:57658: BlockingRecv error: recv got EOF from 127.0.0.1:57658 (error 108)
Metrics: {"server-negotiator.queue_time_us":27}
[       OK ] Parameters/TestRpc.RpcPendingConnectionsMetric/SSL_UnixSocket (13 ms)
[ RUN      ] Parameters/TestRpc.TestRpcContextClientDeadline/SSL_UnixSocket
I20260928 06:31:46.857020  9412 acceptor_pool.cc:254] collecting diagnostics on the listening RPC socket unix:/tmp/dist-test-taskUlkMRo/test-tmp/rpc-test-dadc8d6eedfe4d5bbe5c956c815f1048.sock every 8 connection(s)
I20260928 06:31:46.857069  9413 acceptor_pool.cc:254] collecting diagnostics on the listening RPC socket unix:/tmp/dist-test-taskUlkMRo/test-tmp/rpc-test-dadc8d6eedfe4d5bbe5c956c815f1048.sock every 8 connection(s)
W20260928 06:31:46.896374  9409 connection.cc:196] Error closing socket: Network error: TlsSocket::Close: Broken pipe
[       OK ] Parameters/TestRpc.TestRpcContextClientDeadline/SSL_UnixSocket (62 ms)
[ RUN      ] Parameters/TestRpc.TestApplicationFeatureFlagUnsupportedServer/SSL_UnixSocket
I20260928 06:31:46.914148  9437 acceptor_pool.cc:254] collecting diagnostics on the listening RPC socket unix:/tmp/dist-test-taskUlkMRo/test-tmp/rpc-test-19f29533844f484ba80b8372274cc1fd.sock every 8 connection(s)
I20260928 06:31:46.914196  9438 acceptor_pool.cc:254] collecting diagnostics on the listening RPC socket unix:/tmp/dist-test-taskUlkMRo/test-tmp/rpc-test-19f29533844f484ba80b8372274cc1fd.sock every 8 connection(s)
[       OK ] Parameters/TestRpc.TestApplicationFeatureFlagUnsupportedServer/SSL_UnixSocket (32 ms)
[ RUN      ] Parameters/TestRpc.TestCancellationAsync/SSL_UnixSocket
I20260928 06:31:46.943481  9462 acceptor_pool.cc:254] collecting diagnostics on the listening RPC socket unix:/tmp/dist-test-taskUlkMRo/test-tmp/rpc-test-1af2018733ba42d7abb52fa8fa0b7a32.sock every 8 connection(s)
I20260928 06:31:46.943533  9463 acceptor_pool.cc:254] collecting diagnostics on the listening RPC socket unix:/tmp/dist-test-taskUlkMRo/test-tmp/rpc-test-1af2018733ba42d7abb52fa8fa0b7a32.sock every 8 connection(s)
I20260928 06:31:46.943703  9030 rpc-test.cc:1716] Connecting to unix:/tmp/dist-test-taskUlkMRo/test-tmp/rpc-test-1af2018733ba42d7abb52fa8fa0b7a32.sock
I20260928 06:31:46.954026  9030 test_util.cc:268] Using random seed: 946284327
I20260928 06:31:46.968181  9466 rpc-test-base.h:240] got call: sleep_micros: 500 pattern: 4294967295 num_repetitions: 2097152 sidecar_idx: 0
I20260928 06:31:46.978608  9466 rpc-test-base.h:240] got call: sleep_micros: 500 pattern: 4294967295 num_repetitions: 2097152 sidecar_idx: 0
I20260928 06:31:46.988852  9466 rpc-test-base.h:240] got call: sleep_micros: 500 pattern: 4294967295 num_repetitions: 2097152 sidecar_idx: 0
I20260928 06:31:46.999135  9466 rpc-test-base.h:240] got call: sleep_micros: 500 pattern: 4294967295 num_repetitions: 2097152 sidecar_idx: 0
I20260928 06:31:47.009356  9466 rpc-test-base.h:240] got call: sleep_micros: 500 pattern: 4294967295 num_repetitions: 2097152 sidecar_idx: 0
I20260928 06:31:47.020687  9466 rpc-test-base.h:240] got call: sleep_micros: 500 pattern: 4294967295 num_repetitions: 2097152 sidecar_idx: 0
I20260928 06:31:47.030754  9466 rpc-test-base.h:240] got call: sleep_micros: 500 pattern: 4294967295 num_repetitions: 2097152 sidecar_idx: 0
I20260928 06:31:47.040737  9466 rpc-test-base.h:240] got call: sleep_micros: 500 pattern: 4294967295 num_repetitions: 2097152 sidecar_idx: 0
W20260928 06:31:47.042363  9459 connection.cc:196] Error closing socket: Network error: TlsSocket::Close: Broken pipe
W20260928 06:31:47.043773  9459 connection.cc:441] server connection from unix:<unnamed> torn down before Call kudu.rpc.GenericCalculatorService.SleepWithSidecar from unix:<unnamed> (request call id 9) could send its response
[       OK ] Parameters/TestRpc.TestCancellationAsync/SSL_UnixSocket (114 ms)
[ RUN      ] Parameters/TestRpc.TestPerformanceBySocketType/SSL_UnixSocket
I20260928 06:31:47.054301  9487 acceptor_pool.cc:254] collecting diagnostics on the listening RPC socket unix:/tmp/dist-test-taskUlkMRo/test-tmp/rpc-test-b373cc3dca7142f6bf007dc38b3eb9b2.sock every 8 connection(s)
I20260928 06:31:47.054345  9488 acceptor_pool.cc:254] collecting diagnostics on the listening RPC socket unix:/tmp/dist-test-taskUlkMRo/test-tmp/rpc-test-b373cc3dca7142f6bf007dc38b3eb9b2.sock every 8 connection(s)
I20260928 06:31:47.054656  9030 rpc-test.cc:1846] Connecting to unix:/tmp/dist-test-taskUlkMRo/test-tmp/rpc-test-b373cc3dca7142f6bf007dc38b3eb9b2.sock
I20260928 06:31:48.298501  9030 rpc-test.cc:1859] Sending 1024MB via ssl-enabled unix socket: real 1.237s	user 1.340s	sys 0.884s
I20260928 06:31:49.510067  9030 rpc-test.cc:1859] Sending 1024MB via ssl-enabled unix socket: real 1.211s	user 1.336s	sys 0.849s
I20260928 06:31:50.742292  9030 rpc-test.cc:1859] Sending 1024MB via ssl-enabled unix socket: real 1.232s	user 1.487s	sys 0.745s
I20260928 06:31:51.990705  9030 rpc-test.cc:1859] Sending 1024MB via ssl-enabled unix socket: real 1.248s	user 1.364s	sys 0.891s
I20260928 06:31:53.207880  9030 rpc-test.cc:1859] Sending 1024MB via ssl-enabled unix socket: real 1.217s	user 1.218s	sys 0.959s
W20260928 06:31:53.208638  9484 connection.cc:196] Error closing socket: Network error: TlsSocket::Close: Broken pipe
[       OK ] Parameters/TestRpc.TestPerformanceBySocketType/SSL_UnixSocket (6165 ms)
[----------] 20 tests from Parameters/TestRpc (26926 ms total)

[----------] 1 test from Parameters/TestRpcSocketTxRxQueue
[ RUN      ] Parameters/TestRpcSocketTxRxQueue.AcceptorRxQueueSizeMetric/0
I20260928 06:31:53.218509  9512 acceptor_pool.cc:254] collecting diagnostics on the listening RPC socket 0.0.0.0:33857 every 1 connection(s)
I20260928 06:31:53.218585  9513 acceptor_pool.cc:254] collecting diagnostics on the listening RPC socket 0.0.0.0:33857 every 1 connection(s)
W20260928 06:31:53.219128  9508 negotiation.cc:337] Failed RPC negotiation. Trace:
0928 06:31:53.218984 (+     0us) reactor.cc:625] Submitting negotiation task for server connection from 127.0.0.1:41098 (local address 127.0.0.1:33857)
0928 06:31:53.219031 (+    47us) server_negotiation.cc:206] Beginning negotiation
0928 06:31:53.219033 (+     2us) server_negotiation.cc:399] Waiting for connection header
0928 06:31:53.219099 (+    66us) negotiation.cc:327] Negotiation complete: Network error: Server connection negotiation failed: server connection from 127.0.0.1:41098: BlockingRecv error: recv got EOF from 127.0.0.1:41098 (error 108)
Metrics: {"server-negotiator.queue_time_us":19}
[       OK ] Parameters/TestRpcSocketTxRxQueue.AcceptorRxQueueSizeMetric/0 (11 ms)
[----------] 1 test from Parameters/TestRpcSocketTxRxQueue (11 ms total)

[----------] Global test environment tear-down
[==========] 21 tests from 2 test suites ran. (26938 ms total)
[  PASSED  ] 20 tests.
[  FAILED  ] 1 test, listed below:
[  FAILED  ] Parameters/TestRpc.TestCallWithChainCertAndChainCA/SSL_UnixSocket, where GetParam() = (true, true)

 1 FAILED TEST