Diagnosed failure

Parameters/TestRpc.TestCallWithChainCertAndChainCA/SSL_TCP: /data0/somelongdirectorytoavoidrpathissues/src/kudu/src/kudu/rpc/rpc-test.cc:270: Failure
Failed
Bad status: Runtime error: could not verify certificate chain (error with cert: subject=CN = localhost, ST = sadfjas, C = AS, emailAddress = sdflkdsajf, O = lskdfjlsad, OU = sldfkja, issuer=C = AS, ST = ASDfkjdhf, L = lskdjf, O = saldfja, OU = skdjf, CN = localhost, emailAddress = sadjflkadsj): : certificate has expired
Google Test trace:
/data0/somelongdirectorytoavoidrpathissues/src/kudu/src/kudu/rpc/rpc-test.cc:267: Connecting to 0.0.0.0:40535
I20260924 19:00:17.115657  4124 test_util.cc:175] -----------------------------------------------
I20260924 19:00:17.115741  4124 test_util.cc:176] Had fatal failures, leaving test files at /tmp/dist-test-taskWXs6QL/test-tmp/rpc-test.5.Parameters_TestRpc.TestCallWithChainCertAndChainCA_SSL_TCP.1790276416958680-4124-0

Full log

Note: This is test shard 6 of 8.
[==========] Running 21 tests from 2 test suites.
[----------] Global test environment set-up.
[----------] 20 tests from Parameters/TestRpc
[ RUN      ] Parameters/TestRpc.TestMessengerCreateDestroy/SSL_TCP
WARNING: Logging before InitGoogleLogging() is written to STDERR
I20260924 19:00:17.031229  4124 rpc-test.cc:169] started messenger TestCreateDestroy
[       OK ] Parameters/TestRpc.TestMessengerCreateDestroy/SSL_TCP (56 ms)
[ RUN      ] Parameters/TestRpc.TestNegotiationDeadlock/SSL_TCP
I20260924 19:00:17.069772  4144 acceptor_pool.cc:254] collecting diagnostics on the listening RPC socket 0.0.0.0:35361 every 8 connection(s)
I20260924 19:00:17.070032  4145 acceptor_pool.cc:254] collecting diagnostics on the listening RPC socket 0.0.0.0:35361 every 8 connection(s)
[       OK ] Parameters/TestRpc.TestNegotiationDeadlock/SSL_TCP (54 ms)
[ RUN      ] Parameters/TestRpc.TestCallWithChainCertAndChainCA/SSL_TCP
I20260924 19:00:17.104413  4160 acceptor_pool.cc:254] collecting diagnostics on the listening RPC socket 0.0.0.0:40535 every 8 connection(s)
I20260924 19:00:17.104732  4161 acceptor_pool.cc:254] collecting diagnostics on the listening RPC socket 0.0.0.0:40535 every 8 connection(s)
/data0/somelongdirectorytoavoidrpathissues/src/kudu/src/kudu/rpc/rpc-test.cc:270: Failure
Failed
Bad status: Runtime error: could not verify certificate chain (error with cert: subject=CN = localhost, ST = sadfjas, C = AS, emailAddress = sdflkdsajf, O = lskdfjlsad, OU = sldfkja, issuer=C = AS, ST = ASDfkjdhf, L = lskdjf, O = saldfja, OU = skdjf, CN = localhost, emailAddress = sadjflkadsj): : certificate has expired
Google Test trace:
/data0/somelongdirectorytoavoidrpathissues/src/kudu/src/kudu/rpc/rpc-test.cc:267: Connecting to 0.0.0.0:40535
I20260924 19:00:17.115657  4124 test_util.cc:175] -----------------------------------------------
I20260924 19:00:17.115741  4124 test_util.cc:176] Had fatal failures, leaving test files at /tmp/dist-test-taskWXs6QL/test-tmp/rpc-test.5.Parameters_TestRpc.TestCallWithChainCertAndChainCA_SSL_TCP.1790276416958680-4124-0
[  FAILED  ] Parameters/TestRpc.TestCallWithChainCertAndChainCA/SSL_TCP, where GetParam() = (true, false) (27 ms)
[ RUN      ] Parameters/TestRpc.TestCallWithPasswordProtectedKey/SSL_TCP
I20260924 19:00:17.146118  4185 acceptor_pool.cc:254] collecting diagnostics on the listening RPC socket 0.0.0.0:37761 every 8 connection(s)
I20260924 19:00:17.146358  4186 acceptor_pool.cc:254] collecting diagnostics on the listening RPC socket 0.0.0.0:37761 every 8 connection(s)
[       OK ] Parameters/TestRpc.TestCallWithPasswordProtectedKey/SSL_TCP (66 ms)
[ RUN      ] Parameters/TestRpc.TestCallToBadServer/SSL_TCP
I20260924 19:00:17.207557  4124 rpc-test.cc:394] Status: Network error: Client connection negotiation failed: client connection to 0.0.0.0:0: connect: Connection refused (error 111)
I20260924 19:00:17.208309  4124 rpc-test.cc:394] Status: Network error: Client connection negotiation failed: client connection to 0.0.0.0:0: connect: Connection refused (error 111)
I20260924 19:00:17.208962  4124 rpc-test.cc:394] Status: Network error: Client connection negotiation failed: client connection to 0.0.0.0:0: connect: Connection refused (error 111)
I20260924 19:00:17.209633  4124 rpc-test.cc:394] Status: Network error: Client connection negotiation failed: client connection to 0.0.0.0:0: connect: Connection refused (error 111)
I20260924 19:00:17.210259  4124 rpc-test.cc:394] Status: Network error: Client connection negotiation failed: client connection to 0.0.0.0:0: connect: Connection refused (error 111)
[       OK ] Parameters/TestRpc.TestCallToBadServer/SSL_TCP (29 ms)
[ RUN      ] Parameters/TestRpc.TestWrongService/SSL_TCP
I20260924 19:00:17.227077  4220 acceptor_pool.cc:254] collecting diagnostics on the listening RPC socket 0.0.0.0:40901 every 8 connection(s)
I20260924 19:00:17.227363  4221 acceptor_pool.cc:254] collecting diagnostics on the listening RPC socket 0.0.0.0:40901 every 8 connection(s)
I20260924 19:00:17.257822  4218 messenger.cc:345] service WrongServiceName not registered on TestServer
[       OK ] Parameters/TestRpc.TestWrongService/SSL_TCP (50 ms)
[ RUN      ] Parameters/TestRpc.TestConnectionKeepalive/SSL_TCP
I20260924 19:00:17.275207  4243 acceptor_pool.cc:254] collecting diagnostics on the listening RPC socket 0.0.0.0:46125 every 8 connection(s)
I20260924 19:00:17.275547  4244 acceptor_pool.cc:254] collecting diagnostics on the listening RPC socket 0.0.0.0:46125 every 8 connection(s)
I20260924 19:00:17.276413  4124 rpc-test.cc:488] Connecting to 0.0.0.0:46125
[       OK ] Parameters/TestRpc.TestConnectionKeepalive/SSL_TCP (1042 ms)
[ RUN      ] Parameters/TestRpc.TestClientConnectionMetrics/SSL_TCP
I20260924 19:00:18.320914  4268 acceptor_pool.cc:254] collecting diagnostics on the listening RPC socket 0.0.0.0:43725 every 8 connection(s)
I20260924 19:00:18.321206  4269 acceptor_pool.cc:254] collecting diagnostics on the listening RPC socket 0.0.0.0:43725 every 8 connection(s)
I20260924 19:00:18.322386  4124 rpc-test.cc:569] Connecting to 0.0.0.0:43725
[       OK ] Parameters/TestRpc.TestClientConnectionMetrics/SSL_TCP (19445 ms)
[ RUN      ] Parameters/TestRpc.TestCredentialsPolicy/SSL_TCP
I20260924 19:00:37.768536  4291 acceptor_pool.cc:254] collecting diagnostics on the listening RPC socket 0.0.0.0:46169 every 8 connection(s)
I20260924 19:00:37.768764  4292 acceptor_pool.cc:254] collecting diagnostics on the listening RPC socket 0.0.0.0:46169 every 8 connection(s)
I20260924 19:00:37.769722  4124 rpc-test.cc:700] Connecting to 0.0.0.0:46169
[       OK ] Parameters/TestRpc.TestCredentialsPolicy/SSL_TCP (55 ms)
[ RUN      ] Parameters/TestRpc.TestCallLongerThanKeepalive/SSL_TCP
I20260924 19:00:37.823988  4316 acceptor_pool.cc:254] collecting diagnostics on the listening RPC socket 0.0.0.0:41109 every 8 connection(s)
I20260924 19:00:37.824256  4317 acceptor_pool.cc:254] collecting diagnostics on the listening RPC socket 0.0.0.0:41109 every 8 connection(s)
I20260924 19:00:37.837423  4320 rpc-test-base.h:222] got call: sleep_micros: 3000000 deferred: true
I20260924 19:00:40.839226  4320 rpcz_store.cc:275] Call kudu.rpc.GenericCalculatorService.Sleep from 127.0.0.1:36134 (request call id 0) took 3001 ms. Trace:
I20260924 19:00:40.839407  4320 rpcz_store.cc:276] 0924 19:00:37.837313 (+     0us) service_pool.cc:170] Inserting onto call queue
0924 19:00:37.837376 (+    63us) service_pool.cc:227] Handling call
0924 19:00:40.839176 (+3001800us) inbound_call.cc:173] Queueing success response
Metrics: {}
[       OK ] Parameters/TestRpc.TestCallLongerThanKeepalive/SSL_TCP (3038 ms)
[ RUN      ] Parameters/TestRpc.TestRpcSidecar/SSL_TCP
I20260924 19:00:40.864631  4341 acceptor_pool.cc:254] collecting diagnostics on the listening RPC socket 0.0.0.0:42743 every 8 connection(s)
I20260924 19:00:40.864885  4342 acceptor_pool.cc:254] collecting diagnostics on the listening RPC socket 0.0.0.0:42743 every 8 connection(s)
[       OK ] Parameters/TestRpc.TestRpcSidecar/SSL_TCP (128 ms)
[ RUN      ] Parameters/TestRpc.TestRpcSidecarLimits/SSL_TCP
I20260924 19:00:42.954447  4366 acceptor_pool.cc:254] collecting diagnostics on the listening RPC socket 0.0.0.0:33869 every 8 connection(s)
I20260924 19:00:42.954694  4367 acceptor_pool.cc:254] collecting diagnostics on the listening RPC socket 0.0.0.0:33869 every 8 connection(s)
W20260924 19:00:42.982391  4124 serialization.cc:72] Serialized kudu.rpc_test.PushStringsRequestPB (2147483654 bytes) is larger than the maximum configured RPC message size (52428800 bytes). Sending anyway, but peer may reject the data.
W20260924 19:00:42.988655  4365 connection.cc:535] server connection from 127.0.0.1:40116 recv error: Network error: RPC frame had a length of 2147483714, but we only support messages up to 52428800 bytes long.
W20260924 19:00:42.988844  4365 connection.cc:158] shutting down server connection from 127.0.0.1:40116 with pending inbound data: 4/2147483714 bytes received; last active 0 ns ago: status Network error: RPC frame had a length of 2147483714, but we only support messages up to 52428800 bytes long.
W20260924 19:00:42.989364  4379 connection.cc:196] Error closing socket: Network error: TlsSocket::Close: Connection reset by peer
I20260924 19:00:43.014729  4391 acceptor_pool.cc:254] collecting diagnostics on the listening RPC socket 0.0.0.0:37017 every 8 connection(s)
I20260924 19:00:43.015105  4392 acceptor_pool.cc:254] collecting diagnostics on the listening RPC socket 0.0.0.0:37017 every 8 connection(s)
W20260924 19:00:48.026305  4390 connection.cc:577] server connection from 127.0.0.1:33160: received bad data: 'Corruption: Invalid packet: message had a length of 2147483710, but we only support messages up to 2147483647 bytes
'
[       OK ] Parameters/TestRpc.TestRpcSidecarLimits/SSL_TCP (7524 ms)
[ RUN      ] Parameters/TestRpc.TestCallTimeoutDoesntAffectNegotiation/SSL_TCP
I20260924 19:00:48.511088  4416 acceptor_pool.cc:254] collecting diagnostics on the listening RPC socket 0.0.0.0:40065 every 8 connection(s)
I20260924 19:00:48.511368  4417 acceptor_pool.cc:254] collecting diagnostics on the listening RPC socket 0.0.0.0:40065 every 8 connection(s)
W20260924 19:00:48.540031  4412 negotiation.cc:266] Injecting 500ms delay in negotiation
I20260924 19:00:48.590440  4124 rpc-test-base.h:595] status: Timed out: connection negotiation to 0.0.0.0:40065 for RPC Sleep timed out after 0.050s (ON_OUTBOUND_QUEUE), seconds elapsed: 0.051026
[       OK ] Parameters/TestRpc.TestCallTimeoutDoesntAffectNegotiation/SSL_TCP (552 ms)
[ RUN      ] Parameters/TestRpc.TestRpcHandlerLatencyMetric/SSL_TCP
I20260924 19:00:49.061229  4441 acceptor_pool.cc:254] collecting diagnostics on the listening RPC socket 0.0.0.0:34341 every 8 connection(s)
I20260924 19:00:49.061474  4442 acceptor_pool.cc:254] collecting diagnostics on the listening RPC socket 0.0.0.0:34341 every 8 connection(s)
I20260924 19:00:49.125988  4124 rpc-test.cc:1236] Sleep() min lat: 20611
I20260924 19:00:49.126085  4124 rpc-test.cc:1237] Sleep() mean lat: 20611
I20260924 19:00:49.126186  4124 rpc-test.cc:1238] Sleep() max lat: 20611
I20260924 19:00:49.126268  4124 rpc-test.cc:1239] Sleep() #calls: 1
[       OK ] Parameters/TestRpc.TestRpcHandlerLatencyMetric/SSL_TCP (80 ms)
[ RUN      ] Parameters/TestRpc.TimedOutOnResponseMetricServiceQueue/SSL_TCP
I20260924 19:00:49.144593  4467 acceptor_pool.cc:254] collecting diagnostics on the listening RPC socket 0.0.0.0:34895 every 8 connection(s)
I20260924 19:00:49.144840  4468 acceptor_pool.cc:254] collecting diagnostics on the listening RPC socket 0.0.0.0:34895 every 8 connection(s)
W20260924 19:00:49.206589  4469 rpcz_store.cc:267] Call kudu.rpc_test.CalculatorService.Sleep from 127.0.0.1:49648 (request call id 2) took 20 ms (client timeout 20 ms). Trace:
W20260924 19:00:49.206768  4469 rpcz_store.cc:269] 0924 19:00:49.186164 (+     0us) service_pool.cc:170] Inserting onto call queue
0924 19:00:49.206474 (+ 20310us) service_pool.cc:214] Skipping call since client already timed out
0924 19:00:49.206549 (+    75us) inbound_call.cc:173] Queueing failure response
Metrics: {}
[       OK ] Parameters/TestRpc.TimedOutOnResponseMetricServiceQueue/SSL_TCP (79 ms)
[ RUN      ] Parameters/TestRpc.RpcPendingConnectionsMetric/SSL_TCP
I20260924 19:00:49.215807  4490 acceptor_pool.cc:254] collecting diagnostics on the listening RPC socket 0.0.0.0:37411 every 8 connection(s)
I20260924 19:00:49.216035  4491 acceptor_pool.cc:254] collecting diagnostics on the listening RPC socket 0.0.0.0:37411 every 8 connection(s)
W20260924 19:00:49.218127  4486 negotiation.cc:337] Failed RPC negotiation. Trace:
0924 19:00:49.217484 (+     0us) reactor.cc:625] Submitting negotiation task for server connection from 127.0.0.1:47218 (local address 127.0.0.1:37411)
0924 19:00:49.217676 (+   192us) server_negotiation.cc:206] Beginning negotiation
0924 19:00:49.217680 (+     4us) server_negotiation.cc:399] Waiting for connection header
0924 19:00:49.217825 (+   145us) negotiation.cc:327] Negotiation complete: Network error: Server connection negotiation failed: server connection from 127.0.0.1:47218: BlockingRecv error: recv got EOF from 127.0.0.1:47218 (error 108)
Metrics: {"server-negotiator.queue_time_us":86}
[       OK ] Parameters/TestRpc.RpcPendingConnectionsMetric/SSL_TCP (19 ms)
[ RUN      ] Parameters/TestRpc.TestRpcContextClientDeadline/SSL_TCP
I20260924 19:00:49.244335  4506 acceptor_pool.cc:254] collecting diagnostics on the listening RPC socket 0.0.0.0:45435 every 8 connection(s)
I20260924 19:00:49.244570  4507 acceptor_pool.cc:254] collecting diagnostics on the listening RPC socket 0.0.0.0:45435 every 8 connection(s)
[       OK ] Parameters/TestRpc.TestRpcContextClientDeadline/SSL_TCP (56 ms)
[ RUN      ] Parameters/TestRpc.TestApplicationFeatureFlagUnsupportedServer/SSL_TCP
I20260924 19:00:49.306510  4531 acceptor_pool.cc:254] collecting diagnostics on the listening RPC socket 0.0.0.0:34199 every 8 connection(s)
I20260924 19:00:49.306710  4532 acceptor_pool.cc:254] collecting diagnostics on the listening RPC socket 0.0.0.0:34199 every 8 connection(s)
[       OK ] Parameters/TestRpc.TestApplicationFeatureFlagUnsupportedServer/SSL_TCP (67 ms)
[ RUN      ] Parameters/TestRpc.TestCancellationAsync/SSL_TCP
I20260924 19:00:49.373947  4556 acceptor_pool.cc:254] collecting diagnostics on the listening RPC socket 0.0.0.0:41471 every 8 connection(s)
I20260924 19:00:49.374171  4557 acceptor_pool.cc:254] collecting diagnostics on the listening RPC socket 0.0.0.0:41471 every 8 connection(s)
I20260924 19:00:49.375036  4124 rpc-test.cc:1716] Connecting to 0.0.0.0:41471
I20260924 19:00:49.397979  4124 test_util.cc:268] Using random seed: 936438973
I20260924 19:00:49.431691  4560 rpc-test-base.h:240] got call: sleep_micros: 500 pattern: 4294967295 num_repetitions: 2097152 sidecar_idx: 0
I20260924 19:00:49.451133  4559 rpc-test-base.h:240] got call: sleep_micros: 500 pattern: 4294967295 num_repetitions: 2097152 sidecar_idx: 0
I20260924 19:00:49.476042  4558 rpc-test-base.h:240] got call: sleep_micros: 500 pattern: 4294967295 num_repetitions: 2097152 sidecar_idx: 0
I20260924 19:00:49.512048  4560 rpc-test-base.h:240] got call: sleep_micros: 500 pattern: 4294967295 num_repetitions: 2097152 sidecar_idx: 0
I20260924 19:00:49.538072  4558 rpc-test-base.h:240] got call: sleep_micros: 500 pattern: 4294967295 num_repetitions: 2097152 sidecar_idx: 0
I20260924 19:00:49.563283  4559 rpc-test-base.h:240] got call: sleep_micros: 500 pattern: 4294967295 num_repetitions: 2097152 sidecar_idx: 0
W20260924 19:00:49.599767  4553 connection.cc:196] Error closing socket: Network error: TlsSocket::Close: Broken pipe
W20260924 19:00:49.600989  4553 connection.cc:441] server connection from 127.0.0.1:41162 torn down before Call kudu.rpc.GenericCalculatorService.SleepWithSidecar from 127.0.0.1:41162 (request call id 7) could send its response
W20260924 19:00:49.632613  4553 connection.cc:441] server connection from 127.0.0.1:41162 torn down before Call kudu.rpc.GenericCalculatorService.SleepWithSidecar from 127.0.0.1:41162 (request call id 8) could send its response
[       OK ] Parameters/TestRpc.TestCancellationAsync/SSL_TCP (280 ms)
[ RUN      ] Parameters/TestRpc.TestPerformanceBySocketType/SSL_TCP
I20260924 19:00:49.652981  4581 acceptor_pool.cc:254] collecting diagnostics on the listening RPC socket 0.0.0.0:33825 every 8 connection(s)
I20260924 19:00:49.653230  4582 acceptor_pool.cc:254] collecting diagnostics on the listening RPC socket 0.0.0.0:33825 every 8 connection(s)
I20260924 19:00:49.654182  4124 rpc-test.cc:1846] Connecting to 0.0.0.0:33825
I20260924 19:00:52.579905  4124 rpc-test.cc:1859] Sending 1024MB via ssl-enabled tcp socket: real 2.912s	user 2.696s	sys 2.138s
I20260924 19:00:55.499578  4124 rpc-test.cc:1859] Sending 1024MB via ssl-enabled tcp socket: real 2.920s	user 2.732s	sys 2.131s
I20260924 19:00:58.430730  4124 rpc-test.cc:1859] Sending 1024MB via ssl-enabled tcp socket: real 2.931s	user 2.757s	sys 2.131s
I20260924 19:01:01.363131  4124 rpc-test.cc:1859] Sending 1024MB via ssl-enabled tcp socket: real 2.932s	user 2.542s	sys 2.300s
I20260924 19:01:04.244141  4124 rpc-test.cc:1859] Sending 1024MB via ssl-enabled tcp socket: real 2.881s	user 2.791s	sys 1.999s
[       OK ] Parameters/TestRpc.TestPerformanceBySocketType/SSL_TCP (14615 ms)
[----------] 20 tests from Parameters/TestRpc (47274 ms total)

[----------] 1 test from Parameters/TestRpcSocketTxRxQueue
[ RUN      ] Parameters/TestRpcSocketTxRxQueue.OverCapacity/0
W20260924 19:01:04.547547  4598 negotiation.cc:337] Failed RPC negotiation. Trace:
0924 19:01:04.256200 (+     0us) reactor.cc:625] Submitting negotiation task for client connection to 0.0.0.0:34445 (local address 127.0.0.1:44194)
0924 19:01:04.256400 (+   200us) negotiation.cc:107] Waiting for socket to connect
0924 19:01:04.256420 (+    20us) client_negotiation.cc:174] Beginning negotiation
0924 19:01:04.256535 (+   115us) client_negotiation.cc:252] Sending NEGOTIATE NegotiatePB request
0924 19:01:04.547176 (+290641us) negotiation.cc:327] Negotiation complete: Network error: Client connection negotiation failed: client connection to 0.0.0.0:34445: BlockingRecv error: recv error from unknown peer: Transport endpoint is not connected (error 107)
Metrics: {"client-negotiator.queue_time_us":57}
W20260924 19:01:04.547626  4616 negotiation.cc:337] Failed RPC negotiation. Trace:
0924 19:01:04.261418 (+     0us) reactor.cc:625] Submitting negotiation task for client connection to 0.0.0.0:34445 (local address 127.0.0.1:44202)
0924 19:01:04.261685 (+   267us) negotiation.cc:107] Waiting for socket to connect
0924 19:01:04.261701 (+    16us) client_negotiation.cc:174] Beginning negotiation
0924 19:01:04.261840 (+   139us) client_negotiation.cc:252] Sending NEGOTIATE NegotiatePB request
0924 19:01:04.547385 (+285545us) negotiation.cc:327] Negotiation complete: Network error: Client connection negotiation failed: client connection to 0.0.0.0:34445: BlockingRecv error: recv error from unknown peer: Transport endpoint is not connected (error 107)
Metrics: {"client-negotiator.queue_time_us":85}
W20260924 19:01:04.547583  4607 negotiation.cc:337] Failed RPC negotiation. Trace:
0924 19:01:04.258802 (+     0us) reactor.cc:625] Submitting negotiation task for client connection to 0.0.0.0:34445 (local address 127.0.0.1:44196)
0924 19:01:04.258997 (+   195us) negotiation.cc:107] Waiting for socket to connect
0924 19:01:04.259030 (+    33us) client_negotiation.cc:174] Beginning negotiation
0924 19:01:04.259147 (+   117us) client_negotiation.cc:252] Sending NEGOTIATE NegotiatePB request
0924 19:01:04.547260 (+288113us) negotiation.cc:327] Negotiation complete: Network error: Client connection negotiation failed: client connection to 0.0.0.0:34445: BlockingRecv error: recv error from unknown peer: Transport endpoint is not connected (error 107)
Metrics: {"client-negotiator.queue_time_us":56}
W20260924 19:01:04.552042  4634 negotiation.cc:337] Failed RPC negotiation. Trace:
0924 19:01:04.266640 (+     0us) reactor.cc:625] Submitting negotiation task for client connection to 0.0.0.0:34445 (local address 127.0.0.1:44220)
0924 19:01:04.266792 (+   152us) negotiation.cc:107] Waiting for socket to connect
0924 19:01:04.266811 (+    19us) client_negotiation.cc:174] Beginning negotiation
0924 19:01:04.266904 (+    93us) client_negotiation.cc:252] Sending NEGOTIATE NegotiatePB request
0924 19:01:04.547797 (+280893us) negotiation.cc:327] Negotiation complete: Network error: Client connection negotiation failed: client connection to 0.0.0.0:34445: BlockingRecv error: recv error from unknown peer: Transport endpoint is not connected (error 107)
Metrics: {"client-negotiator.queue_time_us":29}
W20260924 19:01:04.552158  4625 negotiation.cc:337] Failed RPC negotiation. Trace:
0924 19:01:04.264054 (+     0us) reactor.cc:625] Submitting negotiation task for client connection to 0.0.0.0:34445 (local address 127.0.0.1:44212)
0924 19:01:04.264236 (+   182us) negotiation.cc:107] Waiting for socket to connect
0924 19:01:04.264250 (+    14us) client_negotiation.cc:174] Beginning negotiation
0924 19:01:04.264330 (+    80us) client_negotiation.cc:252] Sending NEGOTIATE NegotiatePB request
0924 19:01:04.547176 (+282846us) negotiation.cc:327] Negotiation complete: Network error: Client connection negotiation failed: client connection to 0.0.0.0:34445: BlockingRecv error: recv error from unknown peer: Transport endpoint is not connected (error 107)
Metrics: {"client-negotiator.queue_time_us":53}
W20260924 19:01:04.555142  4643 negotiation.cc:337] Failed RPC negotiation. Trace:
0924 19:01:04.269327 (+     0us) reactor.cc:625] Submitting negotiation task for client connection to 0.0.0.0:34445 (local address 127.0.0.1:44234)
0924 19:01:04.269521 (+   194us) negotiation.cc:107] Waiting for socket to connect
0924 19:01:04.269538 (+    17us) client_negotiation.cc:174] Beginning negotiation
0924 19:01:04.269626 (+    88us) client_negotiation.cc:252] Sending NEGOTIATE NegotiatePB request
0924 19:01:04.549390 (+279764us) negotiation.cc:327] Negotiation complete: Network error: Client connection negotiation failed: client connection to 0.0.0.0:34445: BlockingRecv error: recv error from unknown peer: Transport endpoint is not connected (error 107)
Metrics: {"client-negotiator.queue_time_us":56}
[       OK ] Parameters/TestRpcSocketTxRxQueue.OverCapacity/0 (1063 ms)
[----------] 1 test from Parameters/TestRpcSocketTxRxQueue (1064 ms total)

[----------] Global test environment tear-down
[==========] 21 tests from 2 test suites ran. (48338 ms total)
[  PASSED  ] 20 tests.
[  FAILED  ] 1 test, listed below:
[  FAILED  ] Parameters/TestRpc.TestCallWithChainCertAndChainCA/SSL_TCP, where GetParam() = (true, false)

 1 FAILED TEST