Diagnosed failure

Parameters/TestRpc.TestCallWithChainCertAndChainCA/SSL_TCP: /data0/somelongdirectorytoavoidrpathissues/src/kudu/src/kudu/rpc/rpc-test.cc:270: Failure
Failed
Bad status: Runtime error: could not verify certificate chain (error with cert: subject=CN = localhost, ST = sadfjas, C = AS, emailAddress = sdflkdsajf, O = lskdfjlsad, OU = sldfkja, issuer=C = AS, ST = ASDfkjdhf, L = lskdjf, O = saldfja, OU = skdjf, CN = localhost, emailAddress = sadjflkadsj): : certificate has expired
Google Test trace:
/data0/somelongdirectorytoavoidrpathissues/src/kudu/src/kudu/rpc/rpc-test.cc:267: Connecting to 0.0.0.0:46799
I20260927 15:07:48.818311 17793 test_util.cc:175] -----------------------------------------------
I20260927 15:07:48.818388 17793 test_util.cc:176] Had fatal failures, leaving test files at /tmp/dist-test-taskQgYfDS/test-tmp/rpc-test.5.Parameters_TestRpc.TestCallWithChainCertAndChainCA_SSL_TCP.1790521668717107-17793-0

Full log

Note: This is test shard 6 of 8.
[==========] Running 21 tests from 2 test suites.
[----------] Global test environment set-up.
[----------] 20 tests from Parameters/TestRpc
[ RUN      ] Parameters/TestRpc.TestMessengerCreateDestroy/SSL_TCP
WARNING: Logging before InitGoogleLogging() is written to STDERR
I20260927 15:07:48.757344 17793 rpc-test.cc:169] started messenger TestCreateDestroy
[       OK ] Parameters/TestRpc.TestMessengerCreateDestroy/SSL_TCP (35 ms)
[ RUN      ] Parameters/TestRpc.TestNegotiationDeadlock/SSL_TCP
I20260927 15:07:48.779563 17813 acceptor_pool.cc:254] collecting diagnostics on the listening RPC socket 0.0.0.0:33839 every 8 connection(s)
I20260927 15:07:48.779618 17814 acceptor_pool.cc:254] collecting diagnostics on the listening RPC socket 0.0.0.0:33839 every 8 connection(s)
[       OK ] Parameters/TestRpc.TestNegotiationDeadlock/SSL_TCP (31 ms)
[ RUN      ] Parameters/TestRpc.TestCallWithChainCertAndChainCA/SSL_TCP
I20260927 15:07:48.812784 17829 acceptor_pool.cc:254] collecting diagnostics on the listening RPC socket 0.0.0.0:46799 every 8 connection(s)
I20260927 15:07:48.812815 17830 acceptor_pool.cc:254] collecting diagnostics on the listening RPC socket 0.0.0.0:46799 every 8 connection(s)
/data0/somelongdirectorytoavoidrpathissues/src/kudu/src/kudu/rpc/rpc-test.cc:270: Failure
Failed
Bad status: Runtime error: could not verify certificate chain (error with cert: subject=CN = localhost, ST = sadfjas, C = AS, emailAddress = sdflkdsajf, O = lskdfjlsad, OU = sldfkja, issuer=C = AS, ST = ASDfkjdhf, L = lskdjf, O = saldfja, OU = skdjf, CN = localhost, emailAddress = sadjflkadsj): : certificate has expired
Google Test trace:
/data0/somelongdirectorytoavoidrpathissues/src/kudu/src/kudu/rpc/rpc-test.cc:267: Connecting to 0.0.0.0:46799
I20260927 15:07:48.818311 17793 test_util.cc:175] -----------------------------------------------
I20260927 15:07:48.818388 17793 test_util.cc:176] Had fatal failures, leaving test files at /tmp/dist-test-taskQgYfDS/test-tmp/rpc-test.5.Parameters_TestRpc.TestCallWithChainCertAndChainCA_SSL_TCP.1790521668717107-17793-0
[  FAILED  ] Parameters/TestRpc.TestCallWithChainCertAndChainCA/SSL_TCP, where GetParam() = (true, false) (27 ms)
[ RUN      ] Parameters/TestRpc.TestCallWithPasswordProtectedKey/SSL_TCP
I20260927 15:07:48.845683 17854 acceptor_pool.cc:254] collecting diagnostics on the listening RPC socket 0.0.0.0:37633 every 8 connection(s)
I20260927 15:07:48.845711 17855 acceptor_pool.cc:254] collecting diagnostics on the listening RPC socket 0.0.0.0:37633 every 8 connection(s)
[       OK ] Parameters/TestRpc.TestCallWithPasswordProtectedKey/SSL_TCP (41 ms)
[ RUN      ] Parameters/TestRpc.TestCallToBadServer/SSL_TCP
I20260927 15:07:48.880196 17793 rpc-test.cc:394] Status: Network error: Client connection negotiation failed: client connection to 0.0.0.0:0: connect: Connection refused (error 111)
I20260927 15:07:48.880722 17793 rpc-test.cc:394] Status: Network error: Client connection negotiation failed: client connection to 0.0.0.0:0: connect: Connection refused (error 111)
I20260927 15:07:48.881145 17793 rpc-test.cc:394] Status: Network error: Client connection negotiation failed: client connection to 0.0.0.0:0: connect: Connection refused (error 111)
I20260927 15:07:48.881531 17793 rpc-test.cc:394] Status: Network error: Client connection negotiation failed: client connection to 0.0.0.0:0: connect: Connection refused (error 111)
I20260927 15:07:48.881906 17793 rpc-test.cc:394] Status: Network error: Client connection negotiation failed: client connection to 0.0.0.0:0: connect: Connection refused (error 111)
[       OK ] Parameters/TestRpc.TestCallToBadServer/SSL_TCP (22 ms)
[ RUN      ] Parameters/TestRpc.TestWrongService/SSL_TCP
I20260927 15:07:48.894920 17889 acceptor_pool.cc:254] collecting diagnostics on the listening RPC socket 0.0.0.0:43795 every 8 connection(s)
I20260927 15:07:48.894953 17890 acceptor_pool.cc:254] collecting diagnostics on the listening RPC socket 0.0.0.0:43795 every 8 connection(s)
I20260927 15:07:48.906122 17886 messenger.cc:345] service WrongServiceName not registered on TestServer
[       OK ] Parameters/TestRpc.TestWrongService/SSL_TCP (25 ms)
[ RUN      ] Parameters/TestRpc.TestConnectionKeepalive/SSL_TCP
I20260927 15:07:48.922216 17912 acceptor_pool.cc:254] collecting diagnostics on the listening RPC socket 0.0.0.0:40963 every 8 connection(s)
I20260927 15:07:48.922259 17913 acceptor_pool.cc:254] collecting diagnostics on the listening RPC socket 0.0.0.0:40963 every 8 connection(s)
I20260927 15:07:48.922562 17793 rpc-test.cc:488] Connecting to 0.0.0.0:40963
[       OK ] Parameters/TestRpc.TestConnectionKeepalive/SSL_TCP (1037 ms)
[ RUN      ] Parameters/TestRpc.TestClientConnectionMetrics/SSL_TCP
I20260927 15:07:49.952142 17937 acceptor_pool.cc:254] collecting diagnostics on the listening RPC socket 0.0.0.0:35927 every 8 connection(s)
I20260927 15:07:49.952248 17938 acceptor_pool.cc:254] collecting diagnostics on the listening RPC socket 0.0.0.0:35927 every 8 connection(s)
I20260927 15:07:49.952517 17793 rpc-test.cc:569] Connecting to 0.0.0.0:35927
[       OK ] Parameters/TestRpc.TestClientConnectionMetrics/SSL_TCP (15020 ms)
[ RUN      ] Parameters/TestRpc.TestCredentialsPolicy/SSL_TCP
I20260927 15:08:04.986052 17961 acceptor_pool.cc:254] collecting diagnostics on the listening RPC socket 0.0.0.0:45095 every 8 connection(s)
I20260927 15:08:04.986296 17960 acceptor_pool.cc:254] collecting diagnostics on the listening RPC socket 0.0.0.0:45095 every 8 connection(s)
I20260927 15:08:04.986306 17793 rpc-test.cc:700] Connecting to 0.0.0.0:45095
[       OK ] Parameters/TestRpc.TestCredentialsPolicy/SSL_TCP (49 ms)
[ RUN      ] Parameters/TestRpc.TestCallLongerThanKeepalive/SSL_TCP
I20260927 15:08:05.027102 17985 acceptor_pool.cc:254] collecting diagnostics on the listening RPC socket 0.0.0.0:36095 every 8 connection(s)
I20260927 15:08:05.027118 17986 acceptor_pool.cc:254] collecting diagnostics on the listening RPC socket 0.0.0.0:36095 every 8 connection(s)
I20260927 15:08:05.041836 17989 rpc-test-base.h:222] got call: sleep_micros: 3000000 deferred: true
I20260927 15:08:08.042766 17989 rpcz_store.cc:275] Call kudu.rpc.GenericCalculatorService.Sleep from 127.0.0.1:57128 (request call id 0) took 3001 ms. Trace:
I20260927 15:08:08.042904 17989 rpcz_store.cc:276] 0927 15:08:05.041719 (+     0us) service_pool.cc:170] Inserting onto call queue
0927 15:08:05.041804 (+    85us) service_pool.cc:227] Handling call
0927 15:08:08.042744 (+3000940us) inbound_call.cc:173] Queueing success response
Metrics: {}
[       OK ] Parameters/TestRpc.TestCallLongerThanKeepalive/SSL_TCP (3030 ms)
[ RUN      ] Parameters/TestRpc.TestRpcSidecar/SSL_TCP
I20260927 15:08:08.067775 18010 acceptor_pool.cc:254] collecting diagnostics on the listening RPC socket 0.0.0.0:46683 every 8 connection(s)
I20260927 15:08:08.067798 18011 acceptor_pool.cc:254] collecting diagnostics on the listening RPC socket 0.0.0.0:46683 every 8 connection(s)
[       OK ] Parameters/TestRpc.TestRpcSidecar/SSL_TCP (88 ms)
[ RUN      ] Parameters/TestRpc.TestRpcSidecarLimits/SSL_TCP
I20260927 15:08:09.882421 18035 acceptor_pool.cc:254] collecting diagnostics on the listening RPC socket 0.0.0.0:39513 every 8 connection(s)
I20260927 15:08:09.882463 18036 acceptor_pool.cc:254] collecting diagnostics on the listening RPC socket 0.0.0.0:39513 every 8 connection(s)
W20260927 15:08:09.908484 17793 serialization.cc:72] Serialized kudu.rpc_test.PushStringsRequestPB (2147483654 bytes) is larger than the maximum configured RPC message size (52428800 bytes). Sending anyway, but peer may reject the data.
W20260927 15:08:09.912830 18032 connection.cc:535] server connection from 127.0.0.1:54908 recv error: Network error: RPC frame had a length of 2147483714, but we only support messages up to 52428800 bytes long.
W20260927 15:08:09.912923 18032 connection.cc:158] shutting down server connection from 127.0.0.1:54908 with pending inbound data: 4/2147483714 bytes received; last active 0 ns ago: status Network error: RPC frame had a length of 2147483714, but we only support messages up to 52428800 bytes long.
W20260927 15:08:09.913252 18048 connection.cc:196] Error closing socket: Network error: TlsSocket::Close: Connection reset by peer
I20260927 15:08:09.919957 18060 acceptor_pool.cc:254] collecting diagnostics on the listening RPC socket 0.0.0.0:35387 every 8 connection(s)
I20260927 15:08:09.920060 18061 acceptor_pool.cc:254] collecting diagnostics on the listening RPC socket 0.0.0.0:35387 every 8 connection(s)
W20260927 15:08:14.216950 18059 connection.cc:577] server connection from 127.0.0.1:59544: received bad data: 'Corruption: Invalid packet: message had a length of 2147483710, but we only support messages up to 2147483647 bytes
'
[       OK ] Parameters/TestRpc.TestRpcSidecarLimits/SSL_TCP (6086 ms)
[ RUN      ] Parameters/TestRpc.TestCallTimeoutDoesntAffectNegotiation/SSL_TCP
I20260927 15:08:14.233486 18085 acceptor_pool.cc:254] collecting diagnostics on the listening RPC socket 0.0.0.0:43319 every 8 connection(s)
I20260927 15:08:14.233530 18086 acceptor_pool.cc:254] collecting diagnostics on the listening RPC socket 0.0.0.0:43319 every 8 connection(s)
W20260927 15:08:14.245672 18081 negotiation.cc:266] Injecting 500ms delay in negotiation
I20260927 15:08:14.296133 17793 rpc-test-base.h:595] status: Timed out: connection negotiation to 0.0.0.0:43319 for RPC Sleep timed out after 0.050s (ON_OUTBOUND_QUEUE), seconds elapsed: 0.0509116
[       OK ] Parameters/TestRpc.TestCallTimeoutDoesntAffectNegotiation/SSL_TCP (531 ms)
[ RUN      ] Parameters/TestRpc.TestRpcHandlerLatencyMetric/SSL_TCP
I20260927 15:08:14.765017 18110 acceptor_pool.cc:254] collecting diagnostics on the listening RPC socket 0.0.0.0:35025 every 8 connection(s)
I20260927 15:08:14.765056 18111 acceptor_pool.cc:254] collecting diagnostics on the listening RPC socket 0.0.0.0:35025 every 8 connection(s)
I20260927 15:08:14.799492 17793 rpc-test.cc:1236] Sleep() min lat: 20348
I20260927 15:08:14.799573 17793 rpc-test.cc:1237] Sleep() mean lat: 20348
I20260927 15:08:14.799600 17793 rpc-test.cc:1238] Sleep() max lat: 20348
I20260927 15:08:14.799614 17793 rpc-test.cc:1239] Sleep() #calls: 1
[       OK ] Parameters/TestRpc.TestRpcHandlerLatencyMetric/SSL_TCP (48 ms)
[ RUN      ] Parameters/TestRpc.TimedOutOnResponseMetricServiceQueue/SSL_TCP
I20260927 15:08:14.821841 18136 acceptor_pool.cc:254] collecting diagnostics on the listening RPC socket 0.0.0.0:34971 every 8 connection(s)
I20260927 15:08:14.821894 18137 acceptor_pool.cc:254] collecting diagnostics on the listening RPC socket 0.0.0.0:34971 every 8 connection(s)
W20260927 15:08:14.880720 18138 rpcz_store.cc:267] Call kudu.rpc_test.CalculatorService.Sleep from 127.0.0.1:41096 (request call id 2) took 20 ms (client timeout 20 ms). Trace:
W20260927 15:08:14.880864 18138 rpcz_store.cc:269] 0927 15:08:14.860287 (+     0us) service_pool.cc:170] Inserting onto call queue
0927 15:08:14.880668 (+ 20381us) service_pool.cc:214] Skipping call since client already timed out
0927 15:08:14.880700 (+    32us) inbound_call.cc:173] Queueing failure response
Metrics: {}
[       OK ] Parameters/TestRpc.TimedOutOnResponseMetricServiceQueue/SSL_TCP (81 ms)
[ RUN      ] Parameters/TestRpc.RpcPendingConnectionsMetric/SSL_TCP
I20260927 15:08:14.885638 18159 acceptor_pool.cc:254] collecting diagnostics on the listening RPC socket 0.0.0.0:36391 every 8 connection(s)
I20260927 15:08:14.885712 18160 acceptor_pool.cc:254] collecting diagnostics on the listening RPC socket 0.0.0.0:36391 every 8 connection(s)
W20260927 15:08:14.886899 18155 negotiation.cc:337] Failed RPC negotiation. Trace:
0927 15:08:14.886441 (+     0us) reactor.cc:625] Submitting negotiation task for server connection from 127.0.0.1:58794 (local address 127.0.0.1:36391)
0927 15:08:14.886544 (+   103us) server_negotiation.cc:206] Beginning negotiation
0927 15:08:14.886548 (+     4us) server_negotiation.cc:399] Waiting for connection header
0927 15:08:14.886636 (+    88us) negotiation.cc:327] Negotiation complete: Network error: Server connection negotiation failed: server connection from 127.0.0.1:58794: BlockingRecv error: recv got EOF from 127.0.0.1:58794 (error 108)
Metrics: {"server-negotiator.queue_time_us":36}
[       OK ] Parameters/TestRpc.RpcPendingConnectionsMetric/SSL_TCP (15 ms)
[ RUN      ] Parameters/TestRpc.TestRpcContextClientDeadline/SSL_TCP
I20260927 15:08:14.915953 18175 acceptor_pool.cc:254] collecting diagnostics on the listening RPC socket 0.0.0.0:35883 every 8 connection(s)
I20260927 15:08:14.915984 18176 acceptor_pool.cc:254] collecting diagnostics on the listening RPC socket 0.0.0.0:35883 every 8 connection(s)
[       OK ] Parameters/TestRpc.TestRpcContextClientDeadline/SSL_TCP (63 ms)
[ RUN      ] Parameters/TestRpc.TestApplicationFeatureFlagUnsupportedServer/SSL_TCP
I20260927 15:08:14.981012 18200 acceptor_pool.cc:254] collecting diagnostics on the listening RPC socket 0.0.0.0:40543 every 8 connection(s)
I20260927 15:08:14.981096 18201 acceptor_pool.cc:254] collecting diagnostics on the listening RPC socket 0.0.0.0:40543 every 8 connection(s)
[       OK ] Parameters/TestRpc.TestApplicationFeatureFlagUnsupportedServer/SSL_TCP (41 ms)
[ RUN      ] Parameters/TestRpc.TestCancellationAsync/SSL_TCP
I20260927 15:08:15.021448 18225 acceptor_pool.cc:254] collecting diagnostics on the listening RPC socket 0.0.0.0:45045 every 8 connection(s)
I20260927 15:08:15.021627 18226 acceptor_pool.cc:254] collecting diagnostics on the listening RPC socket 0.0.0.0:45045 every 8 connection(s)
I20260927 15:08:15.021974 17793 rpc-test.cc:1716] Connecting to 0.0.0.0:45045
I20260927 15:08:15.040719 17793 test_util.cc:268] Using random seed: 1368945866
I20260927 15:08:15.062363 18229 rpc-test-base.h:240] got call: sleep_micros: 500 pattern: 4294967295 num_repetitions: 2097152 sidecar_idx: 0
I20260927 15:08:15.082444 18228 rpc-test-base.h:240] got call: sleep_micros: 500 pattern: 4294967295 num_repetitions: 2097152 sidecar_idx: 0
I20260927 15:08:15.100379 18229 rpc-test-base.h:240] got call: sleep_micros: 500 pattern: 4294967295 num_repetitions: 2097152 sidecar_idx: 0
I20260927 15:08:15.117682 18228 rpc-test-base.h:240] got call: sleep_micros: 500 pattern: 4294967295 num_repetitions: 2097152 sidecar_idx: 0
I20260927 15:08:15.137004 18229 rpc-test-base.h:240] got call: sleep_micros: 500 pattern: 4294967295 num_repetitions: 2097152 sidecar_idx: 0
I20260927 15:08:15.154909 18228 rpc-test-base.h:240] got call: sleep_micros: 500 pattern: 4294967295 num_repetitions: 2097152 sidecar_idx: 0
I20260927 15:08:15.175238 18229 rpc-test-base.h:240] got call: sleep_micros: 500 pattern: 4294967295 num_repetitions: 2097152 sidecar_idx: 0
W20260927 15:08:15.180902 18222 connection.cc:441] server connection from 127.0.0.1:41822 torn down before Call kudu.rpc.GenericCalculatorService.SleepWithSidecar from 127.0.0.1:41822 (request call id 8) could send its response
W20260927 15:08:15.193336 18222 connection.cc:441] server connection from 127.0.0.1:41822 torn down before Call kudu.rpc.GenericCalculatorService.SleepWithSidecar from 127.0.0.1:41822 (request call id 9) could send its response
[       OK ] Parameters/TestRpc.TestCancellationAsync/SSL_TCP (191 ms)
[ RUN      ] Parameters/TestRpc.TestPerformanceBySocketType/SSL_TCP
I20260927 15:08:15.216854 18250 acceptor_pool.cc:254] collecting diagnostics on the listening RPC socket 0.0.0.0:42271 every 8 connection(s)
I20260927 15:08:15.216902 18251 acceptor_pool.cc:254] collecting diagnostics on the listening RPC socket 0.0.0.0:42271 every 8 connection(s)
I20260927 15:08:15.217226 17793 rpc-test.cc:1846] Connecting to 0.0.0.0:42271
I20260927 15:08:17.342141 17793 rpc-test.cc:1859] Sending 1024MB via ssl-enabled tcp socket: real 2.116s	user 2.161s	sys 1.569s
I20260927 15:08:19.483735 17793 rpc-test.cc:1859] Sending 1024MB via ssl-enabled tcp socket: real 2.141s	user 2.156s	sys 1.633s
I20260927 15:08:21.755102 17793 rpc-test.cc:1859] Sending 1024MB via ssl-enabled tcp socket: real 2.271s	user 2.249s	sys 1.742s
I20260927 15:08:23.930766 17793 rpc-test.cc:1859] Sending 1024MB via ssl-enabled tcp socket: real 2.176s	user 2.114s	sys 1.725s
I20260927 15:08:26.448889 17793 rpc-test.cc:1859] Sending 1024MB via ssl-enabled tcp socket: real 2.518s	user 2.646s	sys 1.792s
[       OK ] Parameters/TestRpc.TestPerformanceBySocketType/SSL_TCP (11256 ms)
[----------] 20 tests from Parameters/TestRpc (37727 ms total)

[----------] 1 test from Parameters/TestRpcSocketTxRxQueue
[ RUN      ] Parameters/TestRpcSocketTxRxQueue.OverCapacity/0
W20260927 15:08:26.728355 18267 negotiation.cc:337] Failed RPC negotiation. Trace:
0927 15:08:26.460540 (+     0us) reactor.cc:625] Submitting negotiation task for client connection to 0.0.0.0:33113 (local address 127.0.0.1:33002)
0927 15:08:26.460691 (+   151us) negotiation.cc:107] Waiting for socket to connect
0927 15:08:26.460708 (+    17us) client_negotiation.cc:174] Beginning negotiation
0927 15:08:26.460814 (+   106us) client_negotiation.cc:252] Sending NEGOTIATE NegotiatePB request
0927 15:08:26.728203 (+267389us) negotiation.cc:327] Negotiation complete: Network error: Client connection negotiation failed: client connection to 0.0.0.0:33113: BlockingRecv error: recv error from unknown peer: Transport endpoint is not connected (error 107)
Metrics: {"client-negotiator.queue_time_us":48}
W20260927 15:08:26.728462 18294 negotiation.cc:337] Failed RPC negotiation. Trace:
0927 15:08:26.464240 (+     0us) reactor.cc:625] Submitting negotiation task for client connection to 0.0.0.0:33113 (local address 127.0.0.1:33022)
0927 15:08:26.464340 (+   100us) negotiation.cc:107] Waiting for socket to connect
0927 15:08:26.464349 (+     9us) client_negotiation.cc:174] Beginning negotiation
0927 15:08:26.464412 (+    63us) client_negotiation.cc:252] Sending NEGOTIATE NegotiatePB request
0927 15:08:26.728414 (+264002us) negotiation.cc:327] Negotiation complete: Network error: Client connection negotiation failed: client connection to 0.0.0.0:33113: BlockingRecv error: recv error from unknown peer: Transport endpoint is not connected (error 107)
Metrics: {"client-negotiator.queue_time_us":43}
W20260927 15:08:26.728683 18303 negotiation.cc:337] Failed RPC negotiation. Trace:
0927 15:08:26.465357 (+     0us) reactor.cc:625] Submitting negotiation task for client connection to 0.0.0.0:33113 (local address 127.0.0.1:33028)
0927 15:08:26.465460 (+   103us) negotiation.cc:107] Waiting for socket to connect
0927 15:08:26.465475 (+    15us) client_negotiation.cc:174] Beginning negotiation
0927 15:08:26.465550 (+    75us) client_negotiation.cc:252] Sending NEGOTIATE NegotiatePB request
0927 15:08:26.728203 (+262653us) negotiation.cc:327] Negotiation complete: Network error: Client connection negotiation failed: client connection to 0.0.0.0:33113: BlockingRecv error: recv error from unknown peer: Transport endpoint is not connected (error 107)
Metrics: {"client-negotiator.queue_time_us":24}
W20260927 15:08:26.728780 18276 negotiation.cc:337] Failed RPC negotiation. Trace:
0927 15:08:26.461769 (+     0us) reactor.cc:625] Submitting negotiation task for client connection to 0.0.0.0:33113 (local address 127.0.0.1:33006)
0927 15:08:26.461876 (+   107us) negotiation.cc:107] Waiting for socket to connect
0927 15:08:26.461887 (+    11us) client_negotiation.cc:174] Beginning negotiation
0927 15:08:26.461954 (+    67us) client_negotiation.cc:252] Sending NEGOTIATE NegotiatePB request
0927 15:08:26.728234 (+266280us) negotiation.cc:327] Negotiation complete: Network error: Client connection negotiation failed: client connection to 0.0.0.0:33113: BlockingRecv error: recv error from unknown peer: Transport endpoint is not connected (error 107)
Metrics: {"client-negotiator.queue_time_us":44}
W20260927 15:08:26.728397 18285 negotiation.cc:337] Failed RPC negotiation. Trace:
0927 15:08:26.463119 (+     0us) reactor.cc:625] Submitting negotiation task for client connection to 0.0.0.0:33113 (local address 127.0.0.1:33008)
0927 15:08:26.463246 (+   127us) negotiation.cc:107] Waiting for socket to connect
0927 15:08:26.463260 (+    14us) client_negotiation.cc:174] Beginning negotiation
0927 15:08:26.463345 (+    85us) client_negotiation.cc:252] Sending NEGOTIATE NegotiatePB request
0927 15:08:26.728241 (+264896us) negotiation.cc:327] Negotiation complete: Network error: Client connection negotiation failed: client connection to 0.0.0.0:33113: BlockingRecv error: recv error from unknown peer: Transport endpoint is not connected (error 107)
Metrics: {"client-negotiator.queue_time_us":46}
W20260927 15:08:26.728691 18312 negotiation.cc:337] Failed RPC negotiation. Trace:
0927 15:08:26.466522 (+     0us) reactor.cc:625] Submitting negotiation task for client connection to 0.0.0.0:33113 (local address 127.0.0.1:33032)
0927 15:08:26.466600 (+    78us) negotiation.cc:107] Waiting for socket to connect
0927 15:08:26.466609 (+     9us) client_negotiation.cc:174] Beginning negotiation
0927 15:08:26.466668 (+    59us) client_negotiation.cc:252] Sending NEGOTIATE NegotiatePB request
0927 15:08:26.728337 (+261669us) negotiation.cc:327] Negotiation complete: Network error: Client connection negotiation failed: client connection to 0.0.0.0:33113: BlockingRecv error: recv error from unknown peer: Transport endpoint is not connected (error 107)
Metrics: {"client-negotiator.queue_time_us":23}
[       OK ] Parameters/TestRpcSocketTxRxQueue.OverCapacity/0 (1032 ms)
[----------] 1 test from Parameters/TestRpcSocketTxRxQueue (1032 ms total)

[----------] Global test environment tear-down
[==========] 21 tests from 2 test suites ran. (38760 ms total)
[  PASSED  ] 20 tests.
[  FAILED  ] 1 test, listed below:
[  FAILED  ] Parameters/TestRpc.TestCallWithChainCertAndChainCA/SSL_TCP, where GetParam() = (true, false)

 1 FAILED TEST