Diagnosed failure

Parameters/TestRpc.TestCallWithChainCertAndChainCA/SSL_UnixSocket: /data0/somelongdirectorytoavoidrpathissues/src/kudu/src/kudu/rpc/rpc-test.cc:270: Failure
Failed
Bad status: Runtime error: could not verify certificate chain (error with cert: subject=CN = localhost, ST = sadfjas, C = AS, emailAddress = sdflkdsajf, O = lskdfjlsad, OU = sldfkja, issuer=C = AS, ST = ASDfkjdhf, L = lskdjf, O = saldfja, OU = skdjf, CN = localhost, emailAddress = sadjflkadsj): : certificate has expired
Google Test trace:
/data0/somelongdirectorytoavoidrpathissues/src/kudu/src/kudu/rpc/rpc-test.cc:267: Connecting to unix:/tmp/dist-test-taskTkTXTK/test-tmp/rpc-test-5c4ac6d6d83640a98ff6040f2fdc2b1b.sock
I20260927 15:07:57.169330 24190 test_util.cc:175] -----------------------------------------------
I20260927 15:07:57.169404 24190 test_util.cc:176] Had fatal failures, leaving test files at /tmp/dist-test-taskTkTXTK/test-tmp/rpc-test.6.Parameters_TestRpc.TestCallWithChainCertAndChainCA_SSL_UnixSocket.1790521677090200-24190-0

Full log

Note: This is test shard 7 of 8.
[==========] Running 21 tests from 2 test suites.
[----------] Global test environment set-up.
[----------] 20 tests from Parameters/TestRpc
[ RUN      ] Parameters/TestRpc.TestMessengerCreateDestroy/SSL_UnixSocket
WARNING: Logging before InitGoogleLogging() is written to STDERR
I20260927 15:07:57.114912 24190 rpc-test.cc:169] started messenger TestCreateDestroy
[       OK ] Parameters/TestRpc.TestMessengerCreateDestroy/SSL_UnixSocket (19 ms)
[ RUN      ] Parameters/TestRpc.TestNegotiationDeadlock/SSL_UnixSocket
I20260927 15:07:57.134950 24211 acceptor_pool.cc:254] collecting diagnostics on the listening RPC socket unix:/tmp/dist-test-taskTkTXTK/test-tmp/rpc-test-96f83873693e41bbabcb78124064727b.sock every 8 connection(s)
I20260927 15:07:57.134925 24210 acceptor_pool.cc:254] collecting diagnostics on the listening RPC socket unix:/tmp/dist-test-taskTkTXTK/test-tmp/rpc-test-96f83873693e41bbabcb78124064727b.sock every 8 connection(s)
[       OK ] Parameters/TestRpc.TestNegotiationDeadlock/SSL_UnixSocket (28 ms)
[ RUN      ] Parameters/TestRpc.TestCallWithChainCertAndChainCA/SSL_UnixSocket
I20260927 15:07:57.163636 24226 acceptor_pool.cc:254] collecting diagnostics on the listening RPC socket unix:/tmp/dist-test-taskTkTXTK/test-tmp/rpc-test-5c4ac6d6d83640a98ff6040f2fdc2b1b.sock every 8 connection(s)
I20260927 15:07:57.163669 24227 acceptor_pool.cc:254] collecting diagnostics on the listening RPC socket unix:/tmp/dist-test-taskTkTXTK/test-tmp/rpc-test-5c4ac6d6d83640a98ff6040f2fdc2b1b.sock every 8 connection(s)
/data0/somelongdirectorytoavoidrpathissues/src/kudu/src/kudu/rpc/rpc-test.cc:270: Failure
Failed
Bad status: Runtime error: could not verify certificate chain (error with cert: subject=CN = localhost, ST = sadfjas, C = AS, emailAddress = sdflkdsajf, O = lskdfjlsad, OU = sldfkja, issuer=C = AS, ST = ASDfkjdhf, L = lskdjf, O = saldfja, OU = skdjf, CN = localhost, emailAddress = sadjflkadsj): : certificate has expired
Google Test trace:
/data0/somelongdirectorytoavoidrpathissues/src/kudu/src/kudu/rpc/rpc-test.cc:267: Connecting to unix:/tmp/dist-test-taskTkTXTK/test-tmp/rpc-test-5c4ac6d6d83640a98ff6040f2fdc2b1b.sock
I20260927 15:07:57.169330 24190 test_util.cc:175] -----------------------------------------------
I20260927 15:07:57.169404 24190 test_util.cc:176] Had fatal failures, leaving test files at /tmp/dist-test-taskTkTXTK/test-tmp/rpc-test.6.Parameters_TestRpc.TestCallWithChainCertAndChainCA_SSL_UnixSocket.1790521677090200-24190-0
[  FAILED  ] Parameters/TestRpc.TestCallWithChainCertAndChainCA/SSL_UnixSocket, where GetParam() = (true, true) (23 ms)
[ RUN      ] Parameters/TestRpc.TestCallWithPasswordProtectedKey/SSL_UnixSocket
I20260927 15:07:57.188491 24251 acceptor_pool.cc:254] collecting diagnostics on the listening RPC socket unix:/tmp/dist-test-taskTkTXTK/test-tmp/rpc-test-21351c7cfa8342a3a66f18667a003e8a.sock every 8 connection(s)
I20260927 15:07:57.188504 24252 acceptor_pool.cc:254] collecting diagnostics on the listening RPC socket unix:/tmp/dist-test-taskTkTXTK/test-tmp/rpc-test-21351c7cfa8342a3a66f18667a003e8a.sock every 8 connection(s)
W20260927 15:07:57.202099 24248 connection.cc:196] Error closing socket: Network error: TlsSocket::Close: Broken pipe
[       OK ] Parameters/TestRpc.TestCallWithPasswordProtectedKey/SSL_UnixSocket (33 ms)
[ RUN      ] Parameters/TestRpc.TestCallToBadServer/SSL_UnixSocket
I20260927 15:07:57.216842 24190 rpc-test.cc:394] Status: Network error: Client connection negotiation failed: client connection to 0.0.0.0:0: connect: Connection refused (error 111)
I20260927 15:07:57.217411 24190 rpc-test.cc:394] Status: Network error: Client connection negotiation failed: client connection to 0.0.0.0:0: connect: Connection refused (error 111)
I20260927 15:07:57.217885 24190 rpc-test.cc:394] Status: Network error: Client connection negotiation failed: client connection to 0.0.0.0:0: connect: Connection refused (error 111)
I20260927 15:07:57.218338 24190 rpc-test.cc:394] Status: Network error: Client connection negotiation failed: client connection to 0.0.0.0:0: connect: Connection refused (error 111)
I20260927 15:07:57.218744 24190 rpc-test.cc:394] Status: Network error: Client connection negotiation failed: client connection to 0.0.0.0:0: connect: Connection refused (error 111)
[       OK ] Parameters/TestRpc.TestCallToBadServer/SSL_UnixSocket (16 ms)
[ RUN      ] Parameters/TestRpc.TestWrongService/SSL_UnixSocket
I20260927 15:07:57.228998 24286 acceptor_pool.cc:254] collecting diagnostics on the listening RPC socket unix:/tmp/dist-test-taskTkTXTK/test-tmp/rpc-test-68ef1ff9751543ab8928aee6f8cfd8fa.sock every 8 connection(s)
I20260927 15:07:57.229039 24287 acceptor_pool.cc:254] collecting diagnostics on the listening RPC socket unix:/tmp/dist-test-taskTkTXTK/test-tmp/rpc-test-68ef1ff9751543ab8928aee6f8cfd8fa.sock every 8 connection(s)
I20260927 15:07:57.246210 24283 messenger.cc:345] service WrongServiceName not registered on TestServer
[       OK ] Parameters/TestRpc.TestWrongService/SSL_UnixSocket (28 ms)
[ RUN      ] Parameters/TestRpc.TestConnectionKeepalive/SSL_UnixSocket
I20260927 15:07:57.257571 24309 acceptor_pool.cc:254] collecting diagnostics on the listening RPC socket unix:/tmp/dist-test-taskTkTXTK/test-tmp/rpc-test-b2b23c714c494f029de2f7a7a11a0a54.sock every 8 connection(s)
I20260927 15:07:57.257627 24310 acceptor_pool.cc:254] collecting diagnostics on the listening RPC socket unix:/tmp/dist-test-taskTkTXTK/test-tmp/rpc-test-b2b23c714c494f029de2f7a7a11a0a54.sock every 8 connection(s)
I20260927 15:07:57.257899 24190 rpc-test.cc:488] Connecting to unix:/tmp/dist-test-taskTkTXTK/test-tmp/rpc-test-b2b23c714c494f029de2f7a7a11a0a54.sock
W20260927 15:07:57.750803 24322 connection.cc:196] Error closing socket: Network error: TlsSocket::Close: Broken pipe
[       OK ] Parameters/TestRpc.TestConnectionKeepalive/SSL_UnixSocket (1049 ms)
[ RUN      ] Parameters/TestRpc.TestClientConnectionMetrics/SSL_UnixSocket
I20260927 15:07:58.344437 24334 acceptor_pool.cc:254] collecting diagnostics on the listening RPC socket unix:/tmp/dist-test-taskTkTXTK/test-tmp/rpc-test-04d3f779179347e5988d7a1295352008.sock every 8 connection(s)
I20260927 15:07:58.344496 24335 acceptor_pool.cc:254] collecting diagnostics on the listening RPC socket unix:/tmp/dist-test-taskTkTXTK/test-tmp/rpc-test-04d3f779179347e5988d7a1295352008.sock every 8 connection(s)
I20260927 15:07:58.344806 24190 rpc-test.cc:569] Connecting to unix:/tmp/dist-test-taskTkTXTK/test-tmp/rpc-test-04d3f779179347e5988d7a1295352008.sock
W20260927 15:08:08.652143 24331 connection.cc:196] Error closing socket: Network error: TlsSocket::Close: Broken pipe
[       OK ] Parameters/TestRpc.TestClientConnectionMetrics/SSL_UnixSocket (10355 ms)
[ RUN      ] Parameters/TestRpc.TestCredentialsPolicy/SSL_UnixSocket
I20260927 15:08:08.674562 24357 acceptor_pool.cc:254] collecting diagnostics on the listening RPC socket unix:/tmp/dist-test-taskTkTXTK/test-tmp/rpc-test-1cf18dd4bdb3413594a70c2e9fa5aee9.sock every 8 connection(s)
I20260927 15:08:08.674611 24358 acceptor_pool.cc:254] collecting diagnostics on the listening RPC socket unix:/tmp/dist-test-taskTkTXTK/test-tmp/rpc-test-1cf18dd4bdb3413594a70c2e9fa5aee9.sock every 8 connection(s)
I20260927 15:08:08.674924 24190 rpc-test.cc:700] Connecting to unix:/tmp/dist-test-taskTkTXTK/test-tmp/rpc-test-1cf18dd4bdb3413594a70c2e9fa5aee9.sock
W20260927 15:08:08.701267 24356 connection.cc:196] Error closing socket: Network error: TlsSocket::Close: Broken pipe
[       OK ] Parameters/TestRpc.TestCredentialsPolicy/SSL_UnixSocket (53 ms)
[ RUN      ] Parameters/TestRpc.TestCallLongerThanKeepalive/SSL_UnixSocket
I20260927 15:08:08.724601 24382 acceptor_pool.cc:254] collecting diagnostics on the listening RPC socket unix:/tmp/dist-test-taskTkTXTK/test-tmp/rpc-test-5612532459034209a4eba3b674071fc6.sock every 8 connection(s)
I20260927 15:08:08.724637 24383 acceptor_pool.cc:254] collecting diagnostics on the listening RPC socket unix:/tmp/dist-test-taskTkTXTK/test-tmp/rpc-test-5612532459034209a4eba3b674071fc6.sock every 8 connection(s)
I20260927 15:08:08.735622 24386 rpc-test-base.h:222] got call: sleep_micros: 3000000 deferred: true
I20260927 15:08:11.736451 24386 rpcz_store.cc:275] Call kudu.rpc.GenericCalculatorService.Sleep from unix:<unnamed> (request call id 0) took 3000 ms. Trace:
I20260927 15:08:11.736600 24386 rpcz_store.cc:276] 0927 15:08:08.735524 (+     0us) service_pool.cc:170] Inserting onto call queue
0927 15:08:08.735590 (+    66us) service_pool.cc:227] Handling call
0927 15:08:11.736431 (+3000841us) inbound_call.cc:173] Queueing success response
Metrics: {}
W20260927 15:08:11.738441 24379 connection.cc:196] Error closing socket: Network error: TlsSocket::Close: Broken pipe
[       OK ] Parameters/TestRpc.TestCallLongerThanKeepalive/SSL_UnixSocket (3032 ms)
[ RUN      ] Parameters/TestRpc.TestRpcSidecar/SSL_UnixSocket
I20260927 15:08:11.752543 24407 acceptor_pool.cc:254] collecting diagnostics on the listening RPC socket unix:/tmp/dist-test-taskTkTXTK/test-tmp/rpc-test-b29fccd8d5ea459486564cc13e27ee50.sock every 8 connection(s)
I20260927 15:08:11.752657 24408 acceptor_pool.cc:254] collecting diagnostics on the listening RPC socket unix:/tmp/dist-test-taskTkTXTK/test-tmp/rpc-test-b29fccd8d5ea459486564cc13e27ee50.sock every 8 connection(s)
W20260927 15:08:11.810025 24404 connection.cc:196] Error closing socket: Network error: TlsSocket::Close: Broken pipe
[       OK ] Parameters/TestRpc.TestRpcSidecar/SSL_UnixSocket (71 ms)
[ RUN      ] Parameters/TestRpc.TestRpcSidecarLimits/SSL_UnixSocket
I20260927 15:08:13.569661 24432 acceptor_pool.cc:254] collecting diagnostics on the listening RPC socket unix:/tmp/dist-test-taskTkTXTK/test-tmp/rpc-test-577920215bf444bd8746dd3f457837d2.sock every 8 connection(s)
I20260927 15:08:13.569785 24433 acceptor_pool.cc:254] collecting diagnostics on the listening RPC socket unix:/tmp/dist-test-taskTkTXTK/test-tmp/rpc-test-577920215bf444bd8746dd3f457837d2.sock every 8 connection(s)
W20260927 15:08:13.595969 24190 serialization.cc:72] Serialized kudu.rpc_test.PushStringsRequestPB (2147483654 bytes) is larger than the maximum configured RPC message size (52428800 bytes). Sending anyway, but peer may reject the data.
W20260927 15:08:13.599622 24429 connection.cc:535] server connection from unix:<unnamed> recv error: Network error: RPC frame had a length of 2147483714, but we only support messages up to 52428800 bytes long.
W20260927 15:08:13.599691 24429 connection.cc:158] shutting down server connection from unix:<unnamed> with pending inbound data: 4/2147483714 bytes received; last active 0 ns ago: status Network error: RPC frame had a length of 2147483714, but we only support messages up to 52428800 bytes long.
W20260927 15:08:13.599910 24445 connection.cc:698] client connection to unix:/tmp/dist-test-taskTkTXTK/test-tmp/rpc-test-577920215bf444bd8746dd3f457837d2.sock send error: Network error: failed to write to TLS socket: Broken pipe
W20260927 15:08:13.600070 24445 connection.cc:196] Error closing socket: Network error: TlsSocket::Close: Success
I20260927 15:08:13.628221 24458 acceptor_pool.cc:254] collecting diagnostics on the listening RPC socket unix:/tmp/dist-test-taskTkTXTK/test-tmp/rpc-test-577920215bf444bd8746dd3f457837d2.sock every 8 connection(s)
I20260927 15:08:13.628311 24457 acceptor_pool.cc:254] collecting diagnostics on the listening RPC socket unix:/tmp/dist-test-taskTkTXTK/test-tmp/rpc-test-577920215bf444bd8746dd3f457837d2.sock every 8 connection(s)
W20260927 15:08:18.356760 24454 connection.cc:577] server connection from unix:<unnamed>: received bad data: 'Corruption: Invalid packet: message had a length of 2147483710, but we only support messages up to 2147483647 bytes
'
W20260927 15:08:18.357209 24470 connection.cc:196] Error closing socket: Network error: TlsSocket::Close: Broken pipe
[       OK ] Parameters/TestRpc.TestRpcSidecarLimits/SSL_UnixSocket (6548 ms)
[ RUN      ] Parameters/TestRpc.TestCallTimeoutDoesntAffectNegotiation/SSL_UnixSocket
I20260927 15:08:18.377022 24482 acceptor_pool.cc:254] collecting diagnostics on the listening RPC socket unix:/tmp/dist-test-taskTkTXTK/test-tmp/rpc-test-2b1def8c4faa4269b5ec842b951d59a4.sock every 8 connection(s)
I20260927 15:08:18.377175 24483 acceptor_pool.cc:254] collecting diagnostics on the listening RPC socket unix:/tmp/dist-test-taskTkTXTK/test-tmp/rpc-test-2b1def8c4faa4269b5ec842b951d59a4.sock every 8 connection(s)
W20260927 15:08:18.383452 24477 negotiation.cc:266] Injecting 500ms delay in negotiation
I20260927 15:08:18.433786 24190 rpc-test-base.h:595] status: Timed out: connection negotiation to unix:/tmp/dist-test-taskTkTXTK/test-tmp/rpc-test-2b1def8c4faa4269b5ec842b951d59a4.sock for RPC Sleep timed out after 0.050s (ON_OUTBOUND_QUEUE), seconds elapsed: 0.0507774
[       OK ] Parameters/TestRpc.TestCallTimeoutDoesntAffectNegotiation/SSL_UnixSocket (528 ms)
[ RUN      ] Parameters/TestRpc.TestRpcHandlerLatencyMetric/SSL_UnixSocket
I20260927 15:08:18.907634 24507 acceptor_pool.cc:254] collecting diagnostics on the listening RPC socket unix:/tmp/dist-test-taskTkTXTK/test-tmp/rpc-test-766c62bbcdad44549719750358cda4f1.sock every 8 connection(s)
I20260927 15:08:18.907678 24508 acceptor_pool.cc:254] collecting diagnostics on the listening RPC socket unix:/tmp/dist-test-taskTkTXTK/test-tmp/rpc-test-766c62bbcdad44549719750358cda4f1.sock every 8 connection(s)
I20260927 15:08:18.937250 24190 rpc-test.cc:1236] Sleep() min lat: 20326
I20260927 15:08:18.937312 24190 rpc-test.cc:1237] Sleep() mean lat: 20326
I20260927 15:08:18.937340 24190 rpc-test.cc:1238] Sleep() max lat: 20326
I20260927 15:08:18.937352 24190 rpc-test.cc:1239] Sleep() #calls: 1
[       OK ] Parameters/TestRpc.TestRpcHandlerLatencyMetric/SSL_UnixSocket (50 ms)
[ RUN      ] Parameters/TestRpc.TimedOutOnResponseMetricServiceQueue/SSL_UnixSocket
I20260927 15:08:18.960346 24533 acceptor_pool.cc:254] collecting diagnostics on the listening RPC socket unix:/tmp/dist-test-taskTkTXTK/test-tmp/rpc-test-9a8e2b53a0a7459280492cba29559ae4.sock every 8 connection(s)
I20260927 15:08:18.960353 24534 acceptor_pool.cc:254] collecting diagnostics on the listening RPC socket unix:/tmp/dist-test-taskTkTXTK/test-tmp/rpc-test-9a8e2b53a0a7459280492cba29559ae4.sock every 8 connection(s)
W20260927 15:08:19.012794 24535 rpcz_store.cc:267] Call kudu.rpc_test.CalculatorService.Sleep from unix:<unnamed> (request call id 2) took 20 ms (client timeout 20 ms). Trace:
W20260927 15:08:19.012917 24535 rpcz_store.cc:269] 0927 15:08:18.992339 (+     0us) service_pool.cc:170] Inserting onto call queue
0927 15:08:19.012715 (+ 20376us) service_pool.cc:214] Skipping call since client already timed out
0927 15:08:19.012752 (+    37us) inbound_call.cc:173] Queueing failure response
Metrics: {}
W20260927 15:08:19.013811 24530 connection.cc:196] Error closing socket: Network error: TlsSocket::Close: Broken pipe
[       OK ] Parameters/TestRpc.TimedOutOnResponseMetricServiceQueue/SSL_UnixSocket (75 ms)
[ RUN      ] Parameters/TestRpc.RpcPendingConnectionsMetric/SSL_UnixSocket
I20260927 15:08:19.017252 24556 acceptor_pool.cc:254] collecting diagnostics on the listening RPC socket 0.0.0.0:40677 every 8 connection(s)
I20260927 15:08:19.017328 24557 acceptor_pool.cc:254] collecting diagnostics on the listening RPC socket 0.0.0.0:40677 every 8 connection(s)
W20260927 15:08:19.018390 24552 negotiation.cc:337] Failed RPC negotiation. Trace:
0927 15:08:19.018006 (+     0us) reactor.cc:625] Submitting negotiation task for server connection from 127.0.0.1:58292 (local address 127.0.0.1:40677)
0927 15:08:19.018109 (+   103us) server_negotiation.cc:206] Beginning negotiation
0927 15:08:19.018112 (+     3us) server_negotiation.cc:399] Waiting for connection header
0927 15:08:19.018197 (+    85us) negotiation.cc:327] Negotiation complete: Network error: Server connection negotiation failed: server connection from 127.0.0.1:58292: BlockingRecv error: recv got EOF from 127.0.0.1:58292 (error 108)
Metrics: {"server-negotiator.queue_time_us":34}
[       OK ] Parameters/TestRpc.RpcPendingConnectionsMetric/SSL_UnixSocket (14 ms)
[ RUN      ] Parameters/TestRpc.TestRpcContextClientDeadline/SSL_UnixSocket
I20260927 15:08:19.046105 24572 acceptor_pool.cc:254] collecting diagnostics on the listening RPC socket unix:/tmp/dist-test-taskTkTXTK/test-tmp/rpc-test-43c8d2065ce341a9ac240a44a6404156.sock every 8 connection(s)
I20260927 15:08:19.046139 24573 acceptor_pool.cc:254] collecting diagnostics on the listening RPC socket unix:/tmp/dist-test-taskTkTXTK/test-tmp/rpc-test-43c8d2065ce341a9ac240a44a6404156.sock every 8 connection(s)
W20260927 15:08:19.087122 24569 connection.cc:196] Error closing socket: Network error: TlsSocket::Close: Broken pipe
[       OK ] Parameters/TestRpc.TestRpcContextClientDeadline/SSL_UnixSocket (58 ms)
[ RUN      ] Parameters/TestRpc.TestApplicationFeatureFlagUnsupportedServer/SSL_UnixSocket
I20260927 15:08:19.101280 24597 acceptor_pool.cc:254] collecting diagnostics on the listening RPC socket unix:/tmp/dist-test-taskTkTXTK/test-tmp/rpc-test-53e621102dcf45a194fe4fca5b441bb1.sock every 8 connection(s)
I20260927 15:08:19.101325 24598 acceptor_pool.cc:254] collecting diagnostics on the listening RPC socket unix:/tmp/dist-test-taskTkTXTK/test-tmp/rpc-test-53e621102dcf45a194fe4fca5b441bb1.sock every 8 connection(s)
[       OK ] Parameters/TestRpc.TestApplicationFeatureFlagUnsupportedServer/SSL_UnixSocket (25 ms)
[ RUN      ] Parameters/TestRpc.TestCancellationAsync/SSL_UnixSocket
I20260927 15:08:19.124019 24622 acceptor_pool.cc:254] collecting diagnostics on the listening RPC socket unix:/tmp/dist-test-taskTkTXTK/test-tmp/rpc-test-2b5ea8ab3f8a42289d439e6436568e8c.sock every 8 connection(s)
I20260927 15:08:19.124056 24623 acceptor_pool.cc:254] collecting diagnostics on the listening RPC socket unix:/tmp/dist-test-taskTkTXTK/test-tmp/rpc-test-2b5ea8ab3f8a42289d439e6436568e8c.sock every 8 connection(s)
I20260927 15:08:19.124346 24190 rpc-test.cc:1716] Connecting to unix:/tmp/dist-test-taskTkTXTK/test-tmp/rpc-test-2b5ea8ab3f8a42289d439e6436568e8c.sock
I20260927 15:08:19.146941 24190 test_util.cc:268] Using random seed: 1373052090
I20260927 15:08:19.165695 24626 rpc-test-base.h:240] got call: sleep_micros: 500 pattern: 4294967295 num_repetitions: 2097152 sidecar_idx: 0
I20260927 15:08:19.181018 24625 rpc-test-base.h:240] got call: sleep_micros: 500 pattern: 4294967295 num_repetitions: 2097152 sidecar_idx: 0
I20260927 15:08:19.196482 24626 rpc-test-base.h:240] got call: sleep_micros: 500 pattern: 4294967295 num_repetitions: 2097152 sidecar_idx: 0
I20260927 15:08:19.212145 24625 rpc-test-base.h:240] got call: sleep_micros: 500 pattern: 4294967295 num_repetitions: 2097152 sidecar_idx: 0
I20260927 15:08:19.227680 24626 rpc-test-base.h:240] got call: sleep_micros: 500 pattern: 4294967295 num_repetitions: 2097152 sidecar_idx: 0
I20260927 15:08:19.242867 24625 rpc-test-base.h:240] got call: sleep_micros: 500 pattern: 4294967295 num_repetitions: 2097152 sidecar_idx: 0
I20260927 15:08:19.258126 24626 rpc-test-base.h:240] got call: sleep_micros: 500 pattern: 4294967295 num_repetitions: 2097152 sidecar_idx: 0
W20260927 15:08:19.259660 24619 connection.cc:196] Error closing socket: Network error: TlsSocket::Close: Broken pipe
W20260927 15:08:19.270066 24619 connection.cc:441] server connection from unix:<unnamed> torn down before Call kudu.rpc.GenericCalculatorService.SleepWithSidecar from unix:<unnamed> (request call id 8) could send its response
W20260927 15:08:19.281005 24619 connection.cc:441] server connection from unix:<unnamed> torn down before Call kudu.rpc.GenericCalculatorService.SleepWithSidecar from unix:<unnamed> (request call id 9) could send its response
[       OK ] Parameters/TestRpc.TestCancellationAsync/SSL_UnixSocket (168 ms)
[ RUN      ] Parameters/TestRpc.TestPerformanceBySocketType/SSL_UnixSocket
I20260927 15:08:19.294363 24647 acceptor_pool.cc:254] collecting diagnostics on the listening RPC socket unix:/tmp/dist-test-taskTkTXTK/test-tmp/rpc-test-8ad00556180b4d3bba3cfd4c4b65dd91.sock every 8 connection(s)
I20260927 15:08:19.294399 24648 acceptor_pool.cc:254] collecting diagnostics on the listening RPC socket unix:/tmp/dist-test-taskTkTXTK/test-tmp/rpc-test-8ad00556180b4d3bba3cfd4c4b65dd91.sock every 8 connection(s)
I20260927 15:08:19.294704 24190 rpc-test.cc:1846] Connecting to unix:/tmp/dist-test-taskTkTXTK/test-tmp/rpc-test-8ad00556180b4d3bba3cfd4c4b65dd91.sock
I20260927 15:08:20.881567 24190 rpc-test.cc:1859] Sending 1024MB via ssl-enabled unix socket: real 1.578s	user 1.977s	sys 0.899s
I20260927 15:08:22.339548 24190 rpc-test.cc:1859] Sending 1024MB via ssl-enabled unix socket: real 1.458s	user 1.810s	sys 0.856s
I20260927 15:08:23.846598 24190 rpc-test.cc:1859] Sending 1024MB via ssl-enabled unix socket: real 1.507s	user 1.920s	sys 0.830s
I20260927 15:08:25.295857 24190 rpc-test.cc:1859] Sending 1024MB via ssl-enabled unix socket: real 1.449s	user 1.771s	sys 0.875s
I20260927 15:08:26.809077 24190 rpc-test.cc:1859] Sending 1024MB via ssl-enabled unix socket: real 1.513s	user 1.839s	sys 0.909s
W20260927 15:08:26.810132 24644 connection.cc:196] Error closing socket: Network error: TlsSocket::Close: Broken pipe
[       OK ] Parameters/TestRpc.TestPerformanceBySocketType/SSL_UnixSocket (7528 ms)
[----------] 20 tests from Parameters/TestRpc (29714 ms total)

[----------] 1 test from Parameters/TestRpcSocketTxRxQueue
[ RUN      ] Parameters/TestRpcSocketTxRxQueue.AcceptorRxQueueSizeMetric/0
I20260927 15:08:26.819567 24672 acceptor_pool.cc:254] collecting diagnostics on the listening RPC socket 0.0.0.0:37051 every 1 connection(s)
I20260927 15:08:26.819631 24673 acceptor_pool.cc:254] collecting diagnostics on the listening RPC socket 0.0.0.0:37051 every 1 connection(s)
W20260927 15:08:26.820699 24668 negotiation.cc:337] Failed RPC negotiation. Trace:
0927 15:08:26.820413 (+     0us) reactor.cc:625] Submitting negotiation task for server connection from 127.0.0.1:51046 (local address 127.0.0.1:37051)
0927 15:08:26.820536 (+   123us) server_negotiation.cc:206] Beginning negotiation
0927 15:08:26.820539 (+     3us) server_negotiation.cc:399] Waiting for connection header
0927 15:08:26.820627 (+    88us) negotiation.cc:327] Negotiation complete: Network error: Server connection negotiation failed: server connection from 127.0.0.1:51046: BlockingRecv error: recv got EOF from 127.0.0.1:51046 (error 108)
Metrics: {"server-negotiator.queue_time_us":45}
[       OK ] Parameters/TestRpcSocketTxRxQueue.AcceptorRxQueueSizeMetric/0 (11 ms)
[----------] 1 test from Parameters/TestRpcSocketTxRxQueue (11 ms total)

[----------] Global test environment tear-down
[==========] 21 tests from 2 test suites ran. (29726 ms total)
[  PASSED  ] 20 tests.
[  FAILED  ] 1 test, listed below:
[  FAILED  ] Parameters/TestRpc.TestCallWithChainCertAndChainCA/SSL_UnixSocket, where GetParam() = (true, true)

 1 FAILED TEST