Diagnosed failure
Parameters/TestRpc.TestCallWithChainCertAndChainCA/SSL_UnixSocket: /data0/somelongdirectorytoavoidrpathissues/src/kudu/src/kudu/rpc/rpc-test.cc:270: Failure
Failed
Bad status: Runtime error: could not verify certificate chain (error with cert: subject=CN = localhost, ST = sadfjas, C = AS, emailAddress = sdflkdsajf, O = lskdfjlsad, OU = sldfkja, issuer=C = AS, ST = ASDfkjdhf, L = lskdjf, O = saldfja, OU = skdjf, CN = localhost, emailAddress = sadjflkadsj): : certificate has expired
Google Test trace:
/data0/somelongdirectorytoavoidrpathissues/src/kudu/src/kudu/rpc/rpc-test.cc:267: Connecting to unix:/tmp/dist-test-tasktcqUN0/test-tmp/rpc-test-7361604e6ad84970bbd9672ee9d212f3.sock
I20260929 19:01:50.069528 9723 test_util.cc:175] -----------------------------------------------
I20260929 19:01:50.069582 9723 test_util.cc:176] Had fatal failures, leaving test files at /tmp/dist-test-tasktcqUN0/test-tmp/rpc-test.6.Parameters_TestRpc.TestCallWithChainCertAndChainCA_SSL_UnixSocket.1790708510009028-9723-0
Full log
Note: This is test shard 7 of 8.
[==========] Running 21 tests from 2 test suites.
[----------] Global test environment set-up.
[----------] 20 tests from Parameters/TestRpc
[ RUN ] Parameters/TestRpc.TestMessengerCreateDestroy/SSL_UnixSocket
WARNING: Logging before InitGoogleLogging() is written to STDERR
I20260929 19:01:50.028095 9723 rpc-test.cc:169] started messenger TestCreateDestroy
[ OK ] Parameters/TestRpc.TestMessengerCreateDestroy/SSL_UnixSocket (17 ms)
[ RUN ] Parameters/TestRpc.TestNegotiationDeadlock/SSL_UnixSocket
I20260929 19:01:50.047909 9744 acceptor_pool.cc:254] collecting diagnostics on the listening RPC socket unix:/tmp/dist-test-tasktcqUN0/test-tmp/rpc-test-3e7a8cebf2ee4b0a976c33176f7f2fdf.sock every 8 connection(s)
I20260929 19:01:50.047909 9743 acceptor_pool.cc:254] collecting diagnostics on the listening RPC socket unix:/tmp/dist-test-tasktcqUN0/test-tmp/rpc-test-3e7a8cebf2ee4b0a976c33176f7f2fdf.sock every 8 connection(s)
[ OK ] Parameters/TestRpc.TestNegotiationDeadlock/SSL_UnixSocket (25 ms)
[ RUN ] Parameters/TestRpc.TestCallWithChainCertAndChainCA/SSL_UnixSocket
I20260929 19:01:50.065549 9759 acceptor_pool.cc:254] collecting diagnostics on the listening RPC socket unix:/tmp/dist-test-tasktcqUN0/test-tmp/rpc-test-7361604e6ad84970bbd9672ee9d212f3.sock every 8 connection(s)
I20260929 19:01:50.065594 9760 acceptor_pool.cc:254] collecting diagnostics on the listening RPC socket unix:/tmp/dist-test-tasktcqUN0/test-tmp/rpc-test-7361604e6ad84970bbd9672ee9d212f3.sock every 8 connection(s)
/data0/somelongdirectorytoavoidrpathissues/src/kudu/src/kudu/rpc/rpc-test.cc:270: Failure
Failed
Bad status: Runtime error: could not verify certificate chain (error with cert: subject=CN = localhost, ST = sadfjas, C = AS, emailAddress = sdflkdsajf, O = lskdfjlsad, OU = sldfkja, issuer=C = AS, ST = ASDfkjdhf, L = lskdjf, O = saldfja, OU = skdjf, CN = localhost, emailAddress = sadjflkadsj): : certificate has expired
Google Test trace:
/data0/somelongdirectorytoavoidrpathissues/src/kudu/src/kudu/rpc/rpc-test.cc:267: Connecting to unix:/tmp/dist-test-tasktcqUN0/test-tmp/rpc-test-7361604e6ad84970bbd9672ee9d212f3.sock
I20260929 19:01:50.069528 9723 test_util.cc:175] -----------------------------------------------
I20260929 19:01:50.069582 9723 test_util.cc:176] Had fatal failures, leaving test files at /tmp/dist-test-tasktcqUN0/test-tmp/rpc-test.6.Parameters_TestRpc.TestCallWithChainCertAndChainCA_SSL_UnixSocket.1790708510009028-9723-0
[ FAILED ] Parameters/TestRpc.TestCallWithChainCertAndChainCA/SSL_UnixSocket, where GetParam() = (true, true) (14 ms)
[ RUN ] Parameters/TestRpc.TestCallWithPasswordProtectedKey/SSL_UnixSocket
I20260929 19:01:50.087129 9784 acceptor_pool.cc:254] collecting diagnostics on the listening RPC socket unix:/tmp/dist-test-tasktcqUN0/test-tmp/rpc-test-5f3369fb55e1429aa4618f57f021322d.sock every 8 connection(s)
I20260929 19:01:50.087153 9785 acceptor_pool.cc:254] collecting diagnostics on the listening RPC socket unix:/tmp/dist-test-tasktcqUN0/test-tmp/rpc-test-5f3369fb55e1429aa4618f57f021322d.sock every 8 connection(s)
W20260929 19:01:50.103745 9781 connection.cc:196] Error closing socket: Network error: TlsSocket::Close: Broken pipe
[ OK ] Parameters/TestRpc.TestCallWithPasswordProtectedKey/SSL_UnixSocket (35 ms)
[ RUN ] Parameters/TestRpc.TestCallToBadServer/SSL_UnixSocket
I20260929 19:01:50.120561 9723 rpc-test.cc:394] Status: Network error: Client connection negotiation failed: client connection to 0.0.0.0:0: connect: Connection refused (error 111)
I20260929 19:01:50.120805 9723 rpc-test.cc:394] Status: Network error: Client connection negotiation failed: client connection to 0.0.0.0:0: connect: Connection refused (error 111)
I20260929 19:01:50.121017 9723 rpc-test.cc:394] Status: Network error: Client connection negotiation failed: client connection to 0.0.0.0:0: connect: Connection refused (error 111)
I20260929 19:01:50.121223 9723 rpc-test.cc:394] Status: Network error: Client connection negotiation failed: client connection to 0.0.0.0:0: connect: Connection refused (error 111)
I20260929 19:01:50.121456 9723 rpc-test.cc:394] Status: Network error: Client connection negotiation failed: client connection to 0.0.0.0:0: connect: Connection refused (error 111)
[ OK ] Parameters/TestRpc.TestCallToBadServer/SSL_UnixSocket (16 ms)
[ RUN ] Parameters/TestRpc.TestWrongService/SSL_UnixSocket
I20260929 19:01:50.137668 9820 acceptor_pool.cc:254] collecting diagnostics on the listening RPC socket unix:/tmp/dist-test-tasktcqUN0/test-tmp/rpc-test-c930508f2c534a988e404eb72fa18d02.sock every 8 connection(s)
I20260929 19:01:50.137679 9819 acceptor_pool.cc:254] collecting diagnostics on the listening RPC socket unix:/tmp/dist-test-tasktcqUN0/test-tmp/rpc-test-c930508f2c534a988e404eb72fa18d02.sock every 8 connection(s)
I20260929 19:01:50.153734 9816 messenger.cc:345] service WrongServiceName not registered on TestServer
[ OK ] Parameters/TestRpc.TestWrongService/SSL_UnixSocket (33 ms)
[ RUN ] Parameters/TestRpc.TestConnectionKeepalive/SSL_UnixSocket
I20260929 19:01:50.178872 9842 acceptor_pool.cc:254] collecting diagnostics on the listening RPC socket unix:/tmp/dist-test-tasktcqUN0/test-tmp/rpc-test-2432e05b6c2046108f3d580c8b76606a.sock every 8 connection(s)
I20260929 19:01:50.178930 9843 acceptor_pool.cc:254] collecting diagnostics on the listening RPC socket unix:/tmp/dist-test-tasktcqUN0/test-tmp/rpc-test-2432e05b6c2046108f3d580c8b76606a.sock every 8 connection(s)
I20260929 19:01:50.179126 9723 rpc-test.cc:488] Connecting to unix:/tmp/dist-test-tasktcqUN0/test-tmp/rpc-test-2432e05b6c2046108f3d580c8b76606a.sock
W20260929 19:01:50.656435 9855 connection.cc:196] Error closing socket: Network error: TlsSocket::Close: Broken pipe
[ OK ] Parameters/TestRpc.TestConnectionKeepalive/SSL_UnixSocket (1057 ms)
[ RUN ] Parameters/TestRpc.TestClientConnectionMetrics/SSL_UnixSocket
I20260929 19:01:51.238854 9867 acceptor_pool.cc:254] collecting diagnostics on the listening RPC socket unix:/tmp/dist-test-tasktcqUN0/test-tmp/rpc-test-acd9a1f446934af8b8bfc3cefad995ce.sock every 8 connection(s)
I20260929 19:01:51.238902 9868 acceptor_pool.cc:254] collecting diagnostics on the listening RPC socket unix:/tmp/dist-test-tasktcqUN0/test-tmp/rpc-test-acd9a1f446934af8b8bfc3cefad995ce.sock every 8 connection(s)
I20260929 19:01:51.239055 9723 rpc-test.cc:569] Connecting to unix:/tmp/dist-test-tasktcqUN0/test-tmp/rpc-test-acd9a1f446934af8b8bfc3cefad995ce.sock
W20260929 19:01:59.900588 9864 connection.cc:196] Error closing socket: Network error: TlsSocket::Close: Broken pipe
[ OK ] Parameters/TestRpc.TestClientConnectionMetrics/SSL_UnixSocket (8688 ms)
[ RUN ] Parameters/TestRpc.TestCredentialsPolicy/SSL_UnixSocket
I20260929 19:01:59.933780 9890 acceptor_pool.cc:254] collecting diagnostics on the listening RPC socket unix:/tmp/dist-test-tasktcqUN0/test-tmp/rpc-test-a3c0fafdb7244bfaa9ac3aaf08a283c8.sock every 8 connection(s)
I20260929 19:01:59.933820 9891 acceptor_pool.cc:254] collecting diagnostics on the listening RPC socket unix:/tmp/dist-test-tasktcqUN0/test-tmp/rpc-test-a3c0fafdb7244bfaa9ac3aaf08a283c8.sock every 8 connection(s)
I20260929 19:01:59.933986 9723 rpc-test.cc:700] Connecting to unix:/tmp/dist-test-tasktcqUN0/test-tmp/rpc-test-a3c0fafdb7244bfaa9ac3aaf08a283c8.sock
W20260929 19:01:59.970017 9889 connection.cc:196] Error closing socket: Network error: TlsSocket::Close: Broken pipe
[ OK ] Parameters/TestRpc.TestCredentialsPolicy/SSL_UnixSocket (73 ms)
[ RUN ] Parameters/TestRpc.TestCallLongerThanKeepalive/SSL_UnixSocket
I20260929 19:01:59.980933 9915 acceptor_pool.cc:254] collecting diagnostics on the listening RPC socket unix:/tmp/dist-test-tasktcqUN0/test-tmp/rpc-test-2566165df6a346fe990fb8435a5b4b18.sock every 8 connection(s)
I20260929 19:01:59.980994 9916 acceptor_pool.cc:254] collecting diagnostics on the listening RPC socket unix:/tmp/dist-test-tasktcqUN0/test-tmp/rpc-test-2566165df6a346fe990fb8435a5b4b18.sock every 8 connection(s)
I20260929 19:02:00.000268 9919 rpc-test-base.h:222] got call: sleep_micros: 3000000 deferred: true
I20260929 19:02:03.001020 9919 rpcz_store.cc:275] Call kudu.rpc.GenericCalculatorService.Sleep from unix:<unnamed> (request call id 0) took 3000 ms. Trace:
I20260929 19:02:03.001155 9919 rpcz_store.cc:276] 0929 19:02:00.000189 (+ 0us) service_pool.cc:170] Inserting onto call queue
0929 19:02:00.000241 (+ 52us) service_pool.cc:227] Handling call
0929 19:02:03.001005 (+3000764us) inbound_call.cc:173] Queueing success response
Metrics: {}
[ OK ] Parameters/TestRpc.TestCallLongerThanKeepalive/SSL_UnixSocket (3028 ms)
[ RUN ] Parameters/TestRpc.TestRpcSidecar/SSL_UnixSocket
I20260929 19:02:03.020007 9940 acceptor_pool.cc:254] collecting diagnostics on the listening RPC socket unix:/tmp/dist-test-tasktcqUN0/test-tmp/rpc-test-a0aed20df7974e549cabad89ce6e1c9d.sock every 8 connection(s)
I20260929 19:02:03.020097 9941 acceptor_pool.cc:254] collecting diagnostics on the listening RPC socket unix:/tmp/dist-test-tasktcqUN0/test-tmp/rpc-test-a0aed20df7974e549cabad89ce6e1c9d.sock every 8 connection(s)
W20260929 19:02:03.056021 9937 connection.cc:196] Error closing socket: Network error: TlsSocket::Close: Broken pipe
[ OK ] Parameters/TestRpc.TestRpcSidecar/SSL_UnixSocket (53 ms)
[ RUN ] Parameters/TestRpc.TestRpcSidecarLimits/SSL_UnixSocket
I20260929 19:02:04.727519 9966 acceptor_pool.cc:254] collecting diagnostics on the listening RPC socket unix:/tmp/dist-test-tasktcqUN0/test-tmp/rpc-test-270dc3cc0b184572839040bb53baa5c8.sock every 8 connection(s)
I20260929 19:02:04.727496 9965 acceptor_pool.cc:254] collecting diagnostics on the listening RPC socket unix:/tmp/dist-test-tasktcqUN0/test-tmp/rpc-test-270dc3cc0b184572839040bb53baa5c8.sock every 8 connection(s)
W20260929 19:02:04.746021 9723 serialization.cc:72] Serialized kudu.rpc_test.PushStringsRequestPB (2147483654 bytes) is larger than the maximum configured RPC message size (52428800 bytes). Sending anyway, but peer may reject the data.
W20260929 19:02:04.748963 9962 connection.cc:535] server connection from unix:<unnamed> recv error: Network error: RPC frame had a length of 2147483714, but we only support messages up to 52428800 bytes long.
W20260929 19:02:04.749008 9962 connection.cc:158] shutting down server connection from unix:<unnamed> with pending inbound data: 4/2147483714 bytes received; last active 0 ns ago: status Network error: RPC frame had a length of 2147483714, but we only support messages up to 52428800 bytes long.
W20260929 19:02:04.749125 9978 connection.cc:698] client connection to unix:/tmp/dist-test-tasktcqUN0/test-tmp/rpc-test-270dc3cc0b184572839040bb53baa5c8.sock send error: Network error: failed to write to TLS socket: Broken pipe
W20260929 19:02:04.749260 9978 connection.cc:196] Error closing socket: Network error: TlsSocket::Close: Success
I20260929 19:02:04.755870 9990 acceptor_pool.cc:254] collecting diagnostics on the listening RPC socket unix:/tmp/dist-test-tasktcqUN0/test-tmp/rpc-test-270dc3cc0b184572839040bb53baa5c8.sock every 8 connection(s)
I20260929 19:02:04.755893 9991 acceptor_pool.cc:254] collecting diagnostics on the listening RPC socket unix:/tmp/dist-test-tasktcqUN0/test-tmp/rpc-test-270dc3cc0b184572839040bb53baa5c8.sock every 8 connection(s)
W20260929 19:02:09.064759 9987 connection.cc:577] server connection from unix:<unnamed>: received bad data: 'Corruption: Invalid packet: message had a length of 2147483710, but we only support messages up to 2147483647 bytes
'
W20260929 19:02:09.065074 10003 connection.cc:196] Error closing socket: Network error: TlsSocket::Close: Broken pipe
[ OK ] Parameters/TestRpc.TestRpcSidecarLimits/SSL_UnixSocket (6009 ms)
[ RUN ] Parameters/TestRpc.TestCallTimeoutDoesntAffectNegotiation/SSL_UnixSocket
I20260929 19:02:09.084914 10015 acceptor_pool.cc:254] collecting diagnostics on the listening RPC socket unix:/tmp/dist-test-tasktcqUN0/test-tmp/rpc-test-973dbf4d7d9a4201a21bb3418b83f162.sock every 8 connection(s)
I20260929 19:02:09.084964 10016 acceptor_pool.cc:254] collecting diagnostics on the listening RPC socket unix:/tmp/dist-test-tasktcqUN0/test-tmp/rpc-test-973dbf4d7d9a4201a21bb3418b83f162.sock every 8 connection(s)
W20260929 19:02:09.107594 10011 negotiation.cc:266] Injecting 500ms delay in negotiation
I20260929 19:02:09.157903 9723 rpc-test-base.h:595] status: Timed out: connection negotiation to unix:/tmp/dist-test-tasktcqUN0/test-tmp/rpc-test-973dbf4d7d9a4201a21bb3418b83f162.sock for RPC Sleep timed out after 0.050s (ON_OUTBOUND_QUEUE), seconds elapsed: 0.050625
[ OK ] Parameters/TestRpc.TestCallTimeoutDoesntAffectNegotiation/SSL_UnixSocket (545 ms)
[ RUN ] Parameters/TestRpc.TestRpcHandlerLatencyMetric/SSL_UnixSocket
I20260929 19:02:09.636370 10040 acceptor_pool.cc:254] collecting diagnostics on the listening RPC socket unix:/tmp/dist-test-tasktcqUN0/test-tmp/rpc-test-7f8189fcc8ee47828d3a0b2c4bf146bd.sock every 8 connection(s)
I20260929 19:02:09.636408 10041 acceptor_pool.cc:254] collecting diagnostics on the listening RPC socket unix:/tmp/dist-test-tasktcqUN0/test-tmp/rpc-test-7f8189fcc8ee47828d3a0b2c4bf146bd.sock every 8 connection(s)
I20260929 19:02:09.669481 9723 rpc-test.cc:1236] Sleep() min lat: 20350
I20260929 19:02:09.669552 9723 rpc-test.cc:1237] Sleep() mean lat: 20350
I20260929 19:02:09.669579 9723 rpc-test.cc:1238] Sleep() max lat: 20350
I20260929 19:02:09.669591 9723 rpc-test.cc:1239] Sleep() #calls: 1
W20260929 19:02:09.670190 10037 connection.cc:196] Error closing socket: Network error: TlsSocket::Close: Broken pipe
[ OK ] Parameters/TestRpc.TestRpcHandlerLatencyMetric/SSL_UnixSocket (58 ms)
[ RUN ] Parameters/TestRpc.TimedOutOnResponseMetricServiceQueue/SSL_UnixSocket
I20260929 19:02:09.678057 10066 acceptor_pool.cc:254] collecting diagnostics on the listening RPC socket unix:/tmp/dist-test-tasktcqUN0/test-tmp/rpc-test-630d46eaead8491784404828d9b5eed4.sock every 8 connection(s)
I20260929 19:02:09.678107 10067 acceptor_pool.cc:254] collecting diagnostics on the listening RPC socket unix:/tmp/dist-test-tasktcqUN0/test-tmp/rpc-test-630d46eaead8491784404828d9b5eed4.sock every 8 connection(s)
W20260929 19:02:09.728824 10068 rpcz_store.cc:267] Call kudu.rpc_test.CalculatorService.Sleep from unix:<unnamed> (request call id 2) took 20 ms (client timeout 20 ms). Trace:
W20260929 19:02:09.728955 10068 rpcz_store.cc:269] 0929 19:02:09.708569 (+ 0us) service_pool.cc:170] Inserting onto call queue
0929 19:02:09.728795 (+ 20226us) service_pool.cc:214] Skipping call since client already timed out
0929 19:02:09.728807 (+ 12us) inbound_call.cc:173] Queueing failure response
Metrics: {}
[ OK ] Parameters/TestRpc.TimedOutOnResponseMetricServiceQueue/SSL_UnixSocket (59 ms)
[ RUN ] Parameters/TestRpc.RpcPendingConnectionsMetric/SSL_UnixSocket
I20260929 19:02:09.732277 10089 acceptor_pool.cc:254] collecting diagnostics on the listening RPC socket 0.0.0.0:40353 every 8 connection(s)
I20260929 19:02:09.732343 10090 acceptor_pool.cc:254] collecting diagnostics on the listening RPC socket 0.0.0.0:40353 every 8 connection(s)
W20260929 19:02:09.732908 10085 negotiation.cc:337] Failed RPC negotiation. Trace:
0929 19:02:09.732737 (+ 0us) reactor.cc:625] Submitting negotiation task for server connection from 127.0.0.1:36792 (local address 127.0.0.1:40353)
0929 19:02:09.732777 (+ 40us) server_negotiation.cc:206] Beginning negotiation
0929 19:02:09.732778 (+ 1us) server_negotiation.cc:399] Waiting for connection header
0929 19:02:09.732857 (+ 79us) negotiation.cc:327] Negotiation complete: Network error: Server connection negotiation failed: server connection from 127.0.0.1:36792: BlockingRecv error: recv got EOF from 127.0.0.1:36792 (error 108)
Metrics: {"server-negotiator.queue_time_us":14}
[ OK ] Parameters/TestRpc.RpcPendingConnectionsMetric/SSL_UnixSocket (13 ms)
[ RUN ] Parameters/TestRpc.TestRpcContextClientDeadline/SSL_UnixSocket
I20260929 19:02:09.750384 10105 acceptor_pool.cc:254] collecting diagnostics on the listening RPC socket unix:/tmp/dist-test-tasktcqUN0/test-tmp/rpc-test-4027e4e60d024092b2a4b33512b72c48.sock every 8 connection(s)
I20260929 19:02:09.750429 10106 acceptor_pool.cc:254] collecting diagnostics on the listening RPC socket unix:/tmp/dist-test-tasktcqUN0/test-tmp/rpc-test-4027e4e60d024092b2a4b33512b72c48.sock every 8 connection(s)
[ OK ] Parameters/TestRpc.TestRpcContextClientDeadline/SSL_UnixSocket (39 ms)
[ RUN ] Parameters/TestRpc.TestApplicationFeatureFlagUnsupportedServer/SSL_UnixSocket
I20260929 19:02:09.788488 10130 acceptor_pool.cc:254] collecting diagnostics on the listening RPC socket unix:/tmp/dist-test-tasktcqUN0/test-tmp/rpc-test-7b049a5df900428e93691fdbf5f05d3c.sock every 8 connection(s)
I20260929 19:02:09.788532 10131 acceptor_pool.cc:254] collecting diagnostics on the listening RPC socket unix:/tmp/dist-test-tasktcqUN0/test-tmp/rpc-test-7b049a5df900428e93691fdbf5f05d3c.sock every 8 connection(s)
W20260929 19:02:09.805027 10127 connection.cc:196] Error closing socket: Network error: TlsSocket::Close: Broken pipe
[ OK ] Parameters/TestRpc.TestApplicationFeatureFlagUnsupportedServer/SSL_UnixSocket (22 ms)
[ RUN ] Parameters/TestRpc.TestCancellationAsync/SSL_UnixSocket
I20260929 19:02:09.815984 10155 acceptor_pool.cc:254] collecting diagnostics on the listening RPC socket unix:/tmp/dist-test-tasktcqUN0/test-tmp/rpc-test-6a09c4386d3546c2b2810e1e7da80ace.sock every 8 connection(s)
I20260929 19:02:09.816044 10156 acceptor_pool.cc:254] collecting diagnostics on the listening RPC socket unix:/tmp/dist-test-tasktcqUN0/test-tmp/rpc-test-6a09c4386d3546c2b2810e1e7da80ace.sock every 8 connection(s)
I20260929 19:02:09.816203 9723 rpc-test.cc:1716] Connecting to unix:/tmp/dist-test-tasktcqUN0/test-tmp/rpc-test-6a09c4386d3546c2b2810e1e7da80ace.sock
I20260929 19:02:09.823035 9723 test_util.cc:268] Using random seed: -774832839
I20260929 19:02:09.836313 10157 rpc-test-base.h:240] got call: sleep_micros: 500 pattern: 4294967295 num_repetitions: 2097152 sidecar_idx: 0
I20260929 19:02:09.846611 10157 rpc-test-base.h:240] got call: sleep_micros: 500 pattern: 4294967295 num_repetitions: 2097152 sidecar_idx: 0
I20260929 19:02:09.856889 10157 rpc-test-base.h:240] got call: sleep_micros: 500 pattern: 4294967295 num_repetitions: 2097152 sidecar_idx: 0
I20260929 19:02:09.867259 10157 rpc-test-base.h:240] got call: sleep_micros: 500 pattern: 4294967295 num_repetitions: 2097152 sidecar_idx: 0
I20260929 19:02:09.877782 10157 rpc-test-base.h:240] got call: sleep_micros: 500 pattern: 4294967295 num_repetitions: 2097152 sidecar_idx: 0
I20260929 19:02:09.888113 10157 rpc-test-base.h:240] got call: sleep_micros: 500 pattern: 4294967295 num_repetitions: 2097152 sidecar_idx: 0
I20260929 19:02:09.898104 10157 rpc-test-base.h:240] got call: sleep_micros: 500 pattern: 4294967295 num_repetitions: 2097152 sidecar_idx: 0
I20260929 19:02:09.908915 10157 rpc-test-base.h:240] got call: sleep_micros: 500 pattern: 4294967295 num_repetitions: 2097152 sidecar_idx: 0
W20260929 19:02:09.910333 10152 connection.cc:196] Error closing socket: Network error: TlsSocket::Close: Broken pipe
W20260929 19:02:09.911985 10152 connection.cc:441] server connection from unix:<unnamed> torn down before Call kudu.rpc.GenericCalculatorService.SleepWithSidecar from unix:<unnamed> (request call id 9) could send its response
[ OK ] Parameters/TestRpc.TestCancellationAsync/SSL_UnixSocket (106 ms)
[ RUN ] Parameters/TestRpc.TestPerformanceBySocketType/SSL_UnixSocket
I20260929 19:02:09.931505 10180 acceptor_pool.cc:254] collecting diagnostics on the listening RPC socket unix:/tmp/dist-test-tasktcqUN0/test-tmp/rpc-test-4999003deb024d9d91bb52d1005e3344.sock every 8 connection(s)
I20260929 19:02:09.931553 10181 acceptor_pool.cc:254] collecting diagnostics on the listening RPC socket unix:/tmp/dist-test-tasktcqUN0/test-tmp/rpc-test-4999003deb024d9d91bb52d1005e3344.sock every 8 connection(s)
I20260929 19:02:09.931721 9723 rpc-test.cc:1846] Connecting to unix:/tmp/dist-test-tasktcqUN0/test-tmp/rpc-test-4999003deb024d9d91bb52d1005e3344.sock
I20260929 19:02:11.166903 9723 rpc-test.cc:1859] Sending 1024MB via ssl-enabled unix socket: real 1.220s user 1.332s sys 0.874s
I20260929 19:02:12.371150 9723 rpc-test.cc:1859] Sending 1024MB via ssl-enabled unix socket: real 1.204s user 1.369s sys 0.818s
I20260929 19:02:13.557696 9723 rpc-test.cc:1859] Sending 1024MB via ssl-enabled unix socket: real 1.186s user 1.261s sys 0.886s
I20260929 19:02:14.755304 9723 rpc-test.cc:1859] Sending 1024MB via ssl-enabled unix socket: real 1.198s user 1.186s sys 0.978s
I20260929 19:02:15.991253 9723 rpc-test.cc:1859] Sending 1024MB via ssl-enabled unix socket: real 1.236s user 1.451s sys 0.792s
[ OK ] Parameters/TestRpc.TestPerformanceBySocketType/SSL_UnixSocket (6079 ms)
[----------] 20 tests from Parameters/TestRpc (25981 ms total)
[----------] 1 test from Parameters/TestRpcSocketTxRxQueue
[ RUN ] Parameters/TestRpcSocketTxRxQueue.AcceptorRxQueueSizeMetric/0
I20260929 19:02:15.998275 10205 acceptor_pool.cc:254] collecting diagnostics on the listening RPC socket 0.0.0.0:34925 every 1 connection(s)
I20260929 19:02:15.998338 10206 acceptor_pool.cc:254] collecting diagnostics on the listening RPC socket 0.0.0.0:34925 every 1 connection(s)
W20260929 19:02:15.998883 10201 negotiation.cc:337] Failed RPC negotiation. Trace:
0929 19:02:15.998733 (+ 0us) reactor.cc:625] Submitting negotiation task for server connection from 127.0.0.1:53194 (local address 127.0.0.1:34925)
0929 19:02:15.998790 (+ 57us) server_negotiation.cc:206] Beginning negotiation
0929 19:02:15.998791 (+ 1us) server_negotiation.cc:399] Waiting for connection header
0929 19:02:15.998850 (+ 59us) negotiation.cc:327] Negotiation complete: Network error: Server connection negotiation failed: server connection from 127.0.0.1:53194: BlockingRecv error: recv got EOF from 127.0.0.1:53194 (error 108)
Metrics: {"server-negotiator.queue_time_us":16}
[ OK ] Parameters/TestRpcSocketTxRxQueue.AcceptorRxQueueSizeMetric/0 (7 ms)
[----------] 1 test from Parameters/TestRpcSocketTxRxQueue (7 ms total)
[----------] Global test environment tear-down
[==========] 21 tests from 2 test suites ran. (25989 ms total)
[ PASSED ] 20 tests.
[ FAILED ] 1 test, listed below:
[ FAILED ] Parameters/TestRpc.TestCallWithChainCertAndChainCA/SSL_UnixSocket, where GetParam() = (true, true)
1 FAILED TEST