Diagnosed failure

Parameters/TestRpc.TestCallWithChainCertAndChainCA/SSL_TCP: /data0/somelongdirectorytoavoidrpathissues/src/kudu/src/kudu/rpc/rpc-test.cc:270: Failure
Failed
Bad status: Runtime error: could not verify certificate chain (error with cert: subject=CN = localhost, ST = sadfjas, C = AS, emailAddress = sdflkdsajf, O = lskdfjlsad, OU = sldfkja, issuer=C = AS, ST = ASDfkjdhf, L = lskdjf, O = saldfja, OU = skdjf, CN = localhost, emailAddress = sadjflkadsj): : certificate has expired
Google Test trace:
/data0/somelongdirectorytoavoidrpathissues/src/kudu/src/kudu/rpc/rpc-test.cc:267: Connecting to 0.0.0.0:40619
I20260929 16:24:06.819765   383 test_util.cc:175] -----------------------------------------------
I20260929 16:24:06.819832   383 test_util.cc:176] Had fatal failures, leaving test files at /tmp/dist-test-taskXHP0TX/test-tmp/rpc-test.5.Parameters_TestRpc.TestCallWithChainCertAndChainCA_SSL_TCP.1790699046736064-383-0

Full log

Note: This is test shard 6 of 8.
[==========] Running 21 tests from 2 test suites.
[----------] Global test environment set-up.
[----------] 20 tests from Parameters/TestRpc
[ RUN      ] Parameters/TestRpc.TestMessengerCreateDestroy/SSL_TCP
WARNING: Logging before InitGoogleLogging() is written to STDERR
I20260929 16:24:06.780826   383 rpc-test.cc:169] started messenger TestCreateDestroy
[       OK ] Parameters/TestRpc.TestMessengerCreateDestroy/SSL_TCP (40 ms)
[ RUN      ] Parameters/TestRpc.TestNegotiationDeadlock/SSL_TCP
I20260929 16:24:06.796646   403 acceptor_pool.cc:254] collecting diagnostics on the listening RPC socket 0.0.0.0:43859 every 8 connection(s)
I20260929 16:24:06.796700   404 acceptor_pool.cc:254] collecting diagnostics on the listening RPC socket 0.0.0.0:43859 every 8 connection(s)
[       OK ] Parameters/TestRpc.TestNegotiationDeadlock/SSL_TCP (26 ms)
[ RUN      ] Parameters/TestRpc.TestCallWithChainCertAndChainCA/SSL_TCP
I20260929 16:24:06.814842   419 acceptor_pool.cc:254] collecting diagnostics on the listening RPC socket 0.0.0.0:40619 every 8 connection(s)
I20260929 16:24:06.814909   420 acceptor_pool.cc:254] collecting diagnostics on the listening RPC socket 0.0.0.0:40619 every 8 connection(s)
/data0/somelongdirectorytoavoidrpathissues/src/kudu/src/kudu/rpc/rpc-test.cc:270: Failure
Failed
Bad status: Runtime error: could not verify certificate chain (error with cert: subject=CN = localhost, ST = sadfjas, C = AS, emailAddress = sdflkdsajf, O = lskdfjlsad, OU = sldfkja, issuer=C = AS, ST = ASDfkjdhf, L = lskdjf, O = saldfja, OU = skdjf, CN = localhost, emailAddress = sadjflkadsj): : certificate has expired
Google Test trace:
/data0/somelongdirectorytoavoidrpathissues/src/kudu/src/kudu/rpc/rpc-test.cc:267: Connecting to 0.0.0.0:40619
I20260929 16:24:06.819765   383 test_util.cc:175] -----------------------------------------------
I20260929 16:24:06.819832   383 test_util.cc:176] Had fatal failures, leaving test files at /tmp/dist-test-taskXHP0TX/test-tmp/rpc-test.5.Parameters_TestRpc.TestCallWithChainCertAndChainCA_SSL_TCP.1790699046736064-383-0
[  FAILED  ] Parameters/TestRpc.TestCallWithChainCertAndChainCA/SSL_TCP, where GetParam() = (true, false) (10 ms)
[ RUN      ] Parameters/TestRpc.TestCallWithPasswordProtectedKey/SSL_TCP
I20260929 16:24:06.833164   444 acceptor_pool.cc:254] collecting diagnostics on the listening RPC socket 0.0.0.0:42069 every 8 connection(s)
I20260929 16:24:06.833195   445 acceptor_pool.cc:254] collecting diagnostics on the listening RPC socket 0.0.0.0:42069 every 8 connection(s)
[       OK ] Parameters/TestRpc.TestCallWithPasswordProtectedKey/SSL_TCP (28 ms)
[ RUN      ] Parameters/TestRpc.TestCallToBadServer/SSL_TCP
I20260929 16:24:06.870555   383 rpc-test.cc:394] Status: Network error: Client connection negotiation failed: client connection to 0.0.0.0:0: connect: Connection refused (error 111)
I20260929 16:24:06.871193   383 rpc-test.cc:394] Status: Network error: Client connection negotiation failed: client connection to 0.0.0.0:0: connect: Connection refused (error 111)
I20260929 16:24:06.871790   383 rpc-test.cc:394] Status: Network error: Client connection negotiation failed: client connection to 0.0.0.0:0: connect: Connection refused (error 111)
I20260929 16:24:06.872360   383 rpc-test.cc:394] Status: Network error: Client connection negotiation failed: client connection to 0.0.0.0:0: connect: Connection refused (error 111)
I20260929 16:24:06.872833   383 rpc-test.cc:394] Status: Network error: Client connection negotiation failed: client connection to 0.0.0.0:0: connect: Connection refused (error 111)
[       OK ] Parameters/TestRpc.TestCallToBadServer/SSL_TCP (25 ms)
[ RUN      ] Parameters/TestRpc.TestWrongService/SSL_TCP
I20260929 16:24:06.881552   479 acceptor_pool.cc:254] collecting diagnostics on the listening RPC socket 0.0.0.0:35703 every 8 connection(s)
I20260929 16:24:06.881610   480 acceptor_pool.cc:254] collecting diagnostics on the listening RPC socket 0.0.0.0:35703 every 8 connection(s)
I20260929 16:24:06.894253   476 messenger.cc:345] service WrongServiceName not registered on TestServer
[       OK ] Parameters/TestRpc.TestWrongService/SSL_TCP (22 ms)
[ RUN      ] Parameters/TestRpc.TestConnectionKeepalive/SSL_TCP
I20260929 16:24:06.903700   502 acceptor_pool.cc:254] collecting diagnostics on the listening RPC socket 0.0.0.0:46439 every 8 connection(s)
I20260929 16:24:06.903743   503 acceptor_pool.cc:254] collecting diagnostics on the listening RPC socket 0.0.0.0:46439 every 8 connection(s)
I20260929 16:24:06.904030   383 rpc-test.cc:488] Connecting to 0.0.0.0:46439
[       OK ] Parameters/TestRpc.TestConnectionKeepalive/SSL_TCP (1043 ms)
[ RUN      ] Parameters/TestRpc.TestClientConnectionMetrics/SSL_TCP
I20260929 16:24:07.948905   527 acceptor_pool.cc:254] collecting diagnostics on the listening RPC socket 0.0.0.0:34363 every 8 connection(s)
I20260929 16:24:07.949055   528 acceptor_pool.cc:254] collecting diagnostics on the listening RPC socket 0.0.0.0:34363 every 8 connection(s)
I20260929 16:24:07.949308   383 rpc-test.cc:569] Connecting to 0.0.0.0:34363
[       OK ] Parameters/TestRpc.TestClientConnectionMetrics/SSL_TCP (15204 ms)
[ RUN      ] Parameters/TestRpc.TestCredentialsPolicy/SSL_TCP
I20260929 16:24:23.155141   550 acceptor_pool.cc:254] collecting diagnostics on the listening RPC socket 0.0.0.0:32853 every 8 connection(s)
I20260929 16:24:23.155275   551 acceptor_pool.cc:254] collecting diagnostics on the listening RPC socket 0.0.0.0:32853 every 8 connection(s)
I20260929 16:24:23.155579   383 rpc-test.cc:700] Connecting to 0.0.0.0:32853
[       OK ] Parameters/TestRpc.TestCredentialsPolicy/SSL_TCP (48 ms)
[ RUN      ] Parameters/TestRpc.TestCallLongerThanKeepalive/SSL_TCP
I20260929 16:24:23.208272   575 acceptor_pool.cc:254] collecting diagnostics on the listening RPC socket 0.0.0.0:32873 every 8 connection(s)
I20260929 16:24:23.208309   576 acceptor_pool.cc:254] collecting diagnostics on the listening RPC socket 0.0.0.0:32873 every 8 connection(s)
I20260929 16:24:23.233780   579 rpc-test-base.h:222] got call: sleep_micros: 3000000 deferred: true
I20260929 16:24:26.234648   579 rpcz_store.cc:275] Call kudu.rpc.GenericCalculatorService.Sleep from 127.0.0.1:60598 (request call id 0) took 3000 ms. Trace:
I20260929 16:24:26.234802   579 rpcz_store.cc:276] 0929 16:24:23.233699 (+     0us) service_pool.cc:170] Inserting onto call queue
0929 16:24:23.233750 (+    51us) service_pool.cc:227] Handling call
0929 16:24:26.234628 (+3000878us) inbound_call.cc:173] Queueing success response
Metrics: {}
[       OK ] Parameters/TestRpc.TestCallLongerThanKeepalive/SSL_TCP (3044 ms)
[ RUN      ] Parameters/TestRpc.TestRpcSidecar/SSL_TCP
I20260929 16:24:26.265305   601 acceptor_pool.cc:254] collecting diagnostics on the listening RPC socket 0.0.0.0:46769 every 8 connection(s)
I20260929 16:24:26.265275   600 acceptor_pool.cc:254] collecting diagnostics on the listening RPC socket 0.0.0.0:46769 every 8 connection(s)
[       OK ] Parameters/TestRpc.TestRpcSidecar/SSL_TCP (99 ms)
[ RUN      ] Parameters/TestRpc.TestRpcSidecarLimits/SSL_TCP
I20260929 16:24:28.106930   625 acceptor_pool.cc:254] collecting diagnostics on the listening RPC socket 0.0.0.0:35495 every 8 connection(s)
I20260929 16:24:28.106947   626 acceptor_pool.cc:254] collecting diagnostics on the listening RPC socket 0.0.0.0:35495 every 8 connection(s)
W20260929 16:24:28.112054   383 serialization.cc:72] Serialized kudu.rpc_test.PushStringsRequestPB (2147483654 bytes) is larger than the maximum configured RPC message size (52428800 bytes). Sending anyway, but peer may reject the data.
W20260929 16:24:28.116209   622 connection.cc:535] server connection from 127.0.0.1:54946 recv error: Network error: RPC frame had a length of 2147483714, but we only support messages up to 52428800 bytes long.
W20260929 16:24:28.116271   622 connection.cc:158] shutting down server connection from 127.0.0.1:54946 with pending inbound data: 4/2147483714 bytes received; last active 0 ns ago: status Network error: RPC frame had a length of 2147483714, but we only support messages up to 52428800 bytes long.
W20260929 16:24:28.116572   638 connection.cc:196] Error closing socket: Network error: TlsSocket::Close: Connection reset by peer
I20260929 16:24:28.133314   650 acceptor_pool.cc:254] collecting diagnostics on the listening RPC socket 0.0.0.0:40641 every 8 connection(s)
I20260929 16:24:28.133316   651 acceptor_pool.cc:254] collecting diagnostics on the listening RPC socket 0.0.0.0:40641 every 8 connection(s)
W20260929 16:24:32.496568   647 connection.cc:577] server connection from 127.0.0.1:57580: received bad data: 'Corruption: Invalid packet: message had a length of 2147483710, but we only support messages up to 2147483647 bytes
'
[       OK ] Parameters/TestRpc.TestRpcSidecarLimits/SSL_TCP (6161 ms)
[ RUN      ] Parameters/TestRpc.TestCallTimeoutDoesntAffectNegotiation/SSL_TCP
I20260929 16:24:32.513787   675 acceptor_pool.cc:254] collecting diagnostics on the listening RPC socket 0.0.0.0:42215 every 8 connection(s)
I20260929 16:24:32.513805   676 acceptor_pool.cc:254] collecting diagnostics on the listening RPC socket 0.0.0.0:42215 every 8 connection(s)
W20260929 16:24:32.541013   671 negotiation.cc:266] Injecting 500ms delay in negotiation
I20260929 16:24:32.591387   383 rpc-test-base.h:595] status: Timed out: connection negotiation to 0.0.0.0:42215 for RPC Sleep timed out after 0.050s (ON_OUTBOUND_QUEUE), seconds elapsed: 0.0508925
[       OK ] Parameters/TestRpc.TestCallTimeoutDoesntAffectNegotiation/SSL_TCP (547 ms)
[ RUN      ] Parameters/TestRpc.TestRpcHandlerLatencyMetric/SSL_TCP
I20260929 16:24:33.059101   700 acceptor_pool.cc:254] collecting diagnostics on the listening RPC socket 0.0.0.0:42383 every 8 connection(s)
I20260929 16:24:33.059279   701 acceptor_pool.cc:254] collecting diagnostics on the listening RPC socket 0.0.0.0:42383 every 8 connection(s)
I20260929 16:24:33.097419   383 rpc-test.cc:1236] Sleep() min lat: 20391
I20260929 16:24:33.097496   383 rpc-test.cc:1237] Sleep() mean lat: 20391
I20260929 16:24:33.097525   383 rpc-test.cc:1238] Sleep() max lat: 20391
I20260929 16:24:33.097538   383 rpc-test.cc:1239] Sleep() #calls: 1
[       OK ] Parameters/TestRpc.TestRpcHandlerLatencyMetric/SSL_TCP (52 ms)
[ RUN      ] Parameters/TestRpc.TimedOutOnResponseMetricServiceQueue/SSL_TCP
I20260929 16:24:33.127668   726 acceptor_pool.cc:254] collecting diagnostics on the listening RPC socket 0.0.0.0:43595 every 8 connection(s)
I20260929 16:24:33.127707   727 acceptor_pool.cc:254] collecting diagnostics on the listening RPC socket 0.0.0.0:43595 every 8 connection(s)
W20260929 16:24:33.192333   728 rpcz_store.cc:267] Call kudu.rpc_test.CalculatorService.Sleep from 127.0.0.1:45974 (request call id 2) took 20 ms (client timeout 20 ms). Trace:
W20260929 16:24:33.192451   728 rpcz_store.cc:269] 0929 16:24:33.171848 (+     0us) service_pool.cc:170] Inserting onto call queue
0929 16:24:33.192271 (+ 20423us) service_pool.cc:214] Skipping call since client already timed out
0929 16:24:33.192309 (+    38us) inbound_call.cc:173] Queueing failure response
Metrics: {}
[       OK ] Parameters/TestRpc.TimedOutOnResponseMetricServiceQueue/SSL_TCP (94 ms)
[ RUN      ] Parameters/TestRpc.RpcPendingConnectionsMetric/SSL_TCP
I20260929 16:24:33.200073   749 acceptor_pool.cc:254] collecting diagnostics on the listening RPC socket 0.0.0.0:40845 every 8 connection(s)
I20260929 16:24:33.200166   750 acceptor_pool.cc:254] collecting diagnostics on the listening RPC socket 0.0.0.0:40845 every 8 connection(s)
W20260929 16:24:33.209388   745 negotiation.cc:337] Failed RPC negotiation. Trace:
0929 16:24:33.208754 (+     0us) reactor.cc:625] Submitting negotiation task for server connection from 127.0.0.1:47392 (local address 127.0.0.1:40845)
0929 16:24:33.208926 (+   172us) server_negotiation.cc:206] Beginning negotiation
0929 16:24:33.208930 (+     4us) server_negotiation.cc:399] Waiting for connection header
0929 16:24:33.209056 (+   126us) negotiation.cc:327] Negotiation complete: Network error: Server connection negotiation failed: server connection from 127.0.0.1:47392: BlockingRecv error: recv got EOF from 127.0.0.1:47392 (error 108)
Metrics: {"server-negotiator.queue_time_us":59}
[       OK ] Parameters/TestRpc.RpcPendingConnectionsMetric/SSL_TCP (25 ms)
[ RUN      ] Parameters/TestRpc.TestRpcContextClientDeadline/SSL_TCP
I20260929 16:24:33.234192   765 acceptor_pool.cc:254] collecting diagnostics on the listening RPC socket 0.0.0.0:35645 every 8 connection(s)
I20260929 16:24:33.234225   766 acceptor_pool.cc:254] collecting diagnostics on the listening RPC socket 0.0.0.0:35645 every 8 connection(s)
[       OK ] Parameters/TestRpc.TestRpcContextClientDeadline/SSL_TCP (57 ms)
[ RUN      ] Parameters/TestRpc.TestApplicationFeatureFlagUnsupportedServer/SSL_TCP
I20260929 16:24:33.295429   791 acceptor_pool.cc:254] collecting diagnostics on the listening RPC socket 0.0.0.0:34207 every 8 connection(s)
I20260929 16:24:33.295425   790 acceptor_pool.cc:254] collecting diagnostics on the listening RPC socket 0.0.0.0:34207 every 8 connection(s)
[       OK ] Parameters/TestRpc.TestApplicationFeatureFlagUnsupportedServer/SSL_TCP (43 ms)
[ RUN      ] Parameters/TestRpc.TestCancellationAsync/SSL_TCP
I20260929 16:24:33.333230   815 acceptor_pool.cc:254] collecting diagnostics on the listening RPC socket 0.0.0.0:33215 every 8 connection(s)
I20260929 16:24:33.333266   816 acceptor_pool.cc:254] collecting diagnostics on the listening RPC socket 0.0.0.0:33215 every 8 connection(s)
I20260929 16:24:33.333580   383 rpc-test.cc:1716] Connecting to 0.0.0.0:33215
I20260929 16:24:33.343604   383 test_util.cc:268] Using random seed: -1641377678
I20260929 16:24:33.363910   818 rpc-test-base.h:240] got call: sleep_micros: 500 pattern: 4294967295 num_repetitions: 2097152 sidecar_idx: 0
I20260929 16:24:33.383514   819 rpc-test-base.h:240] got call: sleep_micros: 500 pattern: 4294967295 num_repetitions: 2097152 sidecar_idx: 0
I20260929 16:24:33.402050   818 rpc-test-base.h:240] got call: sleep_micros: 500 pattern: 4294967295 num_repetitions: 2097152 sidecar_idx: 0
I20260929 16:24:33.419507   819 rpc-test-base.h:240] got call: sleep_micros: 500 pattern: 4294967295 num_repetitions: 2097152 sidecar_idx: 0
I20260929 16:24:33.441906   818 rpc-test-base.h:240] got call: sleep_micros: 500 pattern: 4294967295 num_repetitions: 2097152 sidecar_idx: 0
I20260929 16:24:33.459017   819 rpc-test-base.h:240] got call: sleep_micros: 500 pattern: 4294967295 num_repetitions: 2097152 sidecar_idx: 0
I20260929 16:24:33.480099   818 rpc-test-base.h:240] got call: sleep_micros: 500 pattern: 4294967295 num_repetitions: 2097152 sidecar_idx: 0
W20260929 16:24:33.485204   813 connection.cc:441] server connection from 127.0.0.1:60194 torn down before Call kudu.rpc.GenericCalculatorService.SleepWithSidecar from 127.0.0.1:60194 (request call id 8) could send its response
W20260929 16:24:33.498195   813 connection.cc:441] server connection from 127.0.0.1:60194 torn down before Call kudu.rpc.GenericCalculatorService.SleepWithSidecar from 127.0.0.1:60194 (request call id 9) could send its response
[       OK ] Parameters/TestRpc.TestCancellationAsync/SSL_TCP (179 ms)
[ RUN      ] Parameters/TestRpc.TestPerformanceBySocketType/SSL_TCP
I20260929 16:24:33.522403   840 acceptor_pool.cc:254] collecting diagnostics on the listening RPC socket 0.0.0.0:36665 every 8 connection(s)
I20260929 16:24:33.522449   841 acceptor_pool.cc:254] collecting diagnostics on the listening RPC socket 0.0.0.0:36665 every 8 connection(s)
I20260929 16:24:33.522802   383 rpc-test.cc:1846] Connecting to 0.0.0.0:36665
I20260929 16:24:35.872706   383 rpc-test.cc:1859] Sending 1024MB via ssl-enabled tcp socket: real 2.335s	user 2.426s	sys 1.649s
I20260929 16:24:38.137609   383 rpc-test.cc:1859] Sending 1024MB via ssl-enabled tcp socket: real 2.265s	user 2.244s	sys 1.754s
I20260929 16:24:40.425877   383 rpc-test.cc:1859] Sending 1024MB via ssl-enabled tcp socket: real 2.288s	user 2.394s	sys 1.625s
I20260929 16:24:42.754774   383 rpc-test.cc:1859] Sending 1024MB via ssl-enabled tcp socket: real 2.329s	user 2.400s	sys 1.695s
I20260929 16:24:45.017275   383 rpc-test.cc:1859] Sending 1024MB via ssl-enabled tcp socket: real 2.262s	user 2.304s	sys 1.661s
[       OK ] Parameters/TestRpc.TestPerformanceBySocketType/SSL_TCP (11518 ms)
[----------] 20 tests from Parameters/TestRpc (38276 ms total)

[----------] 1 test from Parameters/TestRpcSocketTxRxQueue
[ RUN      ] Parameters/TestRpcSocketTxRxQueue.OverCapacity/0
W20260929 16:24:45.300549   857 negotiation.cc:337] Failed RPC negotiation. Trace:
0929 16:24:45.030638 (+     0us) reactor.cc:625] Submitting negotiation task for client connection to 0.0.0.0:36207 (local address 127.0.0.1:49560)
0929 16:24:45.030788 (+   150us) negotiation.cc:107] Waiting for socket to connect
0929 16:24:45.030805 (+    17us) client_negotiation.cc:174] Beginning negotiation
0929 16:24:45.030917 (+   112us) client_negotiation.cc:252] Sending NEGOTIATE NegotiatePB request
0929 16:24:45.300344 (+269427us) negotiation.cc:327] Negotiation complete: Network error: Client connection negotiation failed: client connection to 0.0.0.0:36207: BlockingRecv error: recv error from unknown peer: Transport endpoint is not connected (error 107)
Metrics: {"client-negotiator.queue_time_us":50}
W20260929 16:24:45.300546   875 negotiation.cc:337] Failed RPC negotiation. Trace:
0929 16:24:45.033617 (+     0us) reactor.cc:625] Submitting negotiation task for client connection to 0.0.0.0:36207 (local address 127.0.0.1:49578)
0929 16:24:45.033762 (+   145us) negotiation.cc:107] Waiting for socket to connect
0929 16:24:45.033775 (+    13us) client_negotiation.cc:174] Beginning negotiation
0929 16:24:45.033874 (+    99us) client_negotiation.cc:252] Sending NEGOTIATE NegotiatePB request
0929 16:24:45.300419 (+266545us) negotiation.cc:327] Negotiation complete: Network error: Client connection negotiation failed: client connection to 0.0.0.0:36207: BlockingRecv error: recv error from unknown peer: Transport endpoint is not connected (error 107)
Metrics: {"client-negotiator.queue_time_us":50}
W20260929 16:24:45.300762   902 negotiation.cc:337] Failed RPC negotiation. Trace:
0929 16:24:45.037614 (+     0us) reactor.cc:625] Submitting negotiation task for client connection to 0.0.0.0:36207 (local address 127.0.0.1:49606)
0929 16:24:45.037743 (+   129us) negotiation.cc:107] Waiting for socket to connect
0929 16:24:45.037758 (+    15us) client_negotiation.cc:174] Beginning negotiation
0929 16:24:45.037841 (+    83us) client_negotiation.cc:252] Sending NEGOTIATE NegotiatePB request
0929 16:24:45.300641 (+262800us) negotiation.cc:327] Negotiation complete: Network error: Client connection negotiation failed: client connection to 0.0.0.0:36207: BlockingRecv error: recv error from unknown peer: Transport endpoint is not connected (error 107)
Metrics: {"client-negotiator.queue_time_us":45}
W20260929 16:24:45.300546   866 negotiation.cc:337] Failed RPC negotiation. Trace:
0929 16:24:45.032097 (+     0us) reactor.cc:625] Submitting negotiation task for client connection to 0.0.0.0:36207 (local address 127.0.0.1:49564)
0929 16:24:45.032231 (+   134us) negotiation.cc:107] Waiting for socket to connect
0929 16:24:45.032246 (+    15us) client_negotiation.cc:174] Beginning negotiation
0929 16:24:45.032339 (+    93us) client_negotiation.cc:252] Sending NEGOTIATE NegotiatePB request
0929 16:24:45.300447 (+268108us) negotiation.cc:327] Negotiation complete: Network error: Client connection negotiation failed: client connection to 0.0.0.0:36207: BlockingRecv error: recv error from unknown peer: Transport endpoint is not connected (error 107)
Metrics: {"client-negotiator.queue_time_us":47}
W20260929 16:24:45.300688   893 negotiation.cc:337] Failed RPC negotiation. Trace:
0929 16:24:45.036228 (+     0us) reactor.cc:625] Submitting negotiation task for client connection to 0.0.0.0:36207 (local address 127.0.0.1:49596)
0929 16:24:45.036338 (+   110us) negotiation.cc:107] Waiting for socket to connect
0929 16:24:45.036351 (+    13us) client_negotiation.cc:174] Beginning negotiation
0929 16:24:45.036428 (+    77us) client_negotiation.cc:252] Sending NEGOTIATE NegotiatePB request
0929 16:24:45.300618 (+264190us) negotiation.cc:327] Negotiation complete: Network error: Client connection negotiation failed: client connection to 0.0.0.0:36207: BlockingRecv error: recv error from unknown peer: Transport endpoint is not connected (error 107)
Metrics: {"client-negotiator.queue_time_us":47}
W20260929 16:24:45.301030   884 negotiation.cc:337] Failed RPC negotiation. Trace:
0929 16:24:45.034986 (+     0us) reactor.cc:625] Submitting negotiation task for client connection to 0.0.0.0:36207 (local address 127.0.0.1:49582)
0929 16:24:45.035148 (+   162us) negotiation.cc:107] Waiting for socket to connect
0929 16:24:45.035161 (+    13us) client_negotiation.cc:174] Beginning negotiation
0929 16:24:45.035245 (+    84us) client_negotiation.cc:252] Sending NEGOTIATE NegotiatePB request
0929 16:24:45.300756 (+265511us) negotiation.cc:327] Negotiation complete: Network error: Client connection negotiation failed: client connection to 0.0.0.0:36207: BlockingRecv error: recv error from unknown peer: Transport endpoint is not connected (error 107)
Metrics: {"client-negotiator.queue_time_us":58}
[       OK ] Parameters/TestRpcSocketTxRxQueue.OverCapacity/0 (1052 ms)
[----------] 1 test from Parameters/TestRpcSocketTxRxQueue (1052 ms total)

[----------] Global test environment tear-down
[==========] 21 tests from 2 test suites ran. (39329 ms total)
[  PASSED  ] 20 tests.
[  FAILED  ] 1 test, listed below:
[  FAILED  ] Parameters/TestRpc.TestCallWithChainCertAndChainCA/SSL_TCP, where GetParam() = (true, false)

 1 FAILED TEST