Diagnosed failure

Parameters/TestRpc.TestCallWithChainCertAndRootCA/SSL_TCP: /data0/somelongdirectorytoavoidrpathissues/src/kudu/src/kudu/rpc/rpc-test.cc:303: Failure
Failed
Bad status: Runtime error: could not verify certificate chain (error with cert: subject=CN = localhost, ST = sadfjas, C = AS, emailAddress = sdflkdsajf, O = lskdfjlsad, OU = sldfkja, issuer=C = AS, ST = ASDfkjdhf, L = lskdjf, O = saldfja, OU = skdjf, CN = localhost, emailAddress = sadjflkadsj): : certificate has expired
Google Test trace:
/data0/somelongdirectorytoavoidrpathissues/src/kudu/src/kudu/rpc/rpc-test.cc:300: Connecting to 0.0.0.0:43353
I20260927 09:59:58.414428  4045 test_util.cc:175] -----------------------------------------------
I20260927 09:59:58.414618  4045 test_util.cc:176] Had fatal failures, leaving test files at /tmp/dist-test-taskVLSQ_O/test-tmp/rpc-test.1.Parameters_TestRpc.TestCallWithChainCertAndRootCA_SSL_TCP.1790503196859032-4045-0

Full log

Note: This is test shard 2 of 8.
[==========] Running 21 tests from 2 test suites.
[----------] Global test environment set-up.
[----------] 1 test from TestRpc
[ RUN      ] TestRpc.TestMethodsByName
[       OK ] TestRpc.TestMethodsByName (6 ms)
[----------] 1 test from TestRpc (6 ms total)

[----------] 20 tests from Parameters/TestRpc
[ RUN      ] Parameters/TestRpc.TestAcceptorPoolStartStop/SSL_TCP
WARNING: Logging before InitGoogleLogging() is written to STDERR
I20260927 09:59:56.970579  4060 acceptor_pool.cc:254] collecting diagnostics on the listening RPC socket 0.0.0.0:45603 every 8 connection(s)
I20260927 09:59:56.972237  4061 acceptor_pool.cc:254] collecting diagnostics on the listening RPC socket 0.0.0.0:45603 every 8 connection(s)
W20260927 09:59:57.972888  4045 thread.cc:536] Waited for 1000ms trying to join with acceptor (tid 4061)
I20260927 09:59:58.128698  4072 acceptor_pool.cc:254] collecting diagnostics on the listening RPC socket 0.0.0.0:41923 every 8 connection(s)
I20260927 09:59:58.130180  4073 acceptor_pool.cc:254] collecting diagnostics on the listening RPC socket 0.0.0.0:41923 every 8 connection(s)
I20260927 09:59:58.148851  4083 acceptor_pool.cc:254] collecting diagnostics on the listening RPC socket 0.0.0.0:43451 every 8 connection(s)
I20260927 09:59:58.150302  4084 acceptor_pool.cc:254] collecting diagnostics on the listening RPC socket 0.0.0.0:43451 every 8 connection(s)
I20260927 09:59:58.175458  4094 acceptor_pool.cc:254] collecting diagnostics on the listening RPC socket 0.0.0.0:41539 every 8 connection(s)
I20260927 09:59:58.176149  4095 acceptor_pool.cc:254] collecting diagnostics on the listening RPC socket 0.0.0.0:41539 every 8 connection(s)
I20260927 09:59:58.223913  4105 acceptor_pool.cc:254] collecting diagnostics on the listening RPC socket 0.0.0.0:43105 every 8 connection(s)
I20260927 09:59:58.224656  4106 acceptor_pool.cc:254] collecting diagnostics on the listening RPC socket 0.0.0.0:43105 every 8 connection(s)
[       OK ] Parameters/TestRpc.TestAcceptorPoolStartStop/SSL_TCP (1311 ms)
[ RUN      ] Parameters/TestRpc.TestCall/SSL_TCP
I20260927 09:59:58.250216  4118 acceptor_pool.cc:254] collecting diagnostics on the listening RPC socket 0.0.0.0:39861 every 8 connection(s)
I20260927 09:59:58.252411  4119 acceptor_pool.cc:254] collecting diagnostics on the listening RPC socket 0.0.0.0:39861 every 8 connection(s)
I20260927 09:59:58.257295  4045 rpc-test.cc:234] Connecting to 0.0.0.0:39861
[       OK ] Parameters/TestRpc.TestCall/SSL_TCP (136 ms)
[ RUN      ] Parameters/TestRpc.TestCallWithChainCertAndRootCA/SSL_TCP
I20260927 09:59:58.393132  4143 acceptor_pool.cc:254] collecting diagnostics on the listening RPC socket 0.0.0.0:43353 every 8 connection(s)
I20260927 09:59:58.393862  4144 acceptor_pool.cc:254] collecting diagnostics on the listening RPC socket 0.0.0.0:43353 every 8 connection(s)
/data0/somelongdirectorytoavoidrpathissues/src/kudu/src/kudu/rpc/rpc-test.cc:303: Failure
Failed
Bad status: Runtime error: could not verify certificate chain (error with cert: subject=CN = localhost, ST = sadfjas, C = AS, emailAddress = sdflkdsajf, O = lskdfjlsad, OU = sldfkja, issuer=C = AS, ST = ASDfkjdhf, L = lskdjf, O = saldfja, OU = skdjf, CN = localhost, emailAddress = sadjflkadsj): : certificate has expired
Google Test trace:
/data0/somelongdirectorytoavoidrpathissues/src/kudu/src/kudu/rpc/rpc-test.cc:300: Connecting to 0.0.0.0:43353
I20260927 09:59:58.414428  4045 test_util.cc:175] -----------------------------------------------
I20260927 09:59:58.414618  4045 test_util.cc:176] Had fatal failures, leaving test files at /tmp/dist-test-taskVLSQ_O/test-tmp/rpc-test.1.Parameters_TestRpc.TestCallWithChainCertAndRootCA_SSL_TCP.1790503196859032-4045-0
[  FAILED  ] Parameters/TestRpc.TestCallWithChainCertAndRootCA/SSL_TCP, where GetParam() = (true, false) (49 ms)
[ RUN      ] Parameters/TestRpc.TestCallWithBadPasswordProtectedKey/SSL_TCP
[       OK ] Parameters/TestRpc.TestCallWithBadPasswordProtectedKey/SSL_TCP (32 ms)
[ RUN      ] Parameters/TestRpc.TestInvalidMethodCall/SSL_TCP
I20260927 09:59:58.466825  4180 acceptor_pool.cc:254] collecting diagnostics on the listening RPC socket 0.0.0.0:44141 every 8 connection(s)
I20260927 09:59:58.467659  4181 acceptor_pool.cc:254] collecting diagnostics on the listening RPC socket 0.0.0.0:44141 every 8 connection(s)
I20260927 09:59:58.470984  4045 rpc-test.cc:406] Connecting to 0.0.0.0:44141
[       OK ] Parameters/TestRpc.TestInvalidMethodCall/SSL_TCP (54 ms)
[ RUN      ] Parameters/TestRpc.TestHighFDs/SSL_TCP
I20260927 09:59:58.747726  4205 acceptor_pool.cc:254] collecting diagnostics on the listening RPC socket 0.0.0.0:38331 every 8 connection(s)
I20260927 09:59:58.748509  4206 acceptor_pool.cc:254] collecting diagnostics on the listening RPC socket 0.0.0.0:38331 every 8 connection(s)
[       OK ] Parameters/TestRpc.TestHighFDs/SSL_TCP (304 ms)
[ RUN      ] Parameters/TestRpc.TestConnectionAlwaysKeepalive/SSL_TCP
I20260927 09:59:58.841137  4228 acceptor_pool.cc:254] collecting diagnostics on the listening RPC socket 0.0.0.0:38557 every 8 connection(s)
I20260927 09:59:58.841903  4229 acceptor_pool.cc:254] collecting diagnostics on the listening RPC socket 0.0.0.0:38557 every 8 connection(s)
I20260927 09:59:58.845096  4045 rpc-test.cc:532] Connecting to 0.0.0.0:38557
[       OK ] Parameters/TestRpc.TestConnectionAlwaysKeepalive/SSL_TCP (3084 ms)
[ RUN      ] Parameters/TestRpc.TestReopenOutboundConnections/SSL_TCP
I20260927 10:00:01.913822  4251 acceptor_pool.cc:254] collecting diagnostics on the listening RPC socket 0.0.0.0:41903 every 8 connection(s)
I20260927 10:00:01.914561  4252 acceptor_pool.cc:254] collecting diagnostics on the listening RPC socket 0.0.0.0:41903 every 8 connection(s)
I20260927 10:00:01.917862  4045 rpc-test.cc:658] Connecting to 0.0.0.0:41903
[       OK ] Parameters/TestRpc.TestReopenOutboundConnections/SSL_TCP (407 ms)
[ RUN      ] Parameters/TestRpc.TestConnectionNetworkPlane/SSL_TCP
I20260927 10:00:02.345920  4274 acceptor_pool.cc:254] collecting diagnostics on the listening RPC socket 0.0.0.0:45163 every 8 connection(s)
I20260927 10:00:02.346639  4275 acceptor_pool.cc:254] collecting diagnostics on the listening RPC socket 0.0.0.0:45163 every 8 connection(s)
I20260927 10:00:02.349733  4045 rpc-test.cc:772] Connecting to 0.0.0.0:45163
[       OK ] Parameters/TestRpc.TestConnectionNetworkPlane/SSL_TCP (103 ms)
[ RUN      ] Parameters/TestRpc.TestTCPKeepalive/SSL_TCP
I20260927 10:00:02.432193  4299 acceptor_pool.cc:254] collecting diagnostics on the listening RPC socket 0.0.0.0:39599 every 8 connection(s)
I20260927 10:00:02.432961  4300 acceptor_pool.cc:254] collecting diagnostics on the listening RPC socket 0.0.0.0:39599 every 8 connection(s)
I20260927 10:00:02.463997  4303 rpc-test-base.h:222] got call: sleep_micros: 8000000 deferred: true
I20260927 10:00:10.468281  4303 rpcz_store.cc:275] Call kudu.rpc.GenericCalculatorService.Sleep from 127.0.0.1:60728 (request call id 0) took 8004 ms. Trace:
I20260927 10:00:10.468737  4303 rpcz_store.cc:276] 0927 10:00:02.463717 (+     0us) service_pool.cc:170] Inserting onto call queue
0927 10:00:02.463833 (+   116us) service_pool.cc:227] Handling call
0927 10:00:10.468064 (+8004231us) inbound_call.cc:173] Queueing success response
Metrics: {}
[       OK ] Parameters/TestRpc.TestTCPKeepalive/SSL_TCP (8079 ms)
[ RUN      ] Parameters/TestRpc.TestMaxSmallSidecars/SSL_TCP
I20260927 10:00:10.523360  4325 acceptor_pool.cc:254] collecting diagnostics on the listening RPC socket 0.0.0.0:35975 every 8 connection(s)
I20260927 10:00:10.524096  4326 acceptor_pool.cc:254] collecting diagnostics on the listening RPC socket 0.0.0.0:35975 every 8 connection(s)
[       OK ] Parameters/TestRpc.TestMaxSmallSidecars/SSL_TCP (214 ms)
[ RUN      ] Parameters/TestRpc.TestCallTimeout/SSL_TCP
I20260927 10:00:10.728884  4350 acceptor_pool.cc:254] collecting diagnostics on the listening RPC socket 0.0.0.0:39013 every 8 connection(s)
I20260927 10:00:10.729595  4351 acceptor_pool.cc:254] collecting diagnostics on the listening RPC socket 0.0.0.0:39013 every 8 connection(s)
I20260927 10:00:10.750402  4045 rpc-test-base.h:595] status: Timed out: connection negotiation to 0.0.0.0:39013 for RPC Sleep timed out after 0.000s (ON_OUTBOUND_QUEUE), seconds elapsed: 0.00256541
I20260927 10:00:10.758826  4354 rpc-test-base.h:222] got call: sleep_micros: 700000
I20260927 10:00:10.951371  4045 rpc-test-base.h:595] status: Timed out: Sleep RPC to 0.0.0.0:39013 timed out after 0.200s (SENT), seconds elapsed: 0.200613
I20260927 10:00:10.952895  4353 rpc-test-base.h:222] got call: sleep_micros: 2000000
W20260927 10:00:11.459519  4354 rpcz_store.cc:267] Call kudu.rpc.GenericCalculatorService.Sleep from 127.0.0.1:38212 (request call id 1) took 700 ms (client timeout 200 ms). Trace:
W20260927 10:00:11.459851  4354 rpcz_store.cc:269] 0927 10:00:10.758591 (+     0us) service_pool.cc:170] Inserting onto call queue
0927 10:00:10.758757 (+   166us) service_pool.cc:227] Handling call
0927 10:00:11.459438 (+700681us) inbound_call.cc:173] Queueing success response
Metrics: {}
I20260927 10:00:12.454082  4045 rpc-test-base.h:595] status: Timed out: Sleep RPC to 0.0.0.0:39013 timed out after 1.500s (SENT), seconds elapsed: 1.50231
W20260927 10:00:12.953415  4353 rpcz_store.cc:267] Call kudu.rpc.GenericCalculatorService.Sleep from 127.0.0.1:38212 (request call id 2) took 2000 ms (client timeout 1500 ms). Trace:
W20260927 10:00:12.953732  4353 rpcz_store.cc:269] 0927 10:00:10.952600 (+     0us) service_pool.cc:170] Inserting onto call queue
0927 10:00:10.952740 (+   140us) service_pool.cc:227] Handling call
0927 10:00:12.953365 (+2000625us) inbound_call.cc:173] Queueing success response
Metrics: {}
W20260927 10:00:12.954429  4349 connection.cc:441] server connection from 127.0.0.1:38212 torn down before Call kudu.rpc.GenericCalculatorService.Sleep from 127.0.0.1:38212 (request call id 2) could send its response
[       OK ] Parameters/TestRpc.TestCallTimeout/SSL_TCP (2261 ms)
[ RUN      ] Parameters/TestRpc.TestServerShutsDown/SSL_TCP
I20260927 10:00:12.961982  4045 rpc-test.cc:1125] Connecting to 0.0.0.0:39813
W20260927 10:00:12.972128  4367 negotiation.cc:337] Failed RPC negotiation. Trace:
0927 10:00:12.970501 (+     0us) reactor.cc:625] Submitting negotiation task for client connection to 0.0.0.0:39813 (local address 127.0.0.1:35356)
0927 10:00:12.970974 (+   473us) negotiation.cc:107] Waiting for socket to connect
0927 10:00:12.971004 (+    30us) client_negotiation.cc:174] Beginning negotiation
0927 10:00:12.971235 (+   231us) client_negotiation.cc:252] Sending NEGOTIATE NegotiatePB request
0927 10:00:12.971544 (+   309us) negotiation.cc:327] Negotiation complete: Network error: Client connection negotiation failed: client connection to 0.0.0.0:39813: BlockingWrite error: write error: Broken pipe (error 32)
Metrics: {"client-negotiator.queue_time_us":131}
[       OK ] Parameters/TestRpc.TestServerShutsDown/SSL_TCP (14 ms)
[ RUN      ] Parameters/TestRpc.TimedOutOnResponseMetric/SSL_TCP
I20260927 10:00:12.995882  4384 acceptor_pool.cc:254] collecting diagnostics on the listening RPC socket 0.0.0.0:37985 every 8 connection(s)
I20260927 10:00:12.996637  4385 acceptor_pool.cc:254] collecting diagnostics on the listening RPC socket 0.0.0.0:37985 every 8 connection(s)
W20260927 10:00:13.231051  4388 rpcz_store.cc:267] Call kudu.rpc_test.CalculatorService.Sleep from 127.0.0.1:43416 (request call id 3) took 50 ms (client timeout 25 ms). Trace:
W20260927 10:00:13.231427  4388 rpcz_store.cc:269] 0927 10:00:13.180423 (+     0us) service_pool.cc:170] Inserting onto call queue
0927 10:00:13.180583 (+   160us) service_pool.cc:227] Handling call
0927 10:00:13.230979 (+ 50396us) inbound_call.cc:173] Queueing success response
Related trace 'test_child':
Metrics: {"test_sleep_us":50000,"child_traces":[["test_child",{"related_trace_metric":1}]]}
W20260927 10:00:13.290743  4388 rpcz_store.cc:267] Call kudu.rpc_test.CalculatorService.Sleep from 127.0.0.1:43416 (request call id 4) took 50 ms (client timeout 50 ms). Trace:
W20260927 10:00:13.291168  4388 rpcz_store.cc:269] 0927 10:00:13.240151 (+     0us) service_pool.cc:170] Inserting onto call queue
0927 10:00:13.240304 (+   153us) service_pool.cc:227] Handling call
0927 10:00:13.290683 (+ 50379us) inbound_call.cc:173] Queueing success response
Related trace 'test_child':
Metrics: {"test_sleep_us":50000,"child_traces":[["test_child",{"related_trace_metric":1}]]}
[       OK ] Parameters/TestRpc.TimedOutOnResponseMetric/SSL_TCP (324 ms)
[ RUN      ] Parameters/TestRpc.AcceptorDispatchingTimesMetric/SSL_TCP
I20260927 10:00:13.311473  4409 acceptor_pool.cc:254] collecting diagnostics on the listening RPC socket 0.0.0.0:33125 every 8 connection(s)
I20260927 10:00:13.312167  4410 acceptor_pool.cc:254] collecting diagnostics on the listening RPC socket 0.0.0.0:33125 every 8 connection(s)
W20260927 10:00:13.317916  4405 negotiation.cc:337] Failed RPC negotiation. Trace:
0927 10:00:13.315866 (+     0us) reactor.cc:625] Submitting negotiation task for server connection from 127.0.0.1:47230 (local address 127.0.0.1:33125)
0927 10:00:13.316449 (+   583us) server_negotiation.cc:206] Beginning negotiation
0927 10:00:13.316485 (+    36us) server_negotiation.cc:399] Waiting for connection header
0927 10:00:13.316861 (+   376us) negotiation.cc:327] Negotiation complete: Network error: Server connection negotiation failed: server connection from 127.0.0.1:47230: BlockingRecv error: recv got EOF from 127.0.0.1:47230 (error 108)
Metrics: {"server-negotiator.queue_time_us":173}
[       OK ] Parameters/TestRpc.AcceptorDispatchingTimesMetric/SSL_TCP (21 ms)
[ RUN      ] Parameters/TestRpc.TestRpcCallbackDestroysMessenger/SSL_TCP
[       OK ] Parameters/TestRpc.TestRpcCallbackDestroysMessenger/SSL_TCP (20 ms)
[ RUN      ] Parameters/TestRpc.TestApplicationFeatureFlag/SSL_TCP
I20260927 10:00:13.364979  4434 acceptor_pool.cc:254] collecting diagnostics on the listening RPC socket 0.0.0.0:42893 every 8 connection(s)
I20260927 10:00:13.365684  4435 acceptor_pool.cc:254] collecting diagnostics on the listening RPC socket 0.0.0.0:42893 every 8 connection(s)
W20260927 10:00:13.413184  4433 messenger.cc:357] Unable to handle RPC call: Not implemented: call requires unsupported application feature flags: 99
[       OK ] Parameters/TestRpc.TestApplicationFeatureFlag/SSL_TCP (79 ms)
[ RUN      ] Parameters/TestRpc.TestCancellation/SSL_TCP
I20260927 10:00:13.439442  4459 acceptor_pool.cc:254] collecting diagnostics on the listening RPC socket 0.0.0.0:41189 every 8 connection(s)
I20260927 10:00:13.440136  4460 acceptor_pool.cc:254] collecting diagnostics on the listening RPC socket 0.0.0.0:41189 every 8 connection(s)
I20260927 10:00:13.443233  4045 rpc-test.cc:1648] Connecting to 0.0.0.0:41189
I20260927 10:00:13.564174  4045 rpc-test-base.h:595] status: Aborted: Sleep RPC to 0.0.0.0:41189 is cancelled in state READY, seconds elapsed: 0.000444048
I20260927 10:00:13.741171  4045 rpc-test-base.h:595] status: Aborted: Sleep RPC to 0.0.0.0:41189 is cancelled in state SENT, seconds elapsed: 0.00155006
I20260927 10:00:13.772621  4462 rpc-test-base.h:222] got call: sleep_micros: 510000
I20260927 10:00:13.918844  4045 rpc-test-base.h:595] status: Aborted: Sleep RPC to 0.0.0.0:41189 is cancelled in state SENT, seconds elapsed: 0.000921424
I20260927 10:00:13.959528  4461 rpc-test-base.h:222] got call: sleep_micros: 510000
I20260927 10:00:14.080938  4045 rpc-test-base.h:595] status: Aborted: Sleep RPC to 0.0.0.0:41189 is cancelled in state SENT, seconds elapsed: 0.000834318
W20260927 10:00:14.120081  4463 rpcz_store.cc:267] Call kudu.rpc.GenericCalculatorService.Sleep from 127.0.0.1:44154 (request call id 11) took 14 ms (client timeout 10 ms). Trace:
W20260927 10:00:14.120388  4463 rpcz_store.cc:269] 0927 10:00:14.105062 (+     0us) service_pool.cc:170] Inserting onto call queue
0927 10:00:14.119789 (+ 14727us) service_pool.cc:214] Skipping call since client already timed out
0927 10:00:14.119902 (+   113us) inbound_call.cc:173] Queueing failure response
Metrics: {}
I20260927 10:00:14.120960  4463 rpc-test-base.h:222] got call: sleep_micros: 1500000
W20260927 10:00:14.283401  4462 rpcz_store.cc:267] Call kudu.rpc.GenericCalculatorService.Sleep from 127.0.0.1:44154 (request call id 3) took 511 ms (client timeout 10 ms). Trace:
W20260927 10:00:14.283736  4462 rpcz_store.cc:269] 0927 10:00:13.772382 (+     0us) service_pool.cc:170] Inserting onto call queue
0927 10:00:13.772545 (+   163us) service_pool.cc:227] Handling call
0927 10:00:14.283350 (+510805us) inbound_call.cc:173] Queueing success response
Metrics: {}
W20260927 10:00:14.470218  4461 rpcz_store.cc:267] Call kudu.rpc.GenericCalculatorService.Sleep from 127.0.0.1:44154 (request call id 7) took 514 ms (client timeout 10 ms). Trace:
W20260927 10:00:14.470574  4461 rpcz_store.cc:269] 0927 10:00:13.955721 (+     0us) service_pool.cc:170] Inserting onto call queue
0927 10:00:13.959470 (+  3749us) service_pool.cc:227] Handling call
0927 10:00:14.470166 (+510696us) inbound_call.cc:173] Queueing success response
Metrics: {}
I20260927 10:00:15.082805  4045 rpc-test-base.h:595] status: Timed out: Sleep RPC to 0.0.0.0:41189 timed out after 1.000s (SENT), seconds elapsed: 1.00148
I20260927 10:00:15.084156  4461 rpc-test-base.h:222] got call: sleep_micros: 1500000
W20260927 10:00:15.621438  4463 rpcz_store.cc:267] Call kudu.rpc.GenericCalculatorService.Sleep from 127.0.0.1:44154 (request call id 12) took 1516 ms (client timeout 1000 ms). Trace:
W20260927 10:00:15.621776  4463 rpcz_store.cc:269] 0927 10:00:14.105400 (+     0us) service_pool.cc:170] Inserting onto call queue
0927 10:00:14.120928 (+ 15528us) service_pool.cc:227] Handling call
0927 10:00:15.621391 (+1500463us) inbound_call.cc:173] Queueing success response
Metrics: {}
I20260927 10:00:16.084467  4045 rpc-test-base.h:595] status: Timed out: Sleep RPC to 0.0.0.0:41189 timed out after 1.000s (SENT), seconds elapsed: 1.00136
W20260927 10:00:16.085897  4456 messenger.cc:357] Unable to handle RPC call: Not implemented: call requires unsupported application feature flags: 99, 1
W20260927 10:00:16.087546  4456 messenger.cc:357] Unable to handle RPC call: Not implemented: call requires unsupported application feature flags: 99, 1
W20260927 10:00:16.584749  4461 rpcz_store.cc:267] Call kudu.rpc.GenericCalculatorService.Sleep from 127.0.0.1:44154 (request call id 13) took 1500 ms (client timeout 1000 ms). Trace:
W20260927 10:00:16.585155  4461 rpcz_store.cc:269] 0927 10:00:15.083920 (+     0us) service_pool.cc:170] Inserting onto call queue
0927 10:00:15.084108 (+   188us) service_pool.cc:227] Handling call
0927 10:00:16.584698 (+1500590us) inbound_call.cc:173] Queueing success response
Metrics: {}
W20260927 10:00:16.585791  4456 connection.cc:441] server connection from 127.0.0.1:44154 torn down before Call kudu.rpc.GenericCalculatorService.Sleep from 127.0.0.1:44154 (request call id 13) could send its response
[       OK ] Parameters/TestRpc.TestCancellation/SSL_TCP (3170 ms)
[ RUN      ] Parameters/TestRpc.TestCancellationMultiThreads/SSL_TCP
I20260927 10:00:16.626973  4484 acceptor_pool.cc:254] collecting diagnostics on the listening RPC socket 0.0.0.0:45139 every 8 connection(s)
I20260927 10:00:16.627771  4485 acceptor_pool.cc:254] collecting diagnostics on the listening RPC socket 0.0.0.0:45139 every 8 connection(s)
I20260927 10:00:16.630900  4045 rpc-test.cc:1808] Connecting to 0.0.0.0:45139
I20260927 10:00:16.793196  4498 test_util.cc:268] Using random seed: 70567503
I20260927 10:00:16.794309  4499 test_util.cc:268] Using random seed: 70568623
I20260927 10:00:16.795680  4500 test_util.cc:268] Using random seed: 70569993
I20260927 10:00:16.797405  4501 test_util.cc:268] Using random seed: 70571703
I20260927 10:00:16.798775  4502 test_util.cc:268] Using random seed: 70572993
I20260927 10:00:16.800455  4503 test_util.cc:268] Using random seed: 70574615
I20260927 10:00:16.801815  4504 test_util.cc:268] Using random seed: 70575998
I20260927 10:00:16.803926  4505 test_util.cc:268] Using random seed: 70578088
I20260927 10:00:16.805284  4506 test_util.cc:268] Using random seed: 70579471
I20260927 10:00:16.806869  4507 test_util.cc:268] Using random seed: 70581030
I20260927 10:00:16.808240  4508 test_util.cc:268] Using random seed: 70582415
I20260927 10:00:16.809877  4509 test_util.cc:268] Using random seed: 70584011
I20260927 10:00:16.811712  4510 test_util.cc:268] Using random seed: 70585847
I20260927 10:00:16.813651  4511 test_util.cc:268] Using random seed: 70587720
I20260927 10:00:16.815454  4512 test_util.cc:268] Using random seed: 70589575
I20260927 10:00:16.817366  4513 test_util.cc:268] Using random seed: 70591482
I20260927 10:00:16.819283  4514 test_util.cc:268] Using random seed: 70593409
I20260927 10:00:16.821169  4515 test_util.cc:268] Using random seed: 70595290
I20260927 10:00:16.824378  4516 test_util.cc:268] Using random seed: 70597819
I20260927 10:00:16.827652  4517 test_util.cc:268] Using random seed: 70601824
I20260927 10:00:16.829430  4518 test_util.cc:268] Using random seed: 70603579
I20260927 10:00:16.830979  4519 test_util.cc:268] Using random seed: 70605150
I20260927 10:00:16.832738  4520 test_util.cc:268] Using random seed: 70606862
I20260927 10:00:16.834770  4521 test_util.cc:268] Using random seed: 70608920
I20260927 10:00:16.836336  4522 test_util.cc:268] Using random seed: 70610518
I20260927 10:00:16.838104  4523 test_util.cc:268] Using random seed: 70612284
I20260927 10:00:16.839768  4524 test_util.cc:268] Using random seed: 70613888
I20260927 10:00:16.841331  4525 test_util.cc:268] Using random seed: 70615495
I20260927 10:00:16.844063  4526 test_util.cc:268] Using random seed: 70618222
I20260927 10:00:16.845700  4527 test_util.cc:268] Using random seed: 70619841
[       OK ] Parameters/TestRpc.TestCancellationMultiThreads/SSL_TCP (17991 ms)
[ RUN      ] Parameters/TestRpc.TestCallId/SSL_TCP
I20260927 10:00:34.604951  4541 acceptor_pool.cc:254] collecting diagnostics on the listening RPC socket 0.0.0.0:39451 every 8 connection(s)
I20260927 10:00:34.605777  4542 acceptor_pool.cc:254] collecting diagnostics on the listening RPC socket 0.0.0.0:39451 every 8 connection(s)
[       OK ] Parameters/TestRpc.TestCallId/SSL_TCP (79 ms)
[----------] 20 tests from Parameters/TestRpc (37746 ms total)

[----------] Global test environment tear-down
[==========] 21 tests from 2 test suites ran. (37753 ms total)
[  PASSED  ] 20 tests.
[  FAILED  ] 1 test, listed below:
[  FAILED  ] Parameters/TestRpc.TestCallWithChainCertAndRootCA/SSL_TCP, where GetParam() = (true, false)

 1 FAILED TEST