Diagnosed failure
Parameters/TestRpc.TestCallWithChainCertAndChainCA/SSL_UnixSocket: /data0/somelongdirectorytoavoidrpathissues/src/kudu/src/kudu/rpc/rpc-test.cc:270: Failure
Failed
Bad status: Runtime error: could not verify certificate chain (error with cert: subject=CN = localhost, ST = sadfjas, C = AS, emailAddress = sdflkdsajf, O = lskdfjlsad, OU = sldfkja, issuer=C = AS, ST = ASDfkjdhf, L = lskdjf, O = saldfja, OU = skdjf, CN = localhost, emailAddress = sadjflkadsj): : certificate has expired
Google Test trace:
/data0/somelongdirectorytoavoidrpathissues/src/kudu/src/kudu/rpc/rpc-test.cc:267: Connecting to unix:/tmp/dist-test-taskOT3fhM/test-tmp/rpc-test-50a5c032165c43fe94d5568b481a3344.sock
I20260928 11:49:07.512463 810 test_util.cc:175] -----------------------------------------------
I20260928 11:49:07.512639 810 test_util.cc:176] Had fatal failures, leaving test files at /tmp/dist-test-taskOT3fhM/test-tmp/rpc-test.6.Parameters_TestRpc.TestCallWithChainCertAndChainCA_SSL_UnixSocket.1790596146059230-810-0
Full log
Note: This is test shard 7 of 8.
[==========] Running 21 tests from 2 test suites.
[----------] Global test environment set-up.
[----------] 20 tests from Parameters/TestRpc
[ RUN ] Parameters/TestRpc.TestMessengerCreateDestroy/SSL_UnixSocket
WARNING: Logging before InitGoogleLogging() is written to STDERR
I20260928 11:49:06.171293 810 rpc-test.cc:169] started messenger TestCreateDestroy
[ OK ] Parameters/TestRpc.TestMessengerCreateDestroy/SSL_UnixSocket (1249 ms)
[ RUN ] Parameters/TestRpc.TestNegotiationDeadlock/SSL_UnixSocket
I20260928 11:49:07.398953 832 acceptor_pool.cc:254] collecting diagnostics on the listening RPC socket unix:/tmp/dist-test-taskOT3fhM/test-tmp/rpc-test-dd7a49e38f374e7aa6d27515c428f424.sock every 8 connection(s)
I20260928 11:49:07.400733 833 acceptor_pool.cc:254] collecting diagnostics on the listening RPC socket unix:/tmp/dist-test-taskOT3fhM/test-tmp/rpc-test-dd7a49e38f374e7aa6d27515c428f424.sock every 8 connection(s)
[ OK ] Parameters/TestRpc.TestNegotiationDeadlock/SSL_UnixSocket (94 ms)
[ RUN ] Parameters/TestRpc.TestCallWithChainCertAndChainCA/SSL_UnixSocket
I20260928 11:49:07.482105 848 acceptor_pool.cc:254] collecting diagnostics on the listening RPC socket unix:/tmp/dist-test-taskOT3fhM/test-tmp/rpc-test-50a5c032165c43fe94d5568b481a3344.sock every 8 connection(s)
I20260928 11:49:07.484342 849 acceptor_pool.cc:254] collecting diagnostics on the listening RPC socket unix:/tmp/dist-test-taskOT3fhM/test-tmp/rpc-test-50a5c032165c43fe94d5568b481a3344.sock every 8 connection(s)
/data0/somelongdirectorytoavoidrpathissues/src/kudu/src/kudu/rpc/rpc-test.cc:270: Failure
Failed
Bad status: Runtime error: could not verify certificate chain (error with cert: subject=CN = localhost, ST = sadfjas, C = AS, emailAddress = sdflkdsajf, O = lskdfjlsad, OU = sldfkja, issuer=C = AS, ST = ASDfkjdhf, L = lskdjf, O = saldfja, OU = skdjf, CN = localhost, emailAddress = sadjflkadsj): : certificate has expired
Google Test trace:
/data0/somelongdirectorytoavoidrpathissues/src/kudu/src/kudu/rpc/rpc-test.cc:267: Connecting to unix:/tmp/dist-test-taskOT3fhM/test-tmp/rpc-test-50a5c032165c43fe94d5568b481a3344.sock
I20260928 11:49:07.512463 810 test_util.cc:175] -----------------------------------------------
I20260928 11:49:07.512639 810 test_util.cc:176] Had fatal failures, leaving test files at /tmp/dist-test-taskOT3fhM/test-tmp/rpc-test.6.Parameters_TestRpc.TestCallWithChainCertAndChainCA_SSL_UnixSocket.1790596146059230-810-0
[ FAILED ] Parameters/TestRpc.TestCallWithChainCertAndChainCA/SSL_UnixSocket, where GetParam() = (true, true) (55 ms)
[ RUN ] Parameters/TestRpc.TestCallWithPasswordProtectedKey/SSL_UnixSocket
I20260928 11:49:07.547178 873 acceptor_pool.cc:254] collecting diagnostics on the listening RPC socket unix:/tmp/dist-test-taskOT3fhM/test-tmp/rpc-test-ebd5886beae148429969fc5156071259.sock every 8 connection(s)
I20260928 11:49:07.548038 874 acceptor_pool.cc:254] collecting diagnostics on the listening RPC socket unix:/tmp/dist-test-taskOT3fhM/test-tmp/rpc-test-ebd5886beae148429969fc5156071259.sock every 8 connection(s)
W20260928 11:49:07.595319 870 connection.cc:196] Error closing socket: Network error: TlsSocket::Close: Broken pipe
[ OK ] Parameters/TestRpc.TestCallWithPasswordProtectedKey/SSL_UnixSocket (89 ms)
[ RUN ] Parameters/TestRpc.TestCallToBadServer/SSL_UnixSocket
I20260928 11:49:07.624051 810 rpc-test.cc:394] Status: Network error: Client connection negotiation failed: client connection to 0.0.0.0:0: connect: Connection refused (error 111)
I20260928 11:49:07.625541 810 rpc-test.cc:394] Status: Network error: Client connection negotiation failed: client connection to 0.0.0.0:0: connect: Connection refused (error 111)
I20260928 11:49:07.626945 810 rpc-test.cc:394] Status: Network error: Client connection negotiation failed: client connection to 0.0.0.0:0: connect: Connection refused (error 111)
I20260928 11:49:07.628446 810 rpc-test.cc:394] Status: Network error: Client connection negotiation failed: client connection to 0.0.0.0:0: connect: Connection refused (error 111)
I20260928 11:49:07.629984 810 rpc-test.cc:394] Status: Network error: Client connection negotiation failed: client connection to 0.0.0.0:0: connect: Connection refused (error 111)
[ OK ] Parameters/TestRpc.TestCallToBadServer/SSL_UnixSocket (30 ms)
[ RUN ] Parameters/TestRpc.TestWrongService/SSL_UnixSocket
I20260928 11:49:07.664429 908 acceptor_pool.cc:254] collecting diagnostics on the listening RPC socket unix:/tmp/dist-test-taskOT3fhM/test-tmp/rpc-test-509e176e36b9411cbf95028a670ceb6d.sock every 8 connection(s)
I20260928 11:49:07.665367 909 acceptor_pool.cc:254] collecting diagnostics on the listening RPC socket unix:/tmp/dist-test-taskOT3fhM/test-tmp/rpc-test-509e176e36b9411cbf95028a670ceb6d.sock every 8 connection(s)
I20260928 11:49:07.695514 905 messenger.cc:345] service WrongServiceName not registered on TestServer
[ OK ] Parameters/TestRpc.TestWrongService/SSL_UnixSocket (74 ms)
[ RUN ] Parameters/TestRpc.TestConnectionKeepalive/SSL_UnixSocket
I20260928 11:49:07.726651 931 acceptor_pool.cc:254] collecting diagnostics on the listening RPC socket unix:/tmp/dist-test-taskOT3fhM/test-tmp/rpc-test-70ab218050484113bba1e0e49427c79b.sock every 8 connection(s)
I20260928 11:49:07.727463 932 acceptor_pool.cc:254] collecting diagnostics on the listening RPC socket unix:/tmp/dist-test-taskOT3fhM/test-tmp/rpc-test-70ab218050484113bba1e0e49427c79b.sock every 8 connection(s)
I20260928 11:49:07.731098 810 rpc-test.cc:488] Connecting to unix:/tmp/dist-test-taskOT3fhM/test-tmp/rpc-test-70ab218050484113bba1e0e49427c79b.sock
W20260928 11:49:08.211077 944 connection.cc:196] Error closing socket: Network error: TlsSocket::Close: Broken pipe
[ OK ] Parameters/TestRpc.TestConnectionKeepalive/SSL_UnixSocket (1091 ms)
[ RUN ] Parameters/TestRpc.TestClientConnectionMetrics/SSL_UnixSocket
I20260928 11:49:08.837081 956 acceptor_pool.cc:254] collecting diagnostics on the listening RPC socket unix:/tmp/dist-test-taskOT3fhM/test-tmp/rpc-test-3cf2e4e0450c40f9a23d7e2f1630b4d4.sock every 8 connection(s)
I20260928 11:49:08.837958 957 acceptor_pool.cc:254] collecting diagnostics on the listening RPC socket unix:/tmp/dist-test-taskOT3fhM/test-tmp/rpc-test-3cf2e4e0450c40f9a23d7e2f1630b4d4.sock every 8 connection(s)
I20260928 11:49:08.841549 810 rpc-test.cc:569] Connecting to unix:/tmp/dist-test-taskOT3fhM/test-tmp/rpc-test-3cf2e4e0450c40f9a23d7e2f1630b4d4.sock
W20260928 11:51:35.625964 953 connection.cc:196] Error closing socket: Network error: TlsSocket::Close: Broken pipe
[ OK ] Parameters/TestRpc.TestClientConnectionMetrics/SSL_UnixSocket (146834 ms)
[ RUN ] Parameters/TestRpc.TestCredentialsPolicy/SSL_UnixSocket
I20260928 11:51:35.666265 993 acceptor_pool.cc:254] collecting diagnostics on the listening RPC socket unix:/tmp/dist-test-taskOT3fhM/test-tmp/rpc-test-cc2c13b0b04e41269acfa5334fe47ec5.sock every 8 connection(s)
I20260928 11:51:35.667114 994 acceptor_pool.cc:254] collecting diagnostics on the listening RPC socket unix:/tmp/dist-test-taskOT3fhM/test-tmp/rpc-test-cc2c13b0b04e41269acfa5334fe47ec5.sock every 8 connection(s)
I20260928 11:51:35.670477 810 rpc-test.cc:700] Connecting to unix:/tmp/dist-test-taskOT3fhM/test-tmp/rpc-test-cc2c13b0b04e41269acfa5334fe47ec5.sock
W20260928 11:51:35.708212 992 connection.cc:196] Error closing socket: Network error: TlsSocket::Close: Broken pipe
W20260928 11:51:35.726624 992 connection.cc:196] Error closing socket: Network error: TlsSocket::Close: Broken pipe
[ OK ] Parameters/TestRpc.TestCredentialsPolicy/SSL_UnixSocket (98 ms)
[ RUN ] Parameters/TestRpc.TestCallLongerThanKeepalive/SSL_UnixSocket
I20260928 11:51:35.758090 1018 acceptor_pool.cc:254] collecting diagnostics on the listening RPC socket unix:/tmp/dist-test-taskOT3fhM/test-tmp/rpc-test-2430ab6e7f3e406a9875500cc7333a44.sock every 8 connection(s)
I20260928 11:51:35.758841 1019 acceptor_pool.cc:254] collecting diagnostics on the listening RPC socket unix:/tmp/dist-test-taskOT3fhM/test-tmp/rpc-test-2430ab6e7f3e406a9875500cc7333a44.sock every 8 connection(s)
I20260928 11:51:35.805230 1022 rpc-test-base.h:222] got call: sleep_micros: 3000000 deferred: true
I20260928 11:51:38.810375 1022 rpcz_store.cc:275] Call kudu.rpc.GenericCalculatorService.Sleep from unix:<unnamed> (request call id 0) took 3005 ms. Trace:
I20260928 11:51:38.810983 1022 rpcz_store.cc:276] 0928 11:51:35.805062 (+ 0us) service_pool.cc:170] Inserting onto call queue
0928 11:51:35.805173 (+ 111us) service_pool.cc:227] Handling call
0928 11:51:38.810173 (+3005000us) inbound_call.cc:173] Queueing success response
Metrics: {}
W20260928 11:51:38.818358 1015 connection.cc:196] Error closing socket: Network error: TlsSocket::Close: Broken pipe
[ OK ] Parameters/TestRpc.TestCallLongerThanKeepalive/SSL_UnixSocket (3095 ms)
[ RUN ] Parameters/TestRpc.TestRpcSidecar/SSL_UnixSocket
I20260928 11:51:38.851141 1044 acceptor_pool.cc:254] collecting diagnostics on the listening RPC socket unix:/tmp/dist-test-taskOT3fhM/test-tmp/rpc-test-fb9005e62bc94ff8a44f3ed34857867e.sock every 8 connection(s)
I20260928 11:51:38.852216 1045 acceptor_pool.cc:254] collecting diagnostics on the listening RPC socket unix:/tmp/dist-test-taskOT3fhM/test-tmp/rpc-test-fb9005e62bc94ff8a44f3ed34857867e.sock every 8 connection(s)
W20260928 11:51:39.432948 1041 connection.cc:196] Error closing socket: Network error: TlsSocket::Close: Broken pipe
[ OK ] Parameters/TestRpc.TestRpcSidecar/SSL_UnixSocket (611 ms)
[ RUN ] Parameters/TestRpc.TestRpcSidecarLimits/SSL_UnixSocket
I20260928 11:51:56.340682 1070 acceptor_pool.cc:254] collecting diagnostics on the listening RPC socket unix:/tmp/dist-test-taskOT3fhM/test-tmp/rpc-test-f0bec208ba6b44a1a71c1fe4b59cc6e5.sock every 8 connection(s)
I20260928 11:51:56.341754 1071 acceptor_pool.cc:254] collecting diagnostics on the listening RPC socket unix:/tmp/dist-test-taskOT3fhM/test-tmp/rpc-test-f0bec208ba6b44a1a71c1fe4b59cc6e5.sock every 8 connection(s)
W20260928 11:51:56.370270 810 serialization.cc:72] Serialized kudu.rpc_test.PushStringsRequestPB (2147483654 bytes) is larger than the maximum configured RPC message size (52428800 bytes). Sending anyway, but peer may reject the data.
W20260928 11:51:56.382462 1067 connection.cc:535] server connection from unix:<unnamed> recv error: Network error: RPC frame had a length of 2147483714, but we only support messages up to 52428800 bytes long.
W20260928 11:51:56.382856 1067 connection.cc:158] shutting down server connection from unix:<unnamed> with pending inbound data: 4/2147483714 bytes received; last active 0 ns ago: status Network error: RPC frame had a length of 2147483714, but we only support messages up to 52428800 bytes long.
W20260928 11:51:56.384141 1083 connection.cc:196] Error closing socket: Network error: TlsSocket::Close: Broken pipe
[ OK ] Parameters/TestRpc.TestRpcSidecarLimits/SSL_UnixSocket (17797 ms)
[ RUN ] Parameters/TestRpc.TestCallTimeoutDoesntAffectNegotiation/SSL_UnixSocket
I20260928 11:51:57.257654 1096 acceptor_pool.cc:254] collecting diagnostics on the listening RPC socket unix:/tmp/dist-test-taskOT3fhM/test-tmp/rpc-test-995af8ee4fe04023aab32a7dcdaf8f2b.sock every 8 connection(s)
I20260928 11:51:57.258436 1097 acceptor_pool.cc:254] collecting diagnostics on the listening RPC socket unix:/tmp/dist-test-taskOT3fhM/test-tmp/rpc-test-995af8ee4fe04023aab32a7dcdaf8f2b.sock every 8 connection(s)
W20260928 11:51:57.286412 1092 negotiation.cc:266] Injecting 500ms delay in negotiation
I20260928 11:51:57.336468 810 rpc-test-base.h:595] status: Timed out: connection negotiation to unix:/tmp/dist-test-taskOT3fhM/test-tmp/rpc-test-995af8ee4fe04023aab32a7dcdaf8f2b.sock for RPC Sleep timed out after 0.050s (ON_OUTBOUND_QUEUE), seconds elapsed: 0.0514424
W20260928 11:51:57.801054 1093 connection.cc:196] Error closing socket: Network error: TlsSocket::Close: Broken pipe
[ OK ] Parameters/TestRpc.TestCallTimeoutDoesntAffectNegotiation/SSL_UnixSocket (568 ms)
[ RUN ] Parameters/TestRpc.TestRpcHandlerLatencyMetric/SSL_UnixSocket
I20260928 11:51:57.830864 1121 acceptor_pool.cc:254] collecting diagnostics on the listening RPC socket unix:/tmp/dist-test-taskOT3fhM/test-tmp/rpc-test-3692cfe680ad4c9499be085728f0e45e.sock every 8 connection(s)
I20260928 11:51:57.831557 1122 acceptor_pool.cc:254] collecting diagnostics on the listening RPC socket unix:/tmp/dist-test-taskOT3fhM/test-tmp/rpc-test-3692cfe680ad4c9499be085728f0e45e.sock every 8 connection(s)
I20260928 11:51:57.887223 810 rpc-test.cc:1236] Sleep() min lat: 21778
I20260928 11:51:57.887442 810 rpc-test.cc:1237] Sleep() mean lat: 21778
I20260928 11:51:57.887669 810 rpc-test.cc:1238] Sleep() max lat: 21778
I20260928 11:51:57.887854 810 rpc-test.cc:1239] Sleep() #calls: 1
W20260928 11:51:57.890992 1118 connection.cc:196] Error closing socket: Network error: TlsSocket::Close: Broken pipe
[ OK ] Parameters/TestRpc.TestRpcHandlerLatencyMetric/SSL_UnixSocket (89 ms)
[ RUN ] Parameters/TestRpc.TimedOutOnResponseMetricServiceQueue/SSL_UnixSocket
I20260928 11:51:57.923930 1147 acceptor_pool.cc:254] collecting diagnostics on the listening RPC socket unix:/tmp/dist-test-taskOT3fhM/test-tmp/rpc-test-6475f36148d44e04b743ec0db92460f4.sock every 8 connection(s)
I20260928 11:51:57.924722 1148 acceptor_pool.cc:254] collecting diagnostics on the listening RPC socket unix:/tmp/dist-test-taskOT3fhM/test-tmp/rpc-test-6475f36148d44e04b743ec0db92460f4.sock every 8 connection(s)
W20260928 11:51:57.999162 1149 rpcz_store.cc:267] Call kudu.rpc_test.CalculatorService.Sleep from unix:<unnamed> (request call id 2) took 20 ms (client timeout 20 ms). Trace:
W20260928 11:51:57.999575 1149 rpcz_store.cc:269] 0928 11:51:57.978507 (+ 0us) service_pool.cc:170] Inserting onto call queue
0928 11:51:57.998909 (+ 20402us) service_pool.cc:214] Skipping call since client already timed out
0928 11:51:57.999071 (+ 162us) inbound_call.cc:173] Queueing failure response
Metrics: {}
[ OK ] Parameters/TestRpc.TimedOutOnResponseMetricServiceQueue/SSL_UnixSocket (111 ms)
[ RUN ] Parameters/TestRpc.RpcPendingConnectionsMetric/SSL_UnixSocket
I20260928 11:51:58.017812 1170 acceptor_pool.cc:254] collecting diagnostics on the listening RPC socket 0.0.0.0:42647 every 8 connection(s)
I20260928 11:51:58.018540 1171 acceptor_pool.cc:254] collecting diagnostics on the listening RPC socket 0.0.0.0:42647 every 8 connection(s)
W20260928 11:51:58.034096 1166 negotiation.cc:337] Failed RPC negotiation. Trace:
0928 11:51:58.032357 (+ 0us) reactor.cc:625] Submitting negotiation task for server connection from 127.0.0.1:35194 (local address 127.0.0.1:42647)
0928 11:51:58.032825 (+ 468us) server_negotiation.cc:206] Beginning negotiation
0928 11:51:58.032843 (+ 18us) server_negotiation.cc:399] Waiting for connection header
0928 11:51:58.033084 (+ 241us) negotiation.cc:327] Negotiation complete: Network error: Server connection negotiation failed: server connection from 127.0.0.1:35194: BlockingRecv error: recv got EOF from 127.0.0.1:35194 (error 108)
Metrics: {"server-negotiator.queue_time_us":130}
[ OK ] Parameters/TestRpc.RpcPendingConnectionsMetric/SSL_UnixSocket (40 ms)
[ RUN ] Parameters/TestRpc.TestRpcContextClientDeadline/SSL_UnixSocket
I20260928 11:51:58.064690 1186 acceptor_pool.cc:254] collecting diagnostics on the listening RPC socket unix:/tmp/dist-test-taskOT3fhM/test-tmp/rpc-test-eacc30100e7f48e385dba82c3c09c743.sock every 8 connection(s)
I20260928 11:51:58.065524 1187 acceptor_pool.cc:254] collecting diagnostics on the listening RPC socket unix:/tmp/dist-test-taskOT3fhM/test-tmp/rpc-test-eacc30100e7f48e385dba82c3c09c743.sock every 8 connection(s)
[ OK ] Parameters/TestRpc.TestRpcContextClientDeadline/SSL_UnixSocket (84 ms)
[ RUN ] Parameters/TestRpc.TestApplicationFeatureFlagUnsupportedServer/SSL_UnixSocket
I20260928 11:51:58.164170 1211 acceptor_pool.cc:254] collecting diagnostics on the listening RPC socket unix:/tmp/dist-test-taskOT3fhM/test-tmp/rpc-test-208bf6cde1de4f0681e288c7cf06758c.sock every 8 connection(s)
I20260928 11:51:58.165037 1212 acceptor_pool.cc:254] collecting diagnostics on the listening RPC socket unix:/tmp/dist-test-taskOT3fhM/test-tmp/rpc-test-208bf6cde1de4f0681e288c7cf06758c.sock every 8 connection(s)
W20260928 11:51:58.230330 1208 connection.cc:196] Error closing socket: Network error: TlsSocket::Close: Broken pipe
[ OK ] Parameters/TestRpc.TestApplicationFeatureFlagUnsupportedServer/SSL_UnixSocket (101 ms)
[ RUN ] Parameters/TestRpc.TestCancellationAsync/SSL_UnixSocket
I20260928 11:51:58.256731 1236 acceptor_pool.cc:254] collecting diagnostics on the listening RPC socket unix:/tmp/dist-test-taskOT3fhM/test-tmp/rpc-test-8608b17af48f4a11a12858d25f1084ff.sock every 8 connection(s)
I20260928 11:51:58.257468 1237 acceptor_pool.cc:254] collecting diagnostics on the listening RPC socket unix:/tmp/dist-test-taskOT3fhM/test-tmp/rpc-test-8608b17af48f4a11a12858d25f1084ff.sock every 8 connection(s)
I20260928 11:51:58.260970 810 rpc-test.cc:1716] Connecting to unix:/tmp/dist-test-taskOT3fhM/test-tmp/rpc-test-8608b17af48f4a11a12858d25f1084ff.sock
I20260928 11:51:58.282815 810 test_util.cc:268] Using random seed: -1317223384
I20260928 11:51:58.521018 1240 rpc-test-base.h:240] got call: sleep_micros: 500 pattern: 4294967295 num_repetitions: 2097152 sidecar_idx: 0
I20260928 11:51:58.768900 1240 rpc-test-base.h:240] got call: sleep_micros: 500 pattern: 4294967295 num_repetitions: 2097152 sidecar_idx: 0
I20260928 11:51:58.998579 1239 rpc-test-base.h:240] got call: sleep_micros: 500 pattern: 4294967295 num_repetitions: 2097152 sidecar_idx: 0
I20260928 11:51:59.242478 1239 rpc-test-base.h:240] got call: sleep_micros: 500 pattern: 4294967295 num_repetitions: 2097152 sidecar_idx: 0
I20260928 11:51:59.464771 1239 rpc-test-base.h:240] got call: sleep_micros: 500 pattern: 4294967295 num_repetitions: 2097152 sidecar_idx: 0
I20260928 11:51:59.711850 1239 rpc-test-base.h:240] got call: sleep_micros: 500 pattern: 4294967295 num_repetitions: 2097152 sidecar_idx: 0
I20260928 11:51:59.929934 1240 rpc-test-base.h:240] got call: sleep_micros: 500 pattern: 4294967295 num_repetitions: 2097152 sidecar_idx: 0
I20260928 11:52:00.176739 1240 rpc-test-base.h:240] got call: sleep_micros: 500 pattern: 4294967295 num_repetitions: 2097152 sidecar_idx: 0
I20260928 11:52:00.373447 1239 rpc-test-base.h:240] got call: sleep_micros: 500 pattern: 4294967295 num_repetitions: 2097152 sidecar_idx: 0
W20260928 11:52:00.388726 1233 connection.cc:196] Error closing socket: Network error: TlsSocket::Close: Broken pipe
W20260928 11:52:00.424556 1233 connection.cc:441] server connection from unix:<unnamed> torn down before Call kudu.rpc.GenericCalculatorService.SleepWithSidecar from unix:<unnamed> (request call id 8) could send its response
W20260928 11:52:00.532585 1233 connection.cc:441] server connection from unix:<unnamed> torn down before Call kudu.rpc.GenericCalculatorService.SleepWithSidecar from unix:<unnamed> (request call id 9) could send its response
[ OK ] Parameters/TestRpc.TestCancellationAsync/SSL_UnixSocket (2307 ms)
[ RUN ] Parameters/TestRpc.TestPerformanceBySocketType/SSL_UnixSocket
I20260928 11:52:00.633986 1261 acceptor_pool.cc:254] collecting diagnostics on the listening RPC socket unix:/tmp/dist-test-taskOT3fhM/test-tmp/rpc-test-fe6b9a6e207f405493d69a82ae245ec6.sock every 8 connection(s)
I20260928 11:52:00.634717 1262 acceptor_pool.cc:254] collecting diagnostics on the listening RPC socket unix:/tmp/dist-test-taskOT3fhM/test-tmp/rpc-test-fe6b9a6e207f405493d69a82ae245ec6.sock every 8 connection(s)
I20260928 11:52:00.637913 810 rpc-test.cc:1846] Connecting to unix:/tmp/dist-test-taskOT3fhM/test-tmp/rpc-test-fe6b9a6e207f405493d69a82ae245ec6.sock
I20260928 11:52:23.823187 810 rpc-test.cc:1859] Sending 1024MB via ssl-enabled unix socket: real 23.135s user 21.761s sys 13.960s
I20260928 11:52:46.538582 810 rpc-test.cc:1859] Sending 1024MB via ssl-enabled unix socket: real 22.715s user 20.885s sys 14.005s
I20260928 11:53:09.208925 810 rpc-test.cc:1859] Sending 1024MB via ssl-enabled unix socket: real 22.670s user 20.817s sys 13.940s
I20260928 11:53:31.866802 810 rpc-test.cc:1859] Sending 1024MB via ssl-enabled unix socket: real 22.657s user 20.850s sys 13.960s
I20260928 11:53:54.899838 810 rpc-test.cc:1859] Sending 1024MB via ssl-enabled unix socket: real 23.033s user 21.765s sys 13.749s
W20260928 11:53:54.908133 1258 connection.cc:196] Error closing socket: Network error: TlsSocket::Close: Broken pipe
[ OK ] Parameters/TestRpc.TestPerformanceBySocketType/SSL_UnixSocket (114375 ms)
[----------] 20 tests from Parameters/TestRpc (288805 ms total)
[----------] 1 test from Parameters/TestRpcSocketTxRxQueue
[ RUN ] Parameters/TestRpcSocketTxRxQueue.AcceptorRxQueueSizeMetric/0
I20260928 11:53:54.951722 1297 acceptor_pool.cc:254] collecting diagnostics on the listening RPC socket 0.0.0.0:35885 every 1 connection(s)
I20260928 11:53:54.952684 1298 acceptor_pool.cc:254] collecting diagnostics on the listening RPC socket 0.0.0.0:35885 every 1 connection(s)
W20260928 11:53:54.959818 1293 negotiation.cc:337] Failed RPC negotiation. Trace:
0928 11:53:54.957923 (+ 0us) reactor.cc:625] Submitting negotiation task for server connection from 127.0.0.1:33684 (local address 127.0.0.1:35885)
0928 11:53:54.958496 (+ 573us) server_negotiation.cc:206] Beginning negotiation
0928 11:53:54.958526 (+ 30us) server_negotiation.cc:399] Waiting for connection header
0928 11:53:54.958763 (+ 237us) negotiation.cc:327] Negotiation complete: Network error: Server connection negotiation failed: server connection from 127.0.0.1:33684: BlockingRecv error: recv got EOF from 127.0.0.1:33684 (error 108)
Metrics: {"server-negotiator.queue_time_us":167}
[ OK ] Parameters/TestRpcSocketTxRxQueue.AcceptorRxQueueSizeMetric/0 (50 ms)
[----------] 1 test from Parameters/TestRpcSocketTxRxQueue (50 ms total)
[----------] Global test environment tear-down
[==========] 21 tests from 2 test suites ran. (288856 ms total)
[ PASSED ] 20 tests.
[ FAILED ] 1 test, listed below:
[ FAILED ] Parameters/TestRpc.TestCallWithChainCertAndChainCA/SSL_UnixSocket, where GetParam() = (true, true)
1 FAILED TEST