Diagnosed failure

Parameters/TestRpc.TestCallWithChainCertAndChainCA/SSL_TCP: /data0/somelongdirectorytoavoidrpathissues/src/kudu/src/kudu/rpc/rpc-test.cc:270: Failure
Failed
Bad status: Runtime error: could not verify certificate chain (error with cert: subject=CN = localhost, ST = sadfjas, C = AS, emailAddress = sdflkdsajf, O = lskdfjlsad, OU = sldfkja, issuer=C = AS, ST = ASDfkjdhf, L = lskdjf, O = saldfja, OU = skdjf, CN = localhost, emailAddress = sadjflkadsj): : certificate has expired
Google Test trace:
/data0/somelongdirectorytoavoidrpathissues/src/kudu/src/kudu/rpc/rpc-test.cc:267: Connecting to 0.0.0.0:34477
I20260927 01:38:40.446779  8901 test_util.cc:175] -----------------------------------------------
I20260927 01:38:40.446874  8901 test_util.cc:176] Had fatal failures, leaving test files at /tmp/dist-test-tasku02OBv/test-tmp/rpc-test.5.Parameters_TestRpc.TestCallWithChainCertAndChainCA_SSL_TCP.1790473120301148-8901-0

Full log

Note: This is test shard 6 of 8.
[==========] Running 21 tests from 2 test suites.
[----------] Global test environment set-up.
[----------] 20 tests from Parameters/TestRpc
[ RUN      ] Parameters/TestRpc.TestMessengerCreateDestroy/SSL_TCP
WARNING: Logging before InitGoogleLogging() is written to STDERR
I20260927 01:38:40.352452  8901 rpc-test.cc:169] started messenger TestCreateDestroy
[       OK ] Parameters/TestRpc.TestMessengerCreateDestroy/SSL_TCP (35 ms)
[ RUN      ] Parameters/TestRpc.TestNegotiationDeadlock/SSL_TCP
I20260927 01:38:40.384814  8921 acceptor_pool.cc:254] collecting diagnostics on the listening RPC socket 0.0.0.0:41869 every 8 connection(s)
I20260927 01:38:40.385066  8922 acceptor_pool.cc:254] collecting diagnostics on the listening RPC socket 0.0.0.0:41869 every 8 connection(s)
[       OK ] Parameters/TestRpc.TestNegotiationDeadlock/SSL_TCP (50 ms)
[ RUN      ] Parameters/TestRpc.TestCallWithChainCertAndChainCA/SSL_TCP
I20260927 01:38:40.435221  8937 acceptor_pool.cc:254] collecting diagnostics on the listening RPC socket 0.0.0.0:34477 every 8 connection(s)
I20260927 01:38:40.435529  8938 acceptor_pool.cc:254] collecting diagnostics on the listening RPC socket 0.0.0.0:34477 every 8 connection(s)
/data0/somelongdirectorytoavoidrpathissues/src/kudu/src/kudu/rpc/rpc-test.cc:270: Failure
Failed
Bad status: Runtime error: could not verify certificate chain (error with cert: subject=CN = localhost, ST = sadfjas, C = AS, emailAddress = sdflkdsajf, O = lskdfjlsad, OU = sldfkja, issuer=C = AS, ST = ASDfkjdhf, L = lskdjf, O = saldfja, OU = skdjf, CN = localhost, emailAddress = sadjflkadsj): : certificate has expired
Google Test trace:
/data0/somelongdirectorytoavoidrpathissues/src/kudu/src/kudu/rpc/rpc-test.cc:267: Connecting to 0.0.0.0:34477
I20260927 01:38:40.446779  8901 test_util.cc:175] -----------------------------------------------
I20260927 01:38:40.446874  8901 test_util.cc:176] Had fatal failures, leaving test files at /tmp/dist-test-tasku02OBv/test-tmp/rpc-test.5.Parameters_TestRpc.TestCallWithChainCertAndChainCA_SSL_TCP.1790473120301148-8901-0
[  FAILED  ] Parameters/TestRpc.TestCallWithChainCertAndChainCA/SSL_TCP, where GetParam() = (true, false) (40 ms)
[ RUN      ] Parameters/TestRpc.TestCallWithPasswordProtectedKey/SSL_TCP
I20260927 01:38:40.469007  8962 acceptor_pool.cc:254] collecting diagnostics on the listening RPC socket 0.0.0.0:38237 every 8 connection(s)
I20260927 01:38:40.469283  8963 acceptor_pool.cc:254] collecting diagnostics on the listening RPC socket 0.0.0.0:38237 every 8 connection(s)
[       OK ] Parameters/TestRpc.TestCallWithPasswordProtectedKey/SSL_TCP (57 ms)
[ RUN      ] Parameters/TestRpc.TestCallToBadServer/SSL_TCP
I20260927 01:38:40.529142  8901 rpc-test.cc:394] Status: Network error: Client connection negotiation failed: client connection to 0.0.0.0:0: connect: Connection refused (error 111)
I20260927 01:38:40.529800  8901 rpc-test.cc:394] Status: Network error: Client connection negotiation failed: client connection to 0.0.0.0:0: connect: Connection refused (error 111)
I20260927 01:38:40.530427  8901 rpc-test.cc:394] Status: Network error: Client connection negotiation failed: client connection to 0.0.0.0:0: connect: Connection refused (error 111)
I20260927 01:38:40.530984  8901 rpc-test.cc:394] Status: Network error: Client connection negotiation failed: client connection to 0.0.0.0:0: connect: Connection refused (error 111)
I20260927 01:38:40.531584  8901 rpc-test.cc:394] Status: Network error: Client connection negotiation failed: client connection to 0.0.0.0:0: connect: Connection refused (error 111)
[       OK ] Parameters/TestRpc.TestCallToBadServer/SSL_TCP (29 ms)
[ RUN      ] Parameters/TestRpc.TestWrongService/SSL_TCP
I20260927 01:38:40.562541  8997 acceptor_pool.cc:254] collecting diagnostics on the listening RPC socket 0.0.0.0:38101 every 8 connection(s)
I20260927 01:38:40.562796  8998 acceptor_pool.cc:254] collecting diagnostics on the listening RPC socket 0.0.0.0:38101 every 8 connection(s)
I20260927 01:38:40.584285  8996 messenger.cc:345] service WrongServiceName not registered on TestServer
[       OK ] Parameters/TestRpc.TestWrongService/SSL_TCP (55 ms)
[ RUN      ] Parameters/TestRpc.TestConnectionKeepalive/SSL_TCP
I20260927 01:38:40.605891  9020 acceptor_pool.cc:254] collecting diagnostics on the listening RPC socket 0.0.0.0:40035 every 8 connection(s)
I20260927 01:38:40.606146  9021 acceptor_pool.cc:254] collecting diagnostics on the listening RPC socket 0.0.0.0:40035 every 8 connection(s)
I20260927 01:38:40.607196  8901 rpc-test.cc:488] Connecting to 0.0.0.0:40035
[       OK ] Parameters/TestRpc.TestConnectionKeepalive/SSL_TCP (1043 ms)
[ RUN      ] Parameters/TestRpc.TestClientConnectionMetrics/SSL_TCP
I20260927 01:38:41.644318  9045 acceptor_pool.cc:254] collecting diagnostics on the listening RPC socket 0.0.0.0:41335 every 8 connection(s)
I20260927 01:38:41.644696  9046 acceptor_pool.cc:254] collecting diagnostics on the listening RPC socket 0.0.0.0:41335 every 8 connection(s)
I20260927 01:38:41.645735  8901 rpc-test.cc:569] Connecting to 0.0.0.0:41335
[       OK ] Parameters/TestRpc.TestClientConnectionMetrics/SSL_TCP (20165 ms)
[ RUN      ] Parameters/TestRpc.TestCredentialsPolicy/SSL_TCP
I20260927 01:39:01.821259  9068 acceptor_pool.cc:254] collecting diagnostics on the listening RPC socket 0.0.0.0:42283 every 8 connection(s)
I20260927 01:39:01.821524  9069 acceptor_pool.cc:254] collecting diagnostics on the listening RPC socket 0.0.0.0:42283 every 8 connection(s)
I20260927 01:39:01.822466  8901 rpc-test.cc:700] Connecting to 0.0.0.0:42283
[       OK ] Parameters/TestRpc.TestCredentialsPolicy/SSL_TCP (66 ms)
[ RUN      ] Parameters/TestRpc.TestCallLongerThanKeepalive/SSL_TCP
I20260927 01:39:01.874411  9093 acceptor_pool.cc:254] collecting diagnostics on the listening RPC socket 0.0.0.0:45153 every 8 connection(s)
I20260927 01:39:01.874639  9094 acceptor_pool.cc:254] collecting diagnostics on the listening RPC socket 0.0.0.0:45153 every 8 connection(s)
I20260927 01:39:01.898053  9097 rpc-test-base.h:222] got call: sleep_micros: 3000000 deferred: true
I20260927 01:39:04.899742  9097 rpcz_store.cc:275] Call kudu.rpc.GenericCalculatorService.Sleep from 127.0.0.1:42856 (request call id 0) took 3001 ms. Trace:
I20260927 01:39:04.899899  9097 rpcz_store.cc:276] 0927 01:39:01.897913 (+     0us) service_pool.cc:170] Inserting onto call queue
0927 01:39:01.897999 (+    86us) service_pool.cc:227] Handling call
0927 01:39:04.899673 (+3001674us) inbound_call.cc:173] Queueing success response
Metrics: {}
[       OK ] Parameters/TestRpc.TestCallLongerThanKeepalive/SSL_TCP (3040 ms)
[ RUN      ] Parameters/TestRpc.TestRpcSidecar/SSL_TCP
I20260927 01:39:04.914983  9118 acceptor_pool.cc:254] collecting diagnostics on the listening RPC socket 0.0.0.0:44097 every 8 connection(s)
I20260927 01:39:04.915295  9119 acceptor_pool.cc:254] collecting diagnostics on the listening RPC socket 0.0.0.0:44097 every 8 connection(s)
[       OK ] Parameters/TestRpc.TestRpcSidecar/SSL_TCP (120 ms)
[ RUN      ] Parameters/TestRpc.TestRpcSidecarLimits/SSL_TCP
I20260927 01:39:07.231009  9143 acceptor_pool.cc:254] collecting diagnostics on the listening RPC socket 0.0.0.0:34443 every 8 connection(s)
I20260927 01:39:07.231302  9144 acceptor_pool.cc:254] collecting diagnostics on the listening RPC socket 0.0.0.0:34443 every 8 connection(s)
W20260927 01:39:07.244814  8901 serialization.cc:72] Serialized kudu.rpc_test.PushStringsRequestPB (2147483654 bytes) is larger than the maximum configured RPC message size (52428800 bytes). Sending anyway, but peer may reject the data.
W20260927 01:39:07.251652  9142 connection.cc:535] server connection from 127.0.0.1:51062 recv error: Network error: RPC frame had a length of 2147483714, but we only support messages up to 52428800 bytes long.
W20260927 01:39:07.251809  9142 connection.cc:158] shutting down server connection from 127.0.0.1:51062 with pending inbound data: 4/2147483714 bytes received; last active 0 ns ago: status Network error: RPC frame had a length of 2147483714, but we only support messages up to 52428800 bytes long.
W20260927 01:39:07.252456  9156 connection.cc:196] Error closing socket: Network error: TlsSocket::Close: Connection reset by peer
I20260927 01:39:07.272693  9168 acceptor_pool.cc:254] collecting diagnostics on the listening RPC socket 0.0.0.0:33161 every 8 connection(s)
I20260927 01:39:07.272892  9169 acceptor_pool.cc:254] collecting diagnostics on the listening RPC socket 0.0.0.0:33161 every 8 connection(s)
W20260927 01:39:12.695178  9166 connection.cc:577] server connection from 127.0.0.1:35214: received bad data: 'Corruption: Invalid packet: message had a length of 2147483710, but we only support messages up to 2147483647 bytes
'
[       OK ] Parameters/TestRpc.TestRpcSidecarLimits/SSL_TCP (8139 ms)
[ RUN      ] Parameters/TestRpc.TestCallTimeoutDoesntAffectNegotiation/SSL_TCP
I20260927 01:39:13.207584  9193 acceptor_pool.cc:254] collecting diagnostics on the listening RPC socket 0.0.0.0:41129 every 8 connection(s)
I20260927 01:39:13.207859  9194 acceptor_pool.cc:254] collecting diagnostics on the listening RPC socket 0.0.0.0:41129 every 8 connection(s)
W20260927 01:39:13.228053  9189 negotiation.cc:266] Injecting 500ms delay in negotiation
I20260927 01:39:13.278553  8901 rpc-test-base.h:595] status: Timed out: connection negotiation to 0.0.0.0:41129 for RPC Sleep timed out after 0.050s (ON_OUTBOUND_QUEUE), seconds elapsed: 0.0511369
[       OK ] Parameters/TestRpc.TestCallTimeoutDoesntAffectNegotiation/SSL_TCP (572 ms)
[ RUN      ] Parameters/TestRpc.TestRpcHandlerLatencyMetric/SSL_TCP
I20260927 01:39:13.753127  9218 acceptor_pool.cc:254] collecting diagnostics on the listening RPC socket 0.0.0.0:40529 every 8 connection(s)
I20260927 01:39:13.753369  9219 acceptor_pool.cc:254] collecting diagnostics on the listening RPC socket 0.0.0.0:40529 every 8 connection(s)
I20260927 01:39:13.802459  8901 rpc-test.cc:1236] Sleep() min lat: 20617
I20260927 01:39:13.802564  8901 rpc-test.cc:1237] Sleep() mean lat: 20617
I20260927 01:39:13.802623  8901 rpc-test.cc:1238] Sleep() max lat: 20617
I20260927 01:39:13.802662  8901 rpc-test.cc:1239] Sleep() #calls: 1
[       OK ] Parameters/TestRpc.TestRpcHandlerLatencyMetric/SSL_TCP (69 ms)
[ RUN      ] Parameters/TestRpc.TimedOutOnResponseMetricServiceQueue/SSL_TCP
I20260927 01:39:13.828318  9244 acceptor_pool.cc:254] collecting diagnostics on the listening RPC socket 0.0.0.0:32953 every 8 connection(s)
I20260927 01:39:13.828569  9245 acceptor_pool.cc:254] collecting diagnostics on the listening RPC socket 0.0.0.0:32953 every 8 connection(s)
W20260927 01:39:13.890127  9246 rpcz_store.cc:267] Call kudu.rpc_test.CalculatorService.Sleep from 127.0.0.1:57194 (request call id 2) took 20 ms (client timeout 20 ms). Trace:
W20260927 01:39:13.890321  9246 rpcz_store.cc:269] 0927 01:39:13.869603 (+     0us) service_pool.cc:170] Inserting onto call queue
0927 01:39:13.890024 (+ 20421us) service_pool.cc:214] Skipping call since client already timed out
0927 01:39:13.890099 (+    75us) inbound_call.cc:173] Queueing failure response
Metrics: {}
[       OK ] Parameters/TestRpc.TimedOutOnResponseMetricServiceQueue/SSL_TCP (86 ms)
[ RUN      ] Parameters/TestRpc.RpcPendingConnectionsMetric/SSL_TCP
I20260927 01:39:13.899228  9267 acceptor_pool.cc:254] collecting diagnostics on the listening RPC socket 0.0.0.0:46143 every 8 connection(s)
I20260927 01:39:13.899446  9268 acceptor_pool.cc:254] collecting diagnostics on the listening RPC socket 0.0.0.0:46143 every 8 connection(s)
W20260927 01:39:13.901377  9263 negotiation.cc:337] Failed RPC negotiation. Trace:
0927 01:39:13.900782 (+     0us) reactor.cc:625] Submitting negotiation task for server connection from 127.0.0.1:39470 (local address 127.0.0.1:46143)
0927 01:39:13.900921 (+   139us) server_negotiation.cc:206] Beginning negotiation
0927 01:39:13.900926 (+     5us) server_negotiation.cc:399] Waiting for connection header
0927 01:39:13.901062 (+   136us) negotiation.cc:327] Negotiation complete: Network error: Server connection negotiation failed: server connection from 127.0.0.1:39470: BlockingRecv error: recv got EOF from 127.0.0.1:39470 (error 108)
Metrics: {"server-negotiator.queue_time_us":43}
[       OK ] Parameters/TestRpc.RpcPendingConnectionsMetric/SSL_TCP (19 ms)
[ RUN      ] Parameters/TestRpc.TestRpcContextClientDeadline/SSL_TCP
I20260927 01:39:13.932366  9283 acceptor_pool.cc:254] collecting diagnostics on the listening RPC socket 0.0.0.0:42141 every 8 connection(s)
I20260927 01:39:13.932636  9284 acceptor_pool.cc:254] collecting diagnostics on the listening RPC socket 0.0.0.0:42141 every 8 connection(s)
[       OK ] Parameters/TestRpc.TestRpcContextClientDeadline/SSL_TCP (61 ms)
[ RUN      ] Parameters/TestRpc.TestApplicationFeatureFlagUnsupportedServer/SSL_TCP
I20260927 01:39:13.986509  9308 acceptor_pool.cc:254] collecting diagnostics on the listening RPC socket 0.0.0.0:38875 every 8 connection(s)
I20260927 01:39:13.986747  9309 acceptor_pool.cc:254] collecting diagnostics on the listening RPC socket 0.0.0.0:38875 every 8 connection(s)
[       OK ] Parameters/TestRpc.TestApplicationFeatureFlagUnsupportedServer/SSL_TCP (48 ms)
[ RUN      ] Parameters/TestRpc.TestCancellationAsync/SSL_TCP
I20260927 01:39:14.035043  9333 acceptor_pool.cc:254] collecting diagnostics on the listening RPC socket 0.0.0.0:43151 every 8 connection(s)
I20260927 01:39:14.035292  9334 acceptor_pool.cc:254] collecting diagnostics on the listening RPC socket 0.0.0.0:43151 every 8 connection(s)
I20260927 01:39:14.036113  8901 rpc-test.cc:1716] Connecting to 0.0.0.0:43151
I20260927 01:39:14.047545  8901 test_util.cc:268] Using random seed: 72592924
I20260927 01:39:14.083129  9337 rpc-test-base.h:240] got call: sleep_micros: 500 pattern: 4294967295 num_repetitions: 2097152 sidecar_idx: 0
I20260927 01:39:14.102630  9336 rpc-test-base.h:240] got call: sleep_micros: 500 pattern: 4294967295 num_repetitions: 2097152 sidecar_idx: 0
I20260927 01:39:14.127853  9335 rpc-test-base.h:240] got call: sleep_micros: 500 pattern: 4294967295 num_repetitions: 2097152 sidecar_idx: 0
I20260927 01:39:14.160676  9337 rpc-test-base.h:240] got call: sleep_micros: 500 pattern: 4294967295 num_repetitions: 2097152 sidecar_idx: 0
I20260927 01:39:14.180574  9336 rpc-test-base.h:240] got call: sleep_micros: 500 pattern: 4294967295 num_repetitions: 2097152 sidecar_idx: 0
I20260927 01:39:14.219089  9335 rpc-test-base.h:240] got call: sleep_micros: 500 pattern: 4294967295 num_repetitions: 2097152 sidecar_idx: 0
W20260927 01:39:14.251607  9331 connection.cc:196] Error closing socket: Network error: TlsSocket::Close: Broken pipe
W20260927 01:39:14.266985  9331 connection.cc:441] server connection from 127.0.0.1:52318 torn down before Call kudu.rpc.GenericCalculatorService.SleepWithSidecar from 127.0.0.1:52318 (request call id 8) could send its response
[       OK ] Parameters/TestRpc.TestCancellationAsync/SSL_TCP (245 ms)
[ RUN      ] Parameters/TestRpc.TestPerformanceBySocketType/SSL_TCP
I20260927 01:39:14.291457  9358 acceptor_pool.cc:254] collecting diagnostics on the listening RPC socket 0.0.0.0:42843 every 8 connection(s)
I20260927 01:39:14.291690  9359 acceptor_pool.cc:254] collecting diagnostics on the listening RPC socket 0.0.0.0:42843 every 8 connection(s)
I20260927 01:39:14.292624  8901 rpc-test.cc:1846] Connecting to 0.0.0.0:42843
I20260927 01:39:17.294478  8901 rpc-test.cc:1859] Sending 1024MB via ssl-enabled tcp socket: real 2.982s	user 2.825s	sys 2.167s
I20260927 01:39:20.224220  8901 rpc-test.cc:1859] Sending 1024MB via ssl-enabled tcp socket: real 2.930s	user 2.767s	sys 2.134s
I20260927 01:39:23.178685  8901 rpc-test.cc:1859] Sending 1024MB via ssl-enabled tcp socket: real 2.954s	user 2.726s	sys 2.185s
I20260927 01:39:26.093570  8901 rpc-test.cc:1859] Sending 1024MB via ssl-enabled tcp socket: real 2.915s	user 2.743s	sys 2.106s
I20260927 01:39:28.945318  8901 rpc-test.cc:1859] Sending 1024MB via ssl-enabled tcp socket: real 2.852s	user 2.630s	sys 2.104s
[       OK ] Parameters/TestRpc.TestPerformanceBySocketType/SSL_TCP (14682 ms)
[----------] 20 tests from Parameters/TestRpc (48632 ms total)

[----------] 1 test from Parameters/TestRpcSocketTxRxQueue
[ RUN      ] Parameters/TestRpcSocketTxRxQueue.OverCapacity/0
W20260927 01:39:29.258714  9375 negotiation.cc:337] Failed RPC negotiation. Trace:
0927 01:39:28.961414 (+     0us) reactor.cc:625] Submitting negotiation task for client connection to 0.0.0.0:46565 (local address 127.0.0.1:45288)
0927 01:39:28.961610 (+   196us) negotiation.cc:107] Waiting for socket to connect
0927 01:39:28.961625 (+    15us) client_negotiation.cc:174] Beginning negotiation
0927 01:39:28.961722 (+    97us) client_negotiation.cc:252] Sending NEGOTIATE NegotiatePB request
0927 01:39:29.258325 (+296603us) negotiation.cc:327] Negotiation complete: Network error: Client connection negotiation failed: client connection to 0.0.0.0:46565: BlockingRecv error: recv error from unknown peer: Transport endpoint is not connected (error 107)
Metrics: {"client-negotiator.queue_time_us":56}
W20260927 01:39:29.258760  9384 negotiation.cc:337] Failed RPC negotiation. Trace:
0927 01:39:28.963783 (+     0us) reactor.cc:625] Submitting negotiation task for client connection to 0.0.0.0:46565 (local address 127.0.0.1:45298)
0927 01:39:28.963947 (+   164us) negotiation.cc:107] Waiting for socket to connect
0927 01:39:28.963962 (+    15us) client_negotiation.cc:174] Beginning negotiation
0927 01:39:28.964059 (+    97us) client_negotiation.cc:252] Sending NEGOTIATE NegotiatePB request
0927 01:39:29.258353 (+294294us) negotiation.cc:327] Negotiation complete: Network error: Client connection negotiation failed: client connection to 0.0.0.0:46565: BlockingRecv error: recv error from unknown peer: Transport endpoint is not connected (error 107)
Metrics: {"client-negotiator.queue_time_us":52}
W20260927 01:39:29.258791  9402 negotiation.cc:337] Failed RPC negotiation. Trace:
0927 01:39:28.972128 (+     0us) reactor.cc:625] Submitting negotiation task for client connection to 0.0.0.0:46565 (local address 127.0.0.1:45318)
0927 01:39:28.972395 (+   267us) negotiation.cc:107] Waiting for socket to connect
0927 01:39:28.972415 (+    20us) client_negotiation.cc:174] Beginning negotiation
0927 01:39:28.972539 (+   124us) client_negotiation.cc:252] Sending NEGOTIATE NegotiatePB request
0927 01:39:29.258554 (+286015us) negotiation.cc:327] Negotiation complete: Network error: Client connection negotiation failed: client connection to 0.0.0.0:46565: BlockingRecv error: recv error from unknown peer: Transport endpoint is not connected (error 107)
Metrics: {"client-negotiator.queue_time_us":74}
W20260927 01:39:29.260291  9393 negotiation.cc:337] Failed RPC negotiation. Trace:
0927 01:39:28.966117 (+     0us) reactor.cc:625] Submitting negotiation task for client connection to 0.0.0.0:46565 (local address 127.0.0.1:45312)
0927 01:39:28.966278 (+   161us) negotiation.cc:107] Waiting for socket to connect
0927 01:39:28.966294 (+    16us) client_negotiation.cc:174] Beginning negotiation
0927 01:39:28.966383 (+    89us) client_negotiation.cc:252] Sending NEGOTIATE NegotiatePB request
0927 01:39:29.258356 (+291973us) negotiation.cc:327] Negotiation complete: Network error: Client connection negotiation failed: client connection to 0.0.0.0:46565: BlockingRecv error: recv error from unknown peer: Transport endpoint is not connected (error 107)
Metrics: {"client-negotiator.queue_time_us":53}
W20260927 01:39:29.260892  9411 negotiation.cc:337] Failed RPC negotiation. Trace:
0927 01:39:28.976992 (+     0us) reactor.cc:625] Submitting negotiation task for client connection to 0.0.0.0:46565 (local address 127.0.0.1:45326)
0927 01:39:28.977155 (+   163us) negotiation.cc:107] Waiting for socket to connect
0927 01:39:28.977172 (+    17us) client_negotiation.cc:174] Beginning negotiation
0927 01:39:28.977269 (+    97us) client_negotiation.cc:252] Sending NEGOTIATE NegotiatePB request
0927 01:39:29.259252 (+281983us) negotiation.cc:327] Negotiation complete: Network error: Client connection negotiation failed: client connection to 0.0.0.0:46565: BlockingRecv error: recv error from unknown peer: Transport endpoint is not connected (error 107)
Metrics: {"client-negotiator.queue_time_us":32}
W20260927 01:39:29.261009  9420 negotiation.cc:337] Failed RPC negotiation. Trace:
0927 01:39:28.980049 (+     0us) reactor.cc:625] Submitting negotiation task for client connection to 0.0.0.0:46565 (local address 127.0.0.1:45332)
0927 01:39:28.980247 (+   198us) negotiation.cc:107] Waiting for socket to connect
0927 01:39:28.980263 (+    16us) client_negotiation.cc:174] Beginning negotiation
0927 01:39:28.980365 (+   102us) client_negotiation.cc:252] Sending NEGOTIATE NegotiatePB request
0927 01:39:29.260818 (+280453us) negotiation.cc:327] Negotiation complete: Network error: Client connection negotiation failed: client connection to 0.0.0.0:46565: BlockingRecv error: recv error from unknown peer: Transport endpoint is not connected (error 107)
Metrics: {"client-negotiator.queue_time_us":67}
[       OK ] Parameters/TestRpcSocketTxRxQueue.OverCapacity/0 (1068 ms)
[----------] 1 test from Parameters/TestRpcSocketTxRxQueue (1068 ms total)

[----------] Global test environment tear-down
[==========] 21 tests from 2 test suites ran. (49700 ms total)
[  PASSED  ] 20 tests.
[  FAILED  ] 1 test, listed below:
[  FAILED  ] Parameters/TestRpc.TestCallWithChainCertAndChainCA/SSL_TCP, where GetParam() = (true, false)

 1 FAILED TEST