Diagnosed failure
Parameters/TestRpc.TestCallWithChainCertAndChainCA/SSL_UnixSocket: /data0/somelongdirectorytoavoidrpathissues/src/kudu/src/kudu/rpc/rpc-test.cc:270: Failure
Failed
Bad status: Runtime error: could not verify certificate chain (error with cert: subject=CN = localhost, ST = sadfjas, C = AS, emailAddress = sdflkdsajf, O = lskdfjlsad, OU = sldfkja, issuer=C = AS, ST = ASDfkjdhf, L = lskdjf, O = saldfja, OU = skdjf, CN = localhost, emailAddress = sadjflkadsj): : certificate has expired
Google Test trace:
/data0/somelongdirectorytoavoidrpathissues/src/kudu/src/kudu/rpc/rpc-test.cc:267: Connecting to unix:/tmp/dist-test-taskG1rlyu/test-tmp/rpc-test-17a82fec1fa64a8cba85321717e6bc32.sock
I20260929 02:47:54.900398 15634 test_util.cc:175] -----------------------------------------------
I20260929 02:47:54.900485 15634 test_util.cc:176] Had fatal failures, leaving test files at /tmp/dist-test-taskG1rlyu/test-tmp/rpc-test.6.Parameters_TestRpc.TestCallWithChainCertAndChainCA_SSL_UnixSocket.1790650074782268-15634-0
Full log
Note: This is test shard 7 of 8.
[==========] Running 21 tests from 2 test suites.
[----------] Global test environment set-up.
[----------] 20 tests from Parameters/TestRpc
[ RUN ] Parameters/TestRpc.TestMessengerCreateDestroy/SSL_UnixSocket
WARNING: Logging before InitGoogleLogging() is written to STDERR
I20260929 02:47:54.826088 15634 rpc-test.cc:169] started messenger TestCreateDestroy
[ OK ] Parameters/TestRpc.TestMessengerCreateDestroy/SSL_UnixSocket (27 ms)
[ RUN ] Parameters/TestRpc.TestNegotiationDeadlock/SSL_UnixSocket
I20260929 02:47:54.838763 15654 acceptor_pool.cc:254] collecting diagnostics on the listening RPC socket unix:/tmp/dist-test-taskG1rlyu/test-tmp/rpc-test-593335b704b34504a072f9b108ac2405.sock every 8 connection(s)
I20260929 02:47:54.839071 15655 acceptor_pool.cc:254] collecting diagnostics on the listening RPC socket unix:/tmp/dist-test-taskG1rlyu/test-tmp/rpc-test-593335b704b34504a072f9b108ac2405.sock every 8 connection(s)
[ OK ] Parameters/TestRpc.TestNegotiationDeadlock/SSL_UnixSocket (27 ms)
[ RUN ] Parameters/TestRpc.TestCallWithChainCertAndChainCA/SSL_UnixSocket
I20260929 02:47:54.889644 15670 acceptor_pool.cc:254] collecting diagnostics on the listening RPC socket unix:/tmp/dist-test-taskG1rlyu/test-tmp/rpc-test-17a82fec1fa64a8cba85321717e6bc32.sock every 8 connection(s)
I20260929 02:47:54.889961 15671 acceptor_pool.cc:254] collecting diagnostics on the listening RPC socket unix:/tmp/dist-test-taskG1rlyu/test-tmp/rpc-test-17a82fec1fa64a8cba85321717e6bc32.sock every 8 connection(s)
/data0/somelongdirectorytoavoidrpathissues/src/kudu/src/kudu/rpc/rpc-test.cc:270: Failure
Failed
Bad status: Runtime error: could not verify certificate chain (error with cert: subject=CN = localhost, ST = sadfjas, C = AS, emailAddress = sdflkdsajf, O = lskdfjlsad, OU = sldfkja, issuer=C = AS, ST = ASDfkjdhf, L = lskdjf, O = saldfja, OU = skdjf, CN = localhost, emailAddress = sadjflkadsj): : certificate has expired
Google Test trace:
/data0/somelongdirectorytoavoidrpathissues/src/kudu/src/kudu/rpc/rpc-test.cc:267: Connecting to unix:/tmp/dist-test-taskG1rlyu/test-tmp/rpc-test-17a82fec1fa64a8cba85321717e6bc32.sock
I20260929 02:47:54.900398 15634 test_util.cc:175] -----------------------------------------------
I20260929 02:47:54.900485 15634 test_util.cc:176] Had fatal failures, leaving test files at /tmp/dist-test-taskG1rlyu/test-tmp/rpc-test.6.Parameters_TestRpc.TestCallWithChainCertAndChainCA_SSL_UnixSocket.1790650074782268-15634-0
[ FAILED ] Parameters/TestRpc.TestCallWithChainCertAndChainCA/SSL_UnixSocket, where GetParam() = (true, true) (43 ms)
[ RUN ] Parameters/TestRpc.TestCallWithPasswordProtectedKey/SSL_UnixSocket
I20260929 02:47:54.910243 15695 acceptor_pool.cc:254] collecting diagnostics on the listening RPC socket unix:/tmp/dist-test-taskG1rlyu/test-tmp/rpc-test-e1cc2716585c49b1a78ea568df21b22e.sock every 8 connection(s)
I20260929 02:47:54.910462 15696 acceptor_pool.cc:254] collecting diagnostics on the listening RPC socket unix:/tmp/dist-test-taskG1rlyu/test-tmp/rpc-test-e1cc2716585c49b1a78ea568df21b22e.sock every 8 connection(s)
W20260929 02:47:54.938120 15692 connection.cc:196] Error closing socket: Network error: TlsSocket::Close: Broken pipe
[ OK ] Parameters/TestRpc.TestCallWithPasswordProtectedKey/SSL_UnixSocket (40 ms)
[ RUN ] Parameters/TestRpc.TestCallToBadServer/SSL_UnixSocket
I20260929 02:47:54.971694 15634 rpc-test.cc:394] Status: Network error: Client connection negotiation failed: client connection to 0.0.0.0:0: connect: Connection refused (error 111)
I20260929 02:47:54.972364 15634 rpc-test.cc:394] Status: Network error: Client connection negotiation failed: client connection to 0.0.0.0:0: connect: Connection refused (error 111)
I20260929 02:47:54.972952 15634 rpc-test.cc:394] Status: Network error: Client connection negotiation failed: client connection to 0.0.0.0:0: connect: Connection refused (error 111)
I20260929 02:47:54.973546 15634 rpc-test.cc:394] Status: Network error: Client connection negotiation failed: client connection to 0.0.0.0:0: connect: Connection refused (error 111)
I20260929 02:47:54.974064 15634 rpc-test.cc:394] Status: Network error: Client connection negotiation failed: client connection to 0.0.0.0:0: connect: Connection refused (error 111)
[ OK ] Parameters/TestRpc.TestCallToBadServer/SSL_UnixSocket (34 ms)
[ RUN ] Parameters/TestRpc.TestWrongService/SSL_UnixSocket
I20260929 02:47:54.995204 15730 acceptor_pool.cc:254] collecting diagnostics on the listening RPC socket unix:/tmp/dist-test-taskG1rlyu/test-tmp/rpc-test-ee5c8c874c3c4c4f83a1dc2bcd1e404a.sock every 8 connection(s)
I20260929 02:47:54.995429 15731 acceptor_pool.cc:254] collecting diagnostics on the listening RPC socket unix:/tmp/dist-test-taskG1rlyu/test-tmp/rpc-test-ee5c8c874c3c4c4f83a1dc2bcd1e404a.sock every 8 connection(s)
I20260929 02:47:55.021114 15727 messenger.cc:345] service WrongServiceName not registered on TestServer
[ OK ] Parameters/TestRpc.TestWrongService/SSL_UnixSocket (49 ms)
[ RUN ] Parameters/TestRpc.TestConnectionKeepalive/SSL_UnixSocket
I20260929 02:47:55.050858 15753 acceptor_pool.cc:254] collecting diagnostics on the listening RPC socket unix:/tmp/dist-test-taskG1rlyu/test-tmp/rpc-test-1603507bd1864027a6da9bb7f70d6d50.sock every 8 connection(s)
I20260929 02:47:55.051070 15754 acceptor_pool.cc:254] collecting diagnostics on the listening RPC socket unix:/tmp/dist-test-taskG1rlyu/test-tmp/rpc-test-1603507bd1864027a6da9bb7f70d6d50.sock every 8 connection(s)
I20260929 02:47:55.051820 15634 rpc-test.cc:488] Connecting to unix:/tmp/dist-test-taskG1rlyu/test-tmp/rpc-test-1603507bd1864027a6da9bb7f70d6d50.sock
W20260929 02:47:55.527679 15766 connection.cc:196] Error closing socket: Network error: TlsSocket::Close: Broken pipe
[ OK ] Parameters/TestRpc.TestConnectionKeepalive/SSL_UnixSocket (1070 ms)
[ RUN ] Parameters/TestRpc.TestClientConnectionMetrics/SSL_UnixSocket
I20260929 02:47:56.113031 15778 acceptor_pool.cc:254] collecting diagnostics on the listening RPC socket unix:/tmp/dist-test-taskG1rlyu/test-tmp/rpc-test-e78343d3948144a2b2eeee3dc1fee850.sock every 8 connection(s)
I20260929 02:47:56.113257 15779 acceptor_pool.cc:254] collecting diagnostics on the listening RPC socket unix:/tmp/dist-test-taskG1rlyu/test-tmp/rpc-test-e78343d3948144a2b2eeee3dc1fee850.sock every 8 connection(s)
I20260929 02:47:56.114109 15634 rpc-test.cc:569] Connecting to unix:/tmp/dist-test-taskG1rlyu/test-tmp/rpc-test-e78343d3948144a2b2eeee3dc1fee850.sock
W20260929 02:48:15.786567 15775 connection.cc:196] Error closing socket: Network error: TlsSocket::Close: Broken pipe
[ OK ] Parameters/TestRpc.TestClientConnectionMetrics/SSL_UnixSocket (19696 ms)
[ RUN ] Parameters/TestRpc.TestCredentialsPolicy/SSL_UnixSocket
I20260929 02:48:15.806418 15801 acceptor_pool.cc:254] collecting diagnostics on the listening RPC socket unix:/tmp/dist-test-taskG1rlyu/test-tmp/rpc-test-824b3abd6b584940b04410d34313a6c3.sock every 8 connection(s)
I20260929 02:48:15.806620 15802 acceptor_pool.cc:254] collecting diagnostics on the listening RPC socket unix:/tmp/dist-test-taskG1rlyu/test-tmp/rpc-test-824b3abd6b584940b04410d34313a6c3.sock every 8 connection(s)
I20260929 02:48:15.807487 15634 rpc-test.cc:700] Connecting to unix:/tmp/dist-test-taskG1rlyu/test-tmp/rpc-test-824b3abd6b584940b04410d34313a6c3.sock
W20260929 02:48:15.827569 15800 connection.cc:196] Error closing socket: Network error: TlsSocket::Close: Broken pipe
[ OK ] Parameters/TestRpc.TestCredentialsPolicy/SSL_UnixSocket (44 ms)
[ RUN ] Parameters/TestRpc.TestCallLongerThanKeepalive/SSL_UnixSocket
I20260929 02:48:15.847185 15826 acceptor_pool.cc:254] collecting diagnostics on the listening RPC socket unix:/tmp/dist-test-taskG1rlyu/test-tmp/rpc-test-ce0123d3190d453f9e2d96b69b0c0f05.sock every 8 connection(s)
I20260929 02:48:15.847352 15827 acceptor_pool.cc:254] collecting diagnostics on the listening RPC socket unix:/tmp/dist-test-taskG1rlyu/test-tmp/rpc-test-ce0123d3190d453f9e2d96b69b0c0f05.sock every 8 connection(s)
I20260929 02:48:15.863471 15830 rpc-test-base.h:222] got call: sleep_micros: 3000000 deferred: true
I20260929 02:48:18.865119 15830 rpcz_store.cc:275] Call kudu.rpc.GenericCalculatorService.Sleep from unix:<unnamed> (request call id 0) took 3001 ms. Trace:
I20260929 02:48:18.865257 15830 rpcz_store.cc:276] 0929 02:48:15.863374 (+ 0us) service_pool.cc:170] Inserting onto call queue
0929 02:48:15.863427 (+ 53us) service_pool.cc:227] Handling call
0929 02:48:18.865069 (+3001642us) inbound_call.cc:173] Queueing success response
Metrics: {}
W20260929 02:48:18.867828 15823 connection.cc:196] Error closing socket: Network error: TlsSocket::Close: Broken pipe
[ OK ] Parameters/TestRpc.TestCallLongerThanKeepalive/SSL_UnixSocket (3033 ms)
[ RUN ] Parameters/TestRpc.TestRpcSidecar/SSL_UnixSocket
I20260929 02:48:18.885399 15851 acceptor_pool.cc:254] collecting diagnostics on the listening RPC socket unix:/tmp/dist-test-taskG1rlyu/test-tmp/rpc-test-b06ea995de7a43949fe32b104268be72.sock every 8 connection(s)
I20260929 02:48:18.885612 15852 acceptor_pool.cc:254] collecting diagnostics on the listening RPC socket unix:/tmp/dist-test-taskG1rlyu/test-tmp/rpc-test-b06ea995de7a43949fe32b104268be72.sock every 8 connection(s)
W20260929 02:48:18.980212 15848 connection.cc:196] Error closing socket: Network error: TlsSocket::Close: Broken pipe
[ OK ] Parameters/TestRpc.TestRpcSidecar/SSL_UnixSocket (111 ms)
[ RUN ] Parameters/TestRpc.TestRpcSidecarLimits/SSL_UnixSocket
I20260929 02:48:20.940372 15876 acceptor_pool.cc:254] collecting diagnostics on the listening RPC socket unix:/tmp/dist-test-taskG1rlyu/test-tmp/rpc-test-a9723ee5cd82463299303b1a9cf7578c.sock every 8 connection(s)
I20260929 02:48:20.940631 15877 acceptor_pool.cc:254] collecting diagnostics on the listening RPC socket unix:/tmp/dist-test-taskG1rlyu/test-tmp/rpc-test-a9723ee5cd82463299303b1a9cf7578c.sock every 8 connection(s)
W20260929 02:48:20.955540 15634 serialization.cc:72] Serialized kudu.rpc_test.PushStringsRequestPB (2147483654 bytes) is larger than the maximum configured RPC message size (52428800 bytes). Sending anyway, but peer may reject the data.
W20260929 02:48:20.961017 15873 connection.cc:535] server connection from unix:<unnamed> recv error: Network error: RPC frame had a length of 2147483714, but we only support messages up to 52428800 bytes long.
W20260929 02:48:20.961159 15873 connection.cc:158] shutting down server connection from unix:<unnamed> with pending inbound data: 4/2147483714 bytes received; last active 0 ns ago: status Network error: RPC frame had a length of 2147483714, but we only support messages up to 52428800 bytes long.
W20260929 02:48:20.961572 15889 connection.cc:196] Error closing socket: Network error: TlsSocket::Close: Broken pipe
I20260929 02:48:20.984500 15901 acceptor_pool.cc:254] collecting diagnostics on the listening RPC socket unix:/tmp/dist-test-taskG1rlyu/test-tmp/rpc-test-a9723ee5cd82463299303b1a9cf7578c.sock every 8 connection(s)
I20260929 02:48:20.984783 15902 acceptor_pool.cc:254] collecting diagnostics on the listening RPC socket unix:/tmp/dist-test-taskG1rlyu/test-tmp/rpc-test-a9723ee5cd82463299303b1a9cf7578c.sock every 8 connection(s)
W20260929 02:48:26.366611 15898 connection.cc:577] server connection from unix:<unnamed>: received bad data: 'Corruption: Invalid packet: message had a length of 2147483710, but we only support messages up to 2147483647 bytes
'
W20260929 02:48:26.367221 15914 connection.cc:196] Error closing socket: Network error: TlsSocket::Close: Broken pipe
[ OK ] Parameters/TestRpc.TestRpcSidecarLimits/SSL_UnixSocket (7806 ms)
[ RUN ] Parameters/TestRpc.TestCallTimeoutDoesntAffectNegotiation/SSL_UnixSocket
I20260929 02:48:26.810993 15926 acceptor_pool.cc:254] collecting diagnostics on the listening RPC socket unix:/tmp/dist-test-taskG1rlyu/test-tmp/rpc-test-41402ac291ca4e89932d1465ec356f58.sock every 8 connection(s)
I20260929 02:48:26.811256 15927 acceptor_pool.cc:254] collecting diagnostics on the listening RPC socket unix:/tmp/dist-test-taskG1rlyu/test-tmp/rpc-test-41402ac291ca4e89932d1465ec356f58.sock every 8 connection(s)
W20260929 02:48:26.832844 15922 negotiation.cc:266] Injecting 500ms delay in negotiation
I20260929 02:48:26.883258 15634 rpc-test-base.h:595] status: Timed out: connection negotiation to unix:/tmp/dist-test-taskG1rlyu/test-tmp/rpc-test-41402ac291ca4e89932d1465ec356f58.sock for RPC Sleep timed out after 0.050s (ON_OUTBOUND_QUEUE), seconds elapsed: 0.0509355
[ OK ] Parameters/TestRpc.TestCallTimeoutDoesntAffectNegotiation/SSL_UnixSocket (553 ms)
[ RUN ] Parameters/TestRpc.TestRpcHandlerLatencyMetric/SSL_UnixSocket
I20260929 02:48:27.353854 15951 acceptor_pool.cc:254] collecting diagnostics on the listening RPC socket unix:/tmp/dist-test-taskG1rlyu/test-tmp/rpc-test-b39dc3b09c0c4e4598105d10cba0200b.sock every 8 connection(s)
I20260929 02:48:27.354094 15952 acceptor_pool.cc:254] collecting diagnostics on the listening RPC socket unix:/tmp/dist-test-taskG1rlyu/test-tmp/rpc-test-b39dc3b09c0c4e4598105d10cba0200b.sock every 8 connection(s)
I20260929 02:48:27.420869 15634 rpc-test.cc:1236] Sleep() min lat: 20574
I20260929 02:48:27.421013 15634 rpc-test.cc:1237] Sleep() mean lat: 20574
I20260929 02:48:27.421082 15634 rpc-test.cc:1238] Sleep() max lat: 20574
I20260929 02:48:27.421115 15634 rpc-test.cc:1239] Sleep() #calls: 1
[ OK ] Parameters/TestRpc.TestRpcHandlerLatencyMetric/SSL_UnixSocket (83 ms)
[ RUN ] Parameters/TestRpc.TimedOutOnResponseMetricServiceQueue/SSL_UnixSocket
I20260929 02:48:27.457615 15977 acceptor_pool.cc:254] collecting diagnostics on the listening RPC socket unix:/tmp/dist-test-taskG1rlyu/test-tmp/rpc-test-8480fd3698e6410a993fb7f4c8445a46.sock every 8 connection(s)
I20260929 02:48:27.457829 15978 acceptor_pool.cc:254] collecting diagnostics on the listening RPC socket unix:/tmp/dist-test-taskG1rlyu/test-tmp/rpc-test-8480fd3698e6410a993fb7f4c8445a46.sock every 8 connection(s)
W20260929 02:48:27.521907 15979 rpcz_store.cc:267] Call kudu.rpc_test.CalculatorService.Sleep from unix:<unnamed> (request call id 2) took 20 ms (client timeout 20 ms). Trace:
W20260929 02:48:27.522070 15979 rpcz_store.cc:269] 0929 02:48:27.501574 (+ 0us) service_pool.cc:170] Inserting onto call queue
0929 02:48:27.521853 (+ 20279us) service_pool.cc:214] Skipping call since client already timed out
0929 02:48:27.521891 (+ 38us) inbound_call.cc:173] Queueing failure response
Metrics: {}
[ OK ] Parameters/TestRpc.TimedOutOnResponseMetricServiceQueue/SSL_UnixSocket (100 ms)
[ RUN ] Parameters/TestRpc.RpcPendingConnectionsMetric/SSL_UnixSocket
I20260929 02:48:27.529884 16000 acceptor_pool.cc:254] collecting diagnostics on the listening RPC socket 0.0.0.0:46189 every 8 connection(s)
I20260929 02:48:27.530110 16001 acceptor_pool.cc:254] collecting diagnostics on the listening RPC socket 0.0.0.0:46189 every 8 connection(s)
W20260929 02:48:27.532004 15996 negotiation.cc:337] Failed RPC negotiation. Trace:
0929 02:48:27.531404 (+ 0us) reactor.cc:625] Submitting negotiation task for server connection from 127.0.0.1:51986 (local address 127.0.0.1:46189)
0929 02:48:27.531546 (+ 142us) server_negotiation.cc:206] Beginning negotiation
0929 02:48:27.531549 (+ 3us) server_negotiation.cc:399] Waiting for connection header
0929 02:48:27.531699 (+ 150us) negotiation.cc:327] Negotiation complete: Network error: Server connection negotiation failed: server connection from 127.0.0.1:51986: BlockingRecv error: recv got EOF from 127.0.0.1:51986 (error 108)
Metrics: {"server-negotiator.queue_time_us":37}
[ OK ] Parameters/TestRpc.RpcPendingConnectionsMetric/SSL_UnixSocket (18 ms)
[ RUN ] Parameters/TestRpc.TestRpcContextClientDeadline/SSL_UnixSocket
I20260929 02:48:27.555177 16016 acceptor_pool.cc:254] collecting diagnostics on the listening RPC socket unix:/tmp/dist-test-taskG1rlyu/test-tmp/rpc-test-2b672f29caab4a1c8f88bd7db8dd8213.sock every 8 connection(s)
I20260929 02:48:27.555383 16017 acceptor_pool.cc:254] collecting diagnostics on the listening RPC socket unix:/tmp/dist-test-taskG1rlyu/test-tmp/rpc-test-2b672f29caab4a1c8f88bd7db8dd8213.sock every 8 connection(s)
[ OK ] Parameters/TestRpc.TestRpcContextClientDeadline/SSL_UnixSocket (51 ms)
[ RUN ] Parameters/TestRpc.TestApplicationFeatureFlagUnsupportedServer/SSL_UnixSocket
I20260929 02:48:27.625278 16041 acceptor_pool.cc:254] collecting diagnostics on the listening RPC socket unix:/tmp/dist-test-taskG1rlyu/test-tmp/rpc-test-92f0f87eb3b54535a3606e452a0ab8e0.sock every 8 connection(s)
I20260929 02:48:27.625456 16042 acceptor_pool.cc:254] collecting diagnostics on the listening RPC socket unix:/tmp/dist-test-taskG1rlyu/test-tmp/rpc-test-92f0f87eb3b54535a3606e452a0ab8e0.sock every 8 connection(s)
[ OK ] Parameters/TestRpc.TestApplicationFeatureFlagUnsupportedServer/SSL_UnixSocket (58 ms)
[ RUN ] Parameters/TestRpc.TestCancellationAsync/SSL_UnixSocket
I20260929 02:48:27.668053 16066 acceptor_pool.cc:254] collecting diagnostics on the listening RPC socket unix:/tmp/dist-test-taskG1rlyu/test-tmp/rpc-test-3fd105e7cb424914ae7cb358c9569967.sock every 8 connection(s)
I20260929 02:48:27.668278 16067 acceptor_pool.cc:254] collecting diagnostics on the listening RPC socket unix:/tmp/dist-test-taskG1rlyu/test-tmp/rpc-test-3fd105e7cb424914ae7cb358c9569967.sock every 8 connection(s)
I20260929 02:48:27.669040 15634 rpc-test.cc:1716] Connecting to unix:/tmp/dist-test-taskG1rlyu/test-tmp/rpc-test-3fd105e7cb424914ae7cb358c9569967.sock
I20260929 02:48:27.690071 15634 test_util.cc:268] Using random seed: 932576324
I20260929 02:48:27.721761 16070 rpc-test-base.h:240] got call: sleep_micros: 500 pattern: 4294967295 num_repetitions: 2097152 sidecar_idx: 0
I20260929 02:48:27.748668 16069 rpc-test-base.h:240] got call: sleep_micros: 500 pattern: 4294967295 num_repetitions: 2097152 sidecar_idx: 0
I20260929 02:48:27.772459 16070 rpc-test-base.h:240] got call: sleep_micros: 500 pattern: 4294967295 num_repetitions: 2097152 sidecar_idx: 0
I20260929 02:48:27.805457 16069 rpc-test-base.h:240] got call: sleep_micros: 500 pattern: 4294967295 num_repetitions: 2097152 sidecar_idx: 0
I20260929 02:48:27.833216 16070 rpc-test-base.h:240] got call: sleep_micros: 500 pattern: 4294967295 num_repetitions: 2097152 sidecar_idx: 0
I20260929 02:48:27.860498 16069 rpc-test-base.h:240] got call: sleep_micros: 500 pattern: 4294967295 num_repetitions: 2097152 sidecar_idx: 0
I20260929 02:48:27.888494 16070 rpc-test-base.h:240] got call: sleep_micros: 500 pattern: 4294967295 num_repetitions: 2097152 sidecar_idx: 0
W20260929 02:48:27.890875 16063 connection.cc:196] Error closing socket: Network error: TlsSocket::Close: Broken pipe
W20260929 02:48:27.912165 16063 connection.cc:441] server connection from unix:<unnamed> torn down before Call kudu.rpc.GenericCalculatorService.SleepWithSidecar from unix:<unnamed> (request call id 8) could send its response
W20260929 02:48:27.932165 16063 connection.cc:441] server connection from unix:<unnamed> torn down before Call kudu.rpc.GenericCalculatorService.SleepWithSidecar from unix:<unnamed> (request call id 9) could send its response
[ OK ] Parameters/TestRpc.TestCancellationAsync/SSL_UnixSocket (280 ms)
[ RUN ] Parameters/TestRpc.TestPerformanceBySocketType/SSL_UnixSocket
I20260929 02:48:27.966289 16091 acceptor_pool.cc:254] collecting diagnostics on the listening RPC socket unix:/tmp/dist-test-taskG1rlyu/test-tmp/rpc-test-c6d1154dcf5c47db89dfc10029241992.sock every 8 connection(s)
I20260929 02:48:27.966517 16092 acceptor_pool.cc:254] collecting diagnostics on the listening RPC socket unix:/tmp/dist-test-taskG1rlyu/test-tmp/rpc-test-c6d1154dcf5c47db89dfc10029241992.sock every 8 connection(s)
I20260929 02:48:27.967381 15634 rpc-test.cc:1846] Connecting to unix:/tmp/dist-test-taskG1rlyu/test-tmp/rpc-test-c6d1154dcf5c47db89dfc10029241992.sock
I20260929 02:48:30.885905 15634 rpc-test.cc:1859] Sending 1024MB via ssl-enabled unix socket: real 2.887s user 2.895s sys 2.027s
I20260929 02:48:33.739621 15634 rpc-test.cc:1859] Sending 1024MB via ssl-enabled unix socket: real 2.854s user 2.848s sys 1.993s
I20260929 02:48:36.628082 15634 rpc-test.cc:1859] Sending 1024MB via ssl-enabled unix socket: real 2.888s user 2.854s sys 2.056s
I20260929 02:48:39.524816 15634 rpc-test.cc:1859] Sending 1024MB via ssl-enabled unix socket: real 2.897s user 2.785s sys 2.139s
I20260929 02:48:42.371548 15634 rpc-test.cc:1859] Sending 1024MB via ssl-enabled unix socket: real 2.847s user 2.847s sys 1.991s
W20260929 02:48:42.373189 16088 connection.cc:196] Error closing socket: Network error: TlsSocket::Close: Broken pipe
[ OK ] Parameters/TestRpc.TestPerformanceBySocketType/SSL_UnixSocket (14443 ms)
[----------] 20 tests from Parameters/TestRpc (47577 ms total)
[----------] 1 test from Parameters/TestRpcSocketTxRxQueue
[ RUN ] Parameters/TestRpcSocketTxRxQueue.AcceptorRxQueueSizeMetric/0
I20260929 02:48:42.385950 16116 acceptor_pool.cc:254] collecting diagnostics on the listening RPC socket 0.0.0.0:38815 every 1 connection(s)
I20260929 02:48:42.386193 16117 acceptor_pool.cc:254] collecting diagnostics on the listening RPC socket 0.0.0.0:38815 every 1 connection(s)
W20260929 02:48:42.387746 16112 negotiation.cc:337] Failed RPC negotiation. Trace:
0929 02:48:42.387361 (+ 0us) reactor.cc:625] Submitting negotiation task for server connection from 127.0.0.1:50340 (local address 127.0.0.1:38815)
0929 02:48:42.387503 (+ 142us) server_negotiation.cc:206] Beginning negotiation
0929 02:48:42.387507 (+ 4us) server_negotiation.cc:399] Waiting for connection header
0929 02:48:42.387619 (+ 112us) negotiation.cc:327] Negotiation complete: Network error: Server connection negotiation failed: server connection from 127.0.0.1:50340: BlockingRecv error: recv got EOF from 127.0.0.1:50340 (error 108)
Metrics: {"server-negotiator.queue_time_us":43}
[ OK ] Parameters/TestRpcSocketTxRxQueue.AcceptorRxQueueSizeMetric/0 (12 ms)
[----------] 1 test from Parameters/TestRpcSocketTxRxQueue (12 ms total)
[----------] Global test environment tear-down
[==========] 21 tests from 2 test suites ran. (47590 ms total)
[ PASSED ] 20 tests.
[ FAILED ] 1 test, listed below:
[ FAILED ] Parameters/TestRpc.TestCallWithChainCertAndChainCA/SSL_UnixSocket, where GetParam() = (true, true)
1 FAILED TEST