Diagnosed failure
Parameters/TestRpc.TestCallWithChainCertAndChainCA/SSL_UnixSocket: /data0/somelongdirectorytoavoidrpathissues/src/kudu/src/kudu/rpc/rpc-test.cc:270: Failure
Failed
Bad status: Runtime error: could not verify certificate chain (error with cert: subject=CN = localhost, ST = sadfjas, C = AS, emailAddress = sdflkdsajf, O = lskdfjlsad, OU = sldfkja, issuer=C = AS, ST = ASDfkjdhf, L = lskdjf, O = saldfja, OU = skdjf, CN = localhost, emailAddress = sadjflkadsj): : certificate has expired
Google Test trace:
/data0/somelongdirectorytoavoidrpathissues/src/kudu/src/kudu/rpc/rpc-test.cc:267: Connecting to unix:/tmp/dist-test-task0FfUOc/test-tmp/rpc-test-8cbe35650cd14925bdd666bb27727499.sock
I20260926 12:20:16.399554 808 test_util.cc:175] -----------------------------------------------
I20260926 12:20:16.399765 808 test_util.cc:176] Had fatal failures, leaving test files at /tmp/dist-test-task0FfUOc/test-tmp/rpc-test.6.Parameters_TestRpc.TestCallWithChainCertAndChainCA_SSL_UnixSocket.1790425214995852-808-0
Full log
Note: This is test shard 7 of 8.
[==========] Running 21 tests from 2 test suites.
[----------] Global test environment set-up.
[----------] 20 tests from Parameters/TestRpc
[ RUN ] Parameters/TestRpc.TestMessengerCreateDestroy/SSL_UnixSocket
WARNING: Logging before InitGoogleLogging() is written to STDERR
I20260926 12:20:15.120842 808 rpc-test.cc:169] started messenger TestCreateDestroy
[ OK ] Parameters/TestRpc.TestMessengerCreateDestroy/SSL_UnixSocket (1195 ms)
[ RUN ] Parameters/TestRpc.TestNegotiationDeadlock/SSL_UnixSocket
I20260926 12:20:16.285763 830 acceptor_pool.cc:254] collecting diagnostics on the listening RPC socket unix:/tmp/dist-test-task0FfUOc/test-tmp/rpc-test-856bfdac15164beca1e3176a7180296b.sock every 8 connection(s)
I20260926 12:20:16.287289 831 acceptor_pool.cc:254] collecting diagnostics on the listening RPC socket unix:/tmp/dist-test-task0FfUOc/test-tmp/rpc-test-856bfdac15164beca1e3176a7180296b.sock every 8 connection(s)
[ OK ] Parameters/TestRpc.TestNegotiationDeadlock/SSL_UnixSocket (101 ms)
[ RUN ] Parameters/TestRpc.TestCallWithChainCertAndChainCA/SSL_UnixSocket
I20260926 12:20:16.370139 846 acceptor_pool.cc:254] collecting diagnostics on the listening RPC socket unix:/tmp/dist-test-task0FfUOc/test-tmp/rpc-test-8cbe35650cd14925bdd666bb27727499.sock every 8 connection(s)
I20260926 12:20:16.372359 847 acceptor_pool.cc:254] collecting diagnostics on the listening RPC socket unix:/tmp/dist-test-task0FfUOc/test-tmp/rpc-test-8cbe35650cd14925bdd666bb27727499.sock every 8 connection(s)
/data0/somelongdirectorytoavoidrpathissues/src/kudu/src/kudu/rpc/rpc-test.cc:270: Failure
Failed
Bad status: Runtime error: could not verify certificate chain (error with cert: subject=CN = localhost, ST = sadfjas, C = AS, emailAddress = sdflkdsajf, O = lskdfjlsad, OU = sldfkja, issuer=C = AS, ST = ASDfkjdhf, L = lskdjf, O = saldfja, OU = skdjf, CN = localhost, emailAddress = sadjflkadsj): : certificate has expired
Google Test trace:
/data0/somelongdirectorytoavoidrpathissues/src/kudu/src/kudu/rpc/rpc-test.cc:267: Connecting to unix:/tmp/dist-test-task0FfUOc/test-tmp/rpc-test-8cbe35650cd14925bdd666bb27727499.sock
I20260926 12:20:16.399554 808 test_util.cc:175] -----------------------------------------------
I20260926 12:20:16.399765 808 test_util.cc:176] Had fatal failures, leaving test files at /tmp/dist-test-task0FfUOc/test-tmp/rpc-test.6.Parameters_TestRpc.TestCallWithChainCertAndChainCA_SSL_UnixSocket.1790425214995852-808-0
[ FAILED ] Parameters/TestRpc.TestCallWithChainCertAndChainCA/SSL_UnixSocket, where GetParam() = (true, true) (54 ms)
[ RUN ] Parameters/TestRpc.TestCallWithPasswordProtectedKey/SSL_UnixSocket
I20260926 12:20:16.422801 871 acceptor_pool.cc:254] collecting diagnostics on the listening RPC socket unix:/tmp/dist-test-task0FfUOc/test-tmp/rpc-test-2a9ec43fcfab4ef5ad0e2330fec15f52.sock every 8 connection(s)
I20260926 12:20:16.423440 872 acceptor_pool.cc:254] collecting diagnostics on the listening RPC socket unix:/tmp/dist-test-task0FfUOc/test-tmp/rpc-test-2a9ec43fcfab4ef5ad0e2330fec15f52.sock every 8 connection(s)
W20260926 12:20:16.466996 868 connection.cc:196] Error closing socket: Network error: TlsSocket::Close: Broken pipe
[ OK ] Parameters/TestRpc.TestCallWithPasswordProtectedKey/SSL_UnixSocket (73 ms)
[ RUN ] Parameters/TestRpc.TestCallToBadServer/SSL_UnixSocket
I20260926 12:20:16.491689 808 rpc-test.cc:394] Status: Network error: Client connection negotiation failed: client connection to 0.0.0.0:0: connect: Connection refused (error 111)
I20260926 12:20:16.493047 808 rpc-test.cc:394] Status: Network error: Client connection negotiation failed: client connection to 0.0.0.0:0: connect: Connection refused (error 111)
I20260926 12:20:16.494344 808 rpc-test.cc:394] Status: Network error: Client connection negotiation failed: client connection to 0.0.0.0:0: connect: Connection refused (error 111)
I20260926 12:20:16.495842 808 rpc-test.cc:394] Status: Network error: Client connection negotiation failed: client connection to 0.0.0.0:0: connect: Connection refused (error 111)
I20260926 12:20:16.497172 808 rpc-test.cc:394] Status: Network error: Client connection negotiation failed: client connection to 0.0.0.0:0: connect: Connection refused (error 111)
[ OK ] Parameters/TestRpc.TestCallToBadServer/SSL_UnixSocket (26 ms)
[ RUN ] Parameters/TestRpc.TestWrongService/SSL_UnixSocket
I20260926 12:20:16.525921 906 acceptor_pool.cc:254] collecting diagnostics on the listening RPC socket unix:/tmp/dist-test-task0FfUOc/test-tmp/rpc-test-946786ba45644975964418274834e376.sock every 8 connection(s)
I20260926 12:20:16.526782 907 acceptor_pool.cc:254] collecting diagnostics on the listening RPC socket unix:/tmp/dist-test-task0FfUOc/test-tmp/rpc-test-946786ba45644975964418274834e376.sock every 8 connection(s)
I20260926 12:20:16.555007 903 messenger.cc:345] service WrongServiceName not registered on TestServer
[ OK ] Parameters/TestRpc.TestWrongService/SSL_UnixSocket (63 ms)
[ RUN ] Parameters/TestRpc.TestConnectionKeepalive/SSL_UnixSocket
I20260926 12:20:16.585754 929 acceptor_pool.cc:254] collecting diagnostics on the listening RPC socket unix:/tmp/dist-test-task0FfUOc/test-tmp/rpc-test-d60587128930439fb6103b7fad80825a.sock every 8 connection(s)
I20260926 12:20:16.586529 930 acceptor_pool.cc:254] collecting diagnostics on the listening RPC socket unix:/tmp/dist-test-task0FfUOc/test-tmp/rpc-test-d60587128930439fb6103b7fad80825a.sock every 8 connection(s)
I20260926 12:20:16.589891 808 rpc-test.cc:488] Connecting to unix:/tmp/dist-test-task0FfUOc/test-tmp/rpc-test-d60587128930439fb6103b7fad80825a.sock
W20260926 12:20:17.067929 942 connection.cc:196] Error closing socket: Network error: TlsSocket::Close: Broken pipe
[ OK ] Parameters/TestRpc.TestConnectionKeepalive/SSL_UnixSocket (1083 ms)
[ RUN ] Parameters/TestRpc.TestClientConnectionMetrics/SSL_UnixSocket
I20260926 12:20:17.670178 954 acceptor_pool.cc:254] collecting diagnostics on the listening RPC socket unix:/tmp/dist-test-task0FfUOc/test-tmp/rpc-test-2a48b58fb77b4cdea0f298645dfb072e.sock every 8 connection(s)
I20260926 12:20:17.670910 955 acceptor_pool.cc:254] collecting diagnostics on the listening RPC socket unix:/tmp/dist-test-task0FfUOc/test-tmp/rpc-test-2a48b58fb77b4cdea0f298645dfb072e.sock every 8 connection(s)
I20260926 12:20:17.674046 808 rpc-test.cc:569] Connecting to unix:/tmp/dist-test-task0FfUOc/test-tmp/rpc-test-2a48b58fb77b4cdea0f298645dfb072e.sock
W20260926 12:22:39.164594 951 connection.cc:196] Error closing socket: Network error: TlsSocket::Close: Broken pipe
[ OK ] Parameters/TestRpc.TestClientConnectionMetrics/SSL_UnixSocket (141525 ms)
[ RUN ] Parameters/TestRpc.TestCredentialsPolicy/SSL_UnixSocket
I20260926 12:22:39.206625 991 acceptor_pool.cc:254] collecting diagnostics on the listening RPC socket unix:/tmp/dist-test-task0FfUOc/test-tmp/rpc-test-3cff8767e9e04ba585654ea4ba47468b.sock every 8 connection(s)
I20260926 12:22:39.207504 992 acceptor_pool.cc:254] collecting diagnostics on the listening RPC socket unix:/tmp/dist-test-task0FfUOc/test-tmp/rpc-test-3cff8767e9e04ba585654ea4ba47468b.sock every 8 connection(s)
I20260926 12:22:39.210753 808 rpc-test.cc:700] Connecting to unix:/tmp/dist-test-task0FfUOc/test-tmp/rpc-test-3cff8767e9e04ba585654ea4ba47468b.sock
W20260926 12:22:39.246994 990 connection.cc:196] Error closing socket: Network error: TlsSocket::Close: Broken pipe
[ OK ] Parameters/TestRpc.TestCredentialsPolicy/SSL_UnixSocket (97 ms)
[ RUN ] Parameters/TestRpc.TestCallLongerThanKeepalive/SSL_UnixSocket
I20260926 12:22:39.291955 1016 acceptor_pool.cc:254] collecting diagnostics on the listening RPC socket unix:/tmp/dist-test-task0FfUOc/test-tmp/rpc-test-f0a8af3966dc4aec8e3b72f68f5499df.sock every 8 connection(s)
I20260926 12:22:39.292712 1017 acceptor_pool.cc:254] collecting diagnostics on the listening RPC socket unix:/tmp/dist-test-task0FfUOc/test-tmp/rpc-test-f0a8af3966dc4aec8e3b72f68f5499df.sock every 8 connection(s)
I20260926 12:22:39.330948 1020 rpc-test-base.h:222] got call: sleep_micros: 3000000 deferred: true
I20260926 12:22:42.335206 1020 rpcz_store.cc:275] Call kudu.rpc.GenericCalculatorService.Sleep from unix:<unnamed> (request call id 0) took 3004 ms. Trace:
I20260926 12:22:42.335520 1020 rpcz_store.cc:276] 0926 12:22:39.330779 (+ 0us) service_pool.cc:170] Inserting onto call queue
0926 12:22:39.330884 (+ 105us) service_pool.cc:227] Handling call
0926 12:22:42.335152 (+3004268us) inbound_call.cc:173] Queueing success response
Metrics: {}
W20260926 12:22:42.339771 1013 connection.cc:196] Error closing socket: Network error: TlsSocket::Close: Broken pipe
[ OK ] Parameters/TestRpc.TestCallLongerThanKeepalive/SSL_UnixSocket (3074 ms)
[ RUN ] Parameters/TestRpc.TestRpcSidecar/SSL_UnixSocket
I20260926 12:22:42.393148 1041 acceptor_pool.cc:254] collecting diagnostics on the listening RPC socket unix:/tmp/dist-test-task0FfUOc/test-tmp/rpc-test-b8b84113aade400ba56d55d2149829cb.sock every 8 connection(s)
I20260926 12:22:42.393879 1042 acceptor_pool.cc:254] collecting diagnostics on the listening RPC socket unix:/tmp/dist-test-task0FfUOc/test-tmp/rpc-test-b8b84113aade400ba56d55d2149829cb.sock every 8 connection(s)
[ OK ] Parameters/TestRpc.TestRpcSidecar/SSL_UnixSocket (580 ms)
[ RUN ] Parameters/TestRpc.TestRpcSidecarLimits/SSL_UnixSocket
I20260926 12:23:00.228616 1068 acceptor_pool.cc:254] collecting diagnostics on the listening RPC socket unix:/tmp/dist-test-task0FfUOc/test-tmp/rpc-test-e54c4b1c92e2470690839ce4a56afad9.sock every 8 connection(s)
I20260926 12:23:00.229419 1069 acceptor_pool.cc:254] collecting diagnostics on the listening RPC socket unix:/tmp/dist-test-task0FfUOc/test-tmp/rpc-test-e54c4b1c92e2470690839ce4a56afad9.sock every 8 connection(s)
W20260926 12:23:00.248124 808 serialization.cc:72] Serialized kudu.rpc_test.PushStringsRequestPB (2147483654 bytes) is larger than the maximum configured RPC message size (52428800 bytes). Sending anyway, but peer may reject the data.
W20260926 12:23:00.258363 1065 connection.cc:535] server connection from unix:<unnamed> recv error: Network error: RPC frame had a length of 2147483714, but we only support messages up to 52428800 bytes long.
W20260926 12:23:00.258728 1065 connection.cc:158] shutting down server connection from unix:<unnamed> with pending inbound data: 4/2147483714 bytes received; last active 0 ns ago: status Network error: RPC frame had a length of 2147483714, but we only support messages up to 52428800 bytes long.
W20260926 12:23:00.259663 1081 connection.cc:698] client connection to unix:/tmp/dist-test-task0FfUOc/test-tmp/rpc-test-e54c4b1c92e2470690839ce4a56afad9.sock send error: Network error: failed to write to TLS socket: Broken pipe
W20260926 12:23:00.260238 1081 connection.cc:196] Error closing socket: Network error: TlsSocket::Close: Success
[ OK ] Parameters/TestRpc.TestRpcSidecarLimits/SSL_UnixSocket (18027 ms)
[ RUN ] Parameters/TestRpc.TestCallTimeoutDoesntAffectNegotiation/SSL_UnixSocket
I20260926 12:23:00.969312 1093 acceptor_pool.cc:254] collecting diagnostics on the listening RPC socket unix:/tmp/dist-test-task0FfUOc/test-tmp/rpc-test-89690459eac64e34877b9b2b1346f1fe.sock every 8 connection(s)
I20260926 12:23:00.970044 1094 acceptor_pool.cc:254] collecting diagnostics on the listening RPC socket unix:/tmp/dist-test-task0FfUOc/test-tmp/rpc-test-89690459eac64e34877b9b2b1346f1fe.sock every 8 connection(s)
W20260926 12:23:01.010046 1089 negotiation.cc:266] Injecting 500ms delay in negotiation
I20260926 12:23:01.059659 808 rpc-test-base.h:595] status: Timed out: connection negotiation to unix:/tmp/dist-test-task0FfUOc/test-tmp/rpc-test-89690459eac64e34877b9b2b1346f1fe.sock for RPC Sleep timed out after 0.050s (ON_OUTBOUND_QUEUE), seconds elapsed: 0.0506281
W20260926 12:23:01.522899 1090 connection.cc:196] Error closing socket: Network error: TlsSocket::Close: Broken pipe
[ OK ] Parameters/TestRpc.TestCallTimeoutDoesntAffectNegotiation/SSL_UnixSocket (573 ms)
[ RUN ] Parameters/TestRpc.TestRpcHandlerLatencyMetric/SSL_UnixSocket
I20260926 12:23:01.565411 1118 acceptor_pool.cc:254] collecting diagnostics on the listening RPC socket unix:/tmp/dist-test-task0FfUOc/test-tmp/rpc-test-46f2fd238220460dbcb7fc7103ae7ccf.sock every 8 connection(s)
I20260926 12:23:01.566179 1119 acceptor_pool.cc:254] collecting diagnostics on the listening RPC socket unix:/tmp/dist-test-task0FfUOc/test-tmp/rpc-test-46f2fd238220460dbcb7fc7103ae7ccf.sock every 8 connection(s)
I20260926 12:23:01.626616 808 rpc-test.cc:1236] Sleep() min lat: 21802
I20260926 12:23:01.626819 808 rpc-test.cc:1237] Sleep() mean lat: 21802
I20260926 12:23:01.627068 808 rpc-test.cc:1238] Sleep() max lat: 21802
I20260926 12:23:01.627223 808 rpc-test.cc:1239] Sleep() #calls: 1
W20260926 12:23:01.630399 1115 connection.cc:196] Error closing socket: Network error: TlsSocket::Close: Broken pipe
[ OK ] Parameters/TestRpc.TestRpcHandlerLatencyMetric/SSL_UnixSocket (108 ms)
[ RUN ] Parameters/TestRpc.TimedOutOnResponseMetricServiceQueue/SSL_UnixSocket
I20260926 12:23:01.656901 1144 acceptor_pool.cc:254] collecting diagnostics on the listening RPC socket unix:/tmp/dist-test-task0FfUOc/test-tmp/rpc-test-be5e5c8011954e27aebcb217b22ff072.sock every 8 connection(s)
I20260926 12:23:01.657637 1145 acceptor_pool.cc:254] collecting diagnostics on the listening RPC socket unix:/tmp/dist-test-task0FfUOc/test-tmp/rpc-test-be5e5c8011954e27aebcb217b22ff072.sock every 8 connection(s)
W20260926 12:23:01.729925 1146 rpcz_store.cc:267] Call kudu.rpc_test.CalculatorService.Sleep from unix:<unnamed> (request call id 2) took 20 ms (client timeout 20 ms). Trace:
W20260926 12:23:01.730324 1146 rpcz_store.cc:269] 0926 12:23:01.709416 (+ 0us) service_pool.cc:170] Inserting onto call queue
0926 12:23:01.729725 (+ 20309us) service_pool.cc:214] Skipping call since client already timed out
0926 12:23:01.729867 (+ 142us) inbound_call.cc:173] Queueing failure response
Metrics: {}
W20260926 12:23:01.732676 1141 connection.cc:196] Error closing socket: Network error: TlsSocket::Close: Broken pipe
[ OK ] Parameters/TestRpc.TimedOutOnResponseMetricServiceQueue/SSL_UnixSocket (101 ms)
[ RUN ] Parameters/TestRpc.RpcPendingConnectionsMetric/SSL_UnixSocket
I20260926 12:23:01.747694 1167 acceptor_pool.cc:254] collecting diagnostics on the listening RPC socket 0.0.0.0:38041 every 8 connection(s)
I20260926 12:23:01.748404 1168 acceptor_pool.cc:254] collecting diagnostics on the listening RPC socket 0.0.0.0:38041 every 8 connection(s)
W20260926 12:23:01.762936 1163 negotiation.cc:337] Failed RPC negotiation. Trace:
0926 12:23:01.761330 (+ 0us) reactor.cc:625] Submitting negotiation task for server connection from 127.0.0.1:34070 (local address 127.0.0.1:38041)
0926 12:23:01.761786 (+ 456us) server_negotiation.cc:206] Beginning negotiation
0926 12:23:01.761804 (+ 18us) server_negotiation.cc:399] Waiting for connection header
0926 12:23:01.762035 (+ 231us) negotiation.cc:327] Negotiation complete: Network error: Server connection negotiation failed: server connection from 127.0.0.1:34070: BlockingRecv error: recv got EOF from 127.0.0.1:34070 (error 108)
Metrics: {"server-negotiator.queue_time_us":124}
[ OK ] Parameters/TestRpc.RpcPendingConnectionsMetric/SSL_UnixSocket (39 ms)
[ RUN ] Parameters/TestRpc.TestRpcContextClientDeadline/SSL_UnixSocket
I20260926 12:23:01.822163 1183 acceptor_pool.cc:254] collecting diagnostics on the listening RPC socket unix:/tmp/dist-test-task0FfUOc/test-tmp/rpc-test-73052c26e8aa4098984685abd912f950.sock every 8 connection(s)
I20260926 12:23:01.822901 1184 acceptor_pool.cc:254] collecting diagnostics on the listening RPC socket unix:/tmp/dist-test-task0FfUOc/test-tmp/rpc-test-73052c26e8aa4098984685abd912f950.sock every 8 connection(s)
W20260926 12:23:01.874156 1180 connection.cc:196] Error closing socket: Network error: TlsSocket::Close: Broken pipe
[ OK ] Parameters/TestRpc.TestRpcContextClientDeadline/SSL_UnixSocket (102 ms)
[ RUN ] Parameters/TestRpc.TestApplicationFeatureFlagUnsupportedServer/SSL_UnixSocket
I20260926 12:23:01.894129 1208 acceptor_pool.cc:254] collecting diagnostics on the listening RPC socket unix:/tmp/dist-test-task0FfUOc/test-tmp/rpc-test-c2aab7c571b740609240698b89c4352e.sock every 8 connection(s)
I20260926 12:23:01.895095 1209 acceptor_pool.cc:254] collecting diagnostics on the listening RPC socket unix:/tmp/dist-test-task0FfUOc/test-tmp/rpc-test-c2aab7c571b740609240698b89c4352e.sock every 8 connection(s)
[ OK ] Parameters/TestRpc.TestApplicationFeatureFlagUnsupportedServer/SSL_UnixSocket (74 ms)
[ RUN ] Parameters/TestRpc.TestCancellationAsync/SSL_UnixSocket
I20260926 12:23:01.974823 1233 acceptor_pool.cc:254] collecting diagnostics on the listening RPC socket unix:/tmp/dist-test-task0FfUOc/test-tmp/rpc-test-ab91127d0dd74a0db973738963cfa406.sock every 8 connection(s)
I20260926 12:23:01.975664 1234 acceptor_pool.cc:254] collecting diagnostics on the listening RPC socket unix:/tmp/dist-test-task0FfUOc/test-tmp/rpc-test-ab91127d0dd74a0db973738963cfa406.sock every 8 connection(s)
I20260926 12:23:01.978883 808 rpc-test.cc:1716] Connecting to unix:/tmp/dist-test-task0FfUOc/test-tmp/rpc-test-ab91127d0dd74a0db973738963cfa406.sock
I20260926 12:23:01.995740 808 test_util.cc:268] Using random seed: -454818618
I20260926 12:23:02.274667 1237 rpc-test-base.h:240] got call: sleep_micros: 500 pattern: 4294967295 num_repetitions: 2097152 sidecar_idx: 0
I20260926 12:23:02.477566 1236 rpc-test-base.h:240] got call: sleep_micros: 500 pattern: 4294967295 num_repetitions: 2097152 sidecar_idx: 0
I20260926 12:23:02.717130 1236 rpc-test-base.h:240] got call: sleep_micros: 500 pattern: 4294967295 num_repetitions: 2097152 sidecar_idx: 0
I20260926 12:23:02.928512 1236 rpc-test-base.h:240] got call: sleep_micros: 500 pattern: 4294967295 num_repetitions: 2097152 sidecar_idx: 0
I20260926 12:23:03.162071 1236 rpc-test-base.h:240] got call: sleep_micros: 500 pattern: 4294967295 num_repetitions: 2097152 sidecar_idx: 0
I20260926 12:23:03.369922 1237 rpc-test-base.h:240] got call: sleep_micros: 500 pattern: 4294967295 num_repetitions: 2097152 sidecar_idx: 0
I20260926 12:23:03.586256 1236 rpc-test-base.h:240] got call: sleep_micros: 500 pattern: 4294967295 num_repetitions: 2097152 sidecar_idx: 0
I20260926 12:23:03.803862 1236 rpc-test-base.h:240] got call: sleep_micros: 500 pattern: 4294967295 num_repetitions: 2097152 sidecar_idx: 0
I20260926 12:23:04.023108 1236 rpc-test-base.h:240] got call: sleep_micros: 500 pattern: 4294967295 num_repetitions: 2097152 sidecar_idx: 0
W20260926 12:23:04.044320 1230 connection.cc:196] Error closing socket: Network error: TlsSocket::Close: Broken pipe
W20260926 12:23:04.167075 1230 connection.cc:441] server connection from unix:<unnamed> torn down before Call kudu.rpc.GenericCalculatorService.SleepWithSidecar from unix:<unnamed> (request call id 9) could send its response
[ OK ] Parameters/TestRpc.TestCancellationAsync/SSL_UnixSocket (2223 ms)
[ RUN ] Parameters/TestRpc.TestPerformanceBySocketType/SSL_UnixSocket
I20260926 12:23:04.267572 1258 acceptor_pool.cc:254] collecting diagnostics on the listening RPC socket unix:/tmp/dist-test-task0FfUOc/test-tmp/rpc-test-6e3098c735b94b48bf822760a6fed30e.sock every 8 connection(s)
I20260926 12:23:04.268301 1259 acceptor_pool.cc:254] collecting diagnostics on the listening RPC socket unix:/tmp/dist-test-task0FfUOc/test-tmp/rpc-test-6e3098c735b94b48bf822760a6fed30e.sock every 8 connection(s)
I20260926 12:23:04.271581 808 rpc-test.cc:1846] Connecting to unix:/tmp/dist-test-task0FfUOc/test-tmp/rpc-test-6e3098c735b94b48bf822760a6fed30e.sock
I20260926 12:23:26.487736 808 rpc-test.cc:1859] Sending 1024MB via ssl-enabled unix socket: real 22.200s user 20.168s sys 13.407s
I20260926 12:23:48.264417 808 rpc-test.cc:1859] Sending 1024MB via ssl-enabled unix socket: real 21.776s user 19.382s sys 13.470s
I20260926 12:24:10.261801 808 rpc-test.cc:1859] Sending 1024MB via ssl-enabled unix socket: real 21.997s user 19.847s sys 13.418s
I20260926 12:24:32.094245 808 rpc-test.cc:1859] Sending 1024MB via ssl-enabled unix socket: real 21.832s user 19.363s sys 13.596s
I20260926 12:24:53.958391 808 rpc-test.cc:1859] Sending 1024MB via ssl-enabled unix socket: real 21.864s user 19.581s sys 13.395s
W20260926 12:24:53.964671 1255 connection.cc:196] Error closing socket: Network error: TlsSocket::Close: Broken pipe
[ OK ] Parameters/TestRpc.TestPerformanceBySocketType/SSL_UnixSocket (109799 ms)
[----------] 20 tests from Parameters/TestRpc (278929 ms total)
[----------] 1 test from Parameters/TestRpcSocketTxRxQueue
[ RUN ] Parameters/TestRpcSocketTxRxQueue.AcceptorRxQueueSizeMetric/0
I20260926 12:24:53.988168 1294 acceptor_pool.cc:254] collecting diagnostics on the listening RPC socket 0.0.0.0:33805 every 1 connection(s)
I20260926 12:24:53.989048 1295 acceptor_pool.cc:254] collecting diagnostics on the listening RPC socket 0.0.0.0:33805 every 1 connection(s)
W20260926 12:24:53.995275 1290 negotiation.cc:337] Failed RPC negotiation. Trace:
0926 12:24:53.993359 (+ 0us) reactor.cc:625] Submitting negotiation task for server connection from 127.0.0.1:43522 (local address 127.0.0.1:33805)
0926 12:24:53.993851 (+ 492us) server_negotiation.cc:206] Beginning negotiation
0926 12:24:53.993876 (+ 25us) server_negotiation.cc:399] Waiting for connection header
0926 12:24:53.994193 (+ 317us) negotiation.cc:327] Negotiation complete: Network error: Server connection negotiation failed: server connection from 127.0.0.1:43522: BlockingRecv error: recv got EOF from 127.0.0.1:43522 (error 108)
Metrics: {"server-negotiator.queue_time_us":138}
[ OK ] Parameters/TestRpcSocketTxRxQueue.AcceptorRxQueueSizeMetric/0 (25 ms)
[----------] 1 test from Parameters/TestRpcSocketTxRxQueue (25 ms total)
[----------] Global test environment tear-down
[==========] 21 tests from 2 test suites ran. (278955 ms total)
[ PASSED ] 20 tests.
[ FAILED ] 1 test, listed below:
[ FAILED ] Parameters/TestRpc.TestCallWithChainCertAndChainCA/SSL_UnixSocket, where GetParam() = (true, true)
1 FAILED TEST