Diagnosed failure
Parameters/TestRpc.TestCallWithChainCertAndChainCA/SSL_UnixSocket: /data0/somelongdirectorytoavoidrpathissues/src/kudu/src/kudu/rpc/rpc-test.cc:270: Failure
Failed
Bad status: Runtime error: could not verify certificate chain (error with cert: subject=CN = localhost, ST = sadfjas, C = AS, emailAddress = sdflkdsajf, O = lskdfjlsad, OU = sldfkja, issuer=C = AS, ST = ASDfkjdhf, L = lskdjf, O = saldfja, OU = skdjf, CN = localhost, emailAddress = sadjflkadsj): : certificate has expired
Google Test trace:
/data0/somelongdirectorytoavoidrpathissues/src/kudu/src/kudu/rpc/rpc-test.cc:267: Connecting to unix:/tmp/dist-test-taskq2u1UW/test-tmp/rpc-test-494d36280fb94ca9b1da34ffb8e24241.sock
I20260924 07:11:51.899444 14071 test_util.cc:175] -----------------------------------------------
I20260924 07:11:51.899492 14071 test_util.cc:176] Had fatal failures, leaving test files at /tmp/dist-test-taskq2u1UW/test-tmp/rpc-test.6.Parameters_TestRpc.TestCallWithChainCertAndChainCA_SSL_UnixSocket.1790233911857083-14071-0
Full log
Note: This is test shard 7 of 8.
[==========] Running 21 tests from 2 test suites.
[----------] Global test environment set-up.
[----------] 20 tests from Parameters/TestRpc
[ RUN ] Parameters/TestRpc.TestMessengerCreateDestroy/SSL_UnixSocket
WARNING: Logging before InitGoogleLogging() is written to STDERR
I20260924 07:11:51.875013 14071 rpc-test.cc:169] started messenger TestCreateDestroy
[ OK ] Parameters/TestRpc.TestMessengerCreateDestroy/SSL_UnixSocket (16 ms)
[ RUN ] Parameters/TestRpc.TestNegotiationDeadlock/SSL_UnixSocket
I20260924 07:11:51.883319 14091 acceptor_pool.cc:254] collecting diagnostics on the listening RPC socket unix:/tmp/dist-test-taskq2u1UW/test-tmp/rpc-test-30a6d21a0e8b46be99b70874809d91e8.sock every 8 connection(s)
I20260924 07:11:51.883332 14092 acceptor_pool.cc:254] collecting diagnostics on the listening RPC socket unix:/tmp/dist-test-taskq2u1UW/test-tmp/rpc-test-30a6d21a0e8b46be99b70874809d91e8.sock every 8 connection(s)
[ OK ] Parameters/TestRpc.TestNegotiationDeadlock/SSL_UnixSocket (13 ms)
[ RUN ] Parameters/TestRpc.TestCallWithChainCertAndChainCA/SSL_UnixSocket
I20260924 07:11:51.896096 14107 acceptor_pool.cc:254] collecting diagnostics on the listening RPC socket unix:/tmp/dist-test-taskq2u1UW/test-tmp/rpc-test-494d36280fb94ca9b1da34ffb8e24241.sock every 8 connection(s)
I20260924 07:11:51.896148 14108 acceptor_pool.cc:254] collecting diagnostics on the listening RPC socket unix:/tmp/dist-test-taskq2u1UW/test-tmp/rpc-test-494d36280fb94ca9b1da34ffb8e24241.sock every 8 connection(s)
/data0/somelongdirectorytoavoidrpathissues/src/kudu/src/kudu/rpc/rpc-test.cc:270: Failure
Failed
Bad status: Runtime error: could not verify certificate chain (error with cert: subject=CN = localhost, ST = sadfjas, C = AS, emailAddress = sdflkdsajf, O = lskdfjlsad, OU = sldfkja, issuer=C = AS, ST = ASDfkjdhf, L = lskdjf, O = saldfja, OU = skdjf, CN = localhost, emailAddress = sadjflkadsj): : certificate has expired
Google Test trace:
/data0/somelongdirectorytoavoidrpathissues/src/kudu/src/kudu/rpc/rpc-test.cc:267: Connecting to unix:/tmp/dist-test-taskq2u1UW/test-tmp/rpc-test-494d36280fb94ca9b1da34ffb8e24241.sock
I20260924 07:11:51.899444 14071 test_util.cc:175] -----------------------------------------------
I20260924 07:11:51.899492 14071 test_util.cc:176] Had fatal failures, leaving test files at /tmp/dist-test-taskq2u1UW/test-tmp/rpc-test.6.Parameters_TestRpc.TestCallWithChainCertAndChainCA_SSL_UnixSocket.1790233911857083-14071-0
[ FAILED ] Parameters/TestRpc.TestCallWithChainCertAndChainCA/SSL_UnixSocket, where GetParam() = (true, true) (10 ms)
[ RUN ] Parameters/TestRpc.TestCallWithPasswordProtectedKey/SSL_UnixSocket
I20260924 07:11:51.910531 14133 acceptor_pool.cc:254] collecting diagnostics on the listening RPC socket unix:/tmp/dist-test-taskq2u1UW/test-tmp/rpc-test-f14fe4fab75e4e308ca2c28c52068c28.sock every 8 connection(s)
I20260924 07:11:51.910521 14132 acceptor_pool.cc:254] collecting diagnostics on the listening RPC socket unix:/tmp/dist-test-taskq2u1UW/test-tmp/rpc-test-f14fe4fab75e4e308ca2c28c52068c28.sock every 8 connection(s)
W20260924 07:11:51.920857 14129 connection.cc:196] Error closing socket: Network error: TlsSocket::Close: Broken pipe
[ OK ] Parameters/TestRpc.TestCallWithPasswordProtectedKey/SSL_UnixSocket (22 ms)
[ RUN ] Parameters/TestRpc.TestCallToBadServer/SSL_UnixSocket
I20260924 07:11:51.948781 14071 rpc-test.cc:394] Status: Network error: Client connection negotiation failed: client connection to 0.0.0.0:0: connect: Connection refused (error 111)
I20260924 07:11:51.949023 14071 rpc-test.cc:394] Status: Network error: Client connection negotiation failed: client connection to 0.0.0.0:0: connect: Connection refused (error 111)
I20260924 07:11:51.949193 14071 rpc-test.cc:394] Status: Network error: Client connection negotiation failed: client connection to 0.0.0.0:0: connect: Connection refused (error 111)
I20260924 07:11:51.949342 14071 rpc-test.cc:394] Status: Network error: Client connection negotiation failed: client connection to 0.0.0.0:0: connect: Connection refused (error 111)
I20260924 07:11:51.949479 14071 rpc-test.cc:394] Status: Network error: Client connection negotiation failed: client connection to 0.0.0.0:0: connect: Connection refused (error 111)
[ OK ] Parameters/TestRpc.TestCallToBadServer/SSL_UnixSocket (28 ms)
[ RUN ] Parameters/TestRpc.TestWrongService/SSL_UnixSocket
I20260924 07:11:51.964893 14167 acceptor_pool.cc:254] collecting diagnostics on the listening RPC socket unix:/tmp/dist-test-taskq2u1UW/test-tmp/rpc-test-d5ac586ec2e34bcaa0d118f260b5c0b1.sock every 8 connection(s)
I20260924 07:11:51.964932 14168 acceptor_pool.cc:254] collecting diagnostics on the listening RPC socket unix:/tmp/dist-test-taskq2u1UW/test-tmp/rpc-test-d5ac586ec2e34bcaa0d118f260b5c0b1.sock every 8 connection(s)
I20260924 07:11:51.973939 14164 messenger.cc:345] service WrongServiceName not registered on TestServer
[ OK ] Parameters/TestRpc.TestWrongService/SSL_UnixSocket (25 ms)
[ RUN ] Parameters/TestRpc.TestConnectionKeepalive/SSL_UnixSocket
I20260924 07:11:51.982823 14190 acceptor_pool.cc:254] collecting diagnostics on the listening RPC socket unix:/tmp/dist-test-taskq2u1UW/test-tmp/rpc-test-48e801e96ebc479ab01e4064926af36e.sock every 8 connection(s)
I20260924 07:11:51.982862 14191 acceptor_pool.cc:254] collecting diagnostics on the listening RPC socket unix:/tmp/dist-test-taskq2u1UW/test-tmp/rpc-test-48e801e96ebc479ab01e4064926af36e.sock every 8 connection(s)
I20260924 07:11:51.982995 14071 rpc-test.cc:488] Connecting to unix:/tmp/dist-test-taskq2u1UW/test-tmp/rpc-test-48e801e96ebc479ab01e4064926af36e.sock
W20260924 07:11:52.477013 14203 connection.cc:196] Error closing socket: Network error: TlsSocket::Close: Broken pipe
[ OK ] Parameters/TestRpc.TestConnectionKeepalive/SSL_UnixSocket (1022 ms)
[ RUN ] Parameters/TestRpc.TestClientConnectionMetrics/SSL_UnixSocket
I20260924 07:11:53.032119 14215 acceptor_pool.cc:254] collecting diagnostics on the listening RPC socket unix:/tmp/dist-test-taskq2u1UW/test-tmp/rpc-test-e76bf76f18514b9199c55b692a5582a4.sock every 8 connection(s)
I20260924 07:11:53.032148 14216 acceptor_pool.cc:254] collecting diagnostics on the listening RPC socket unix:/tmp/dist-test-taskq2u1UW/test-tmp/rpc-test-e76bf76f18514b9199c55b692a5582a4.sock every 8 connection(s)
I20260924 07:11:53.032264 14071 rpc-test.cc:569] Connecting to unix:/tmp/dist-test-taskq2u1UW/test-tmp/rpc-test-e76bf76f18514b9199c55b692a5582a4.sock
W20260924 07:12:01.163937 14212 connection.cc:196] Error closing socket: Network error: TlsSocket::Close: Broken pipe
[ OK ] Parameters/TestRpc.TestClientConnectionMetrics/SSL_UnixSocket (8167 ms)
[ RUN ] Parameters/TestRpc.TestCredentialsPolicy/SSL_UnixSocket
I20260924 07:12:01.181006 14238 acceptor_pool.cc:254] collecting diagnostics on the listening RPC socket unix:/tmp/dist-test-taskq2u1UW/test-tmp/rpc-test-f430e8998570431396e35b04a00c57de.sock every 8 connection(s)
I20260924 07:12:01.181039 14239 acceptor_pool.cc:254] collecting diagnostics on the listening RPC socket unix:/tmp/dist-test-taskq2u1UW/test-tmp/rpc-test-f430e8998570431396e35b04a00c57de.sock every 8 connection(s)
I20260924 07:12:01.181237 14071 rpc-test.cc:700] Connecting to unix:/tmp/dist-test-taskq2u1UW/test-tmp/rpc-test-f430e8998570431396e35b04a00c57de.sock
W20260924 07:12:01.216988 14237 connection.cc:196] Error closing socket: Network error: TlsSocket::Close: Broken pipe
[ OK ] Parameters/TestRpc.TestCredentialsPolicy/SSL_UnixSocket (55 ms)
[ RUN ] Parameters/TestRpc.TestCallLongerThanKeepalive/SSL_UnixSocket
I20260924 07:12:01.232752 14263 acceptor_pool.cc:254] collecting diagnostics on the listening RPC socket unix:/tmp/dist-test-taskq2u1UW/test-tmp/rpc-test-7b3858d835da4399a0072d76a4aa0e64.sock every 8 connection(s)
I20260924 07:12:01.232790 14264 acceptor_pool.cc:254] collecting diagnostics on the listening RPC socket unix:/tmp/dist-test-taskq2u1UW/test-tmp/rpc-test-7b3858d835da4399a0072d76a4aa0e64.sock every 8 connection(s)
I20260924 07:12:01.243044 14267 rpc-test-base.h:222] got call: sleep_micros: 3000000 deferred: true
I20260924 07:12:04.243732 14267 rpcz_store.cc:275] Call kudu.rpc.GenericCalculatorService.Sleep from unix:<unnamed> (request call id 0) took 3000 ms. Trace:
I20260924 07:12:04.243829 14267 rpcz_store.cc:276] 0924 07:12:01.242992 (+ 0us) service_pool.cc:170] Inserting onto call queue
0924 07:12:01.243021 (+ 29us) service_pool.cc:227] Handling call
0924 07:12:04.243715 (+3000694us) inbound_call.cc:173] Queueing success response
Metrics: {}
[ OK ] Parameters/TestRpc.TestCallLongerThanKeepalive/SSL_UnixSocket (3024 ms)
[ RUN ] Parameters/TestRpc.TestRpcSidecar/SSL_UnixSocket
I20260924 07:12:04.256678 14288 acceptor_pool.cc:254] collecting diagnostics on the listening RPC socket unix:/tmp/dist-test-taskq2u1UW/test-tmp/rpc-test-8a5419d12c5740c983286dd52155255f.sock every 8 connection(s)
I20260924 07:12:04.256711 14289 acceptor_pool.cc:254] collecting diagnostics on the listening RPC socket unix:/tmp/dist-test-taskq2u1UW/test-tmp/rpc-test-8a5419d12c5740c983286dd52155255f.sock every 8 connection(s)
W20260924 07:12:04.290035 14285 connection.cc:196] Error closing socket: Network error: TlsSocket::Close: Broken pipe
[ OK ] Parameters/TestRpc.TestRpcSidecar/SSL_UnixSocket (45 ms)
[ RUN ] Parameters/TestRpc.TestRpcSidecarLimits/SSL_UnixSocket
I20260924 07:12:05.806741 14313 acceptor_pool.cc:254] collecting diagnostics on the listening RPC socket unix:/tmp/dist-test-taskq2u1UW/test-tmp/rpc-test-c7952237c09a4db5adbc00432b63697d.sock every 8 connection(s)
I20260924 07:12:05.806797 14314 acceptor_pool.cc:254] collecting diagnostics on the listening RPC socket unix:/tmp/dist-test-taskq2u1UW/test-tmp/rpc-test-c7952237c09a4db5adbc00432b63697d.sock every 8 connection(s)
W20260924 07:12:05.828299 14071 serialization.cc:72] Serialized kudu.rpc_test.PushStringsRequestPB (2147483654 bytes) is larger than the maximum configured RPC message size (52428800 bytes). Sending anyway, but peer may reject the data.
W20260924 07:12:05.831394 14310 connection.cc:535] server connection from unix:<unnamed> recv error: Network error: RPC frame had a length of 2147483714, but we only support messages up to 52428800 bytes long.
W20260924 07:12:05.831449 14310 connection.cc:158] shutting down server connection from unix:<unnamed> with pending inbound data: 4/2147483714 bytes received; last active 0 ns ago: status Network error: RPC frame had a length of 2147483714, but we only support messages up to 52428800 bytes long.
W20260924 07:12:05.831652 14326 connection.cc:196] Error closing socket: Network error: TlsSocket::Close: Broken pipe
I20260924 07:12:05.846292 14338 acceptor_pool.cc:254] collecting diagnostics on the listening RPC socket unix:/tmp/dist-test-taskq2u1UW/test-tmp/rpc-test-c7952237c09a4db5adbc00432b63697d.sock every 8 connection(s)
I20260924 07:12:05.846522 14339 acceptor_pool.cc:254] collecting diagnostics on the listening RPC socket unix:/tmp/dist-test-taskq2u1UW/test-tmp/rpc-test-c7952237c09a4db5adbc00432b63697d.sock every 8 connection(s)
W20260924 07:12:09.837883 14335 connection.cc:577] server connection from unix:<unnamed>: received bad data: 'Corruption: Invalid packet: message had a length of 2147483710, but we only support messages up to 2147483647 bytes
'
W20260924 07:12:09.838150 14351 connection.cc:196] Error closing socket: Network error: TlsSocket::Close: Broken pipe
[ OK ] Parameters/TestRpc.TestRpcSidecarLimits/SSL_UnixSocket (5548 ms)
[ RUN ] Parameters/TestRpc.TestCallTimeoutDoesntAffectNegotiation/SSL_UnixSocket
I20260924 07:12:09.859395 14363 acceptor_pool.cc:254] collecting diagnostics on the listening RPC socket unix:/tmp/dist-test-taskq2u1UW/test-tmp/rpc-test-34da8cd31fec4bdba463350cd1c5ec64.sock every 8 connection(s)
I20260924 07:12:09.859437 14364 acceptor_pool.cc:254] collecting diagnostics on the listening RPC socket unix:/tmp/dist-test-taskq2u1UW/test-tmp/rpc-test-34da8cd31fec4bdba463350cd1c5ec64.sock every 8 connection(s)
W20260924 07:12:09.866300 14357 negotiation.cc:266] Injecting 500ms delay in negotiation
I20260924 07:12:09.916565 14071 rpc-test-base.h:595] status: Timed out: connection negotiation to unix:/tmp/dist-test-taskq2u1UW/test-tmp/rpc-test-34da8cd31fec4bdba463350cd1c5ec64.sock for RPC Sleep timed out after 0.050s (ON_OUTBOUND_QUEUE), seconds elapsed: 0.0505167
[ OK ] Parameters/TestRpc.TestCallTimeoutDoesntAffectNegotiation/SSL_UnixSocket (531 ms)
[ RUN ] Parameters/TestRpc.TestRpcHandlerLatencyMetric/SSL_UnixSocket
I20260924 07:12:10.378890 14388 acceptor_pool.cc:254] collecting diagnostics on the listening RPC socket unix:/tmp/dist-test-taskq2u1UW/test-tmp/rpc-test-ea7dcbaa99604ec0a6db6f67ef740054.sock every 8 connection(s)
I20260924 07:12:10.378917 14389 acceptor_pool.cc:254] collecting diagnostics on the listening RPC socket unix:/tmp/dist-test-taskq2u1UW/test-tmp/rpc-test-ea7dcbaa99604ec0a6db6f67ef740054.sock every 8 connection(s)
I20260924 07:12:10.429081 14071 rpc-test.cc:1236] Sleep() min lat: 20298
I20260924 07:12:10.429155 14071 rpc-test.cc:1237] Sleep() mean lat: 20298
I20260924 07:12:10.429220 14071 rpc-test.cc:1238] Sleep() max lat: 20298
I20260924 07:12:10.429239 14071 rpc-test.cc:1239] Sleep() #calls: 1
[ OK ] Parameters/TestRpc.TestRpcHandlerLatencyMetric/SSL_UnixSocket (59 ms)
[ RUN ] Parameters/TestRpc.TimedOutOnResponseMetricServiceQueue/SSL_UnixSocket
I20260924 07:12:10.448158 14414 acceptor_pool.cc:254] collecting diagnostics on the listening RPC socket unix:/tmp/dist-test-taskq2u1UW/test-tmp/rpc-test-0896a75d08a54d6e8ab328fdff655b8a.sock every 8 connection(s)
I20260924 07:12:10.448194 14415 acceptor_pool.cc:254] collecting diagnostics on the listening RPC socket unix:/tmp/dist-test-taskq2u1UW/test-tmp/rpc-test-0896a75d08a54d6e8ab328fdff655b8a.sock every 8 connection(s)
W20260924 07:12:10.497125 14416 rpcz_store.cc:267] Call kudu.rpc_test.CalculatorService.Sleep from unix:<unnamed> (request call id 2) took 20 ms (client timeout 20 ms). Trace:
W20260924 07:12:10.497228 14416 rpcz_store.cc:269] 0924 07:12:10.476888 (+ 0us) service_pool.cc:170] Inserting onto call queue
0924 07:12:10.497104 (+ 20216us) service_pool.cc:214] Skipping call since client already timed out
0924 07:12:10.497112 (+ 8us) inbound_call.cc:173] Queueing failure response
Metrics: {}
[ OK ] Parameters/TestRpc.TimedOutOnResponseMetricServiceQueue/SSL_UnixSocket (68 ms)
[ RUN ] Parameters/TestRpc.RpcPendingConnectionsMetric/SSL_UnixSocket
I20260924 07:12:10.500272 14437 acceptor_pool.cc:254] collecting diagnostics on the listening RPC socket 0.0.0.0:39037 every 8 connection(s)
I20260924 07:12:10.500326 14438 acceptor_pool.cc:254] collecting diagnostics on the listening RPC socket 0.0.0.0:39037 every 8 connection(s)
W20260924 07:12:10.500844 14433 negotiation.cc:337] Failed RPC negotiation. Trace:
0924 07:12:10.500684 (+ 0us) reactor.cc:625] Submitting negotiation task for server connection from 127.0.0.1:54928 (local address 127.0.0.1:39037)
0924 07:12:10.500722 (+ 38us) server_negotiation.cc:206] Beginning negotiation
0924 07:12:10.500723 (+ 1us) server_negotiation.cc:399] Waiting for connection header
0924 07:12:10.500793 (+ 70us) negotiation.cc:327] Negotiation complete: Network error: Server connection negotiation failed: server connection from 127.0.0.1:54928: BlockingRecv error: recv got EOF from 127.0.0.1:54928 (error 108)
Metrics: {"server-negotiator.queue_time_us":14}
[ OK ] Parameters/TestRpc.RpcPendingConnectionsMetric/SSL_UnixSocket (12 ms)
[ RUN ] Parameters/TestRpc.TestRpcContextClientDeadline/SSL_UnixSocket
I20260924 07:12:10.523036 14453 acceptor_pool.cc:254] collecting diagnostics on the listening RPC socket unix:/tmp/dist-test-taskq2u1UW/test-tmp/rpc-test-e2c4ff761d6344cba1176d8f78844176.sock every 8 connection(s)
I20260924 07:12:10.523072 14454 acceptor_pool.cc:254] collecting diagnostics on the listening RPC socket unix:/tmp/dist-test-taskq2u1UW/test-tmp/rpc-test-e2c4ff761d6344cba1176d8f78844176.sock every 8 connection(s)
[ OK ] Parameters/TestRpc.TestRpcContextClientDeadline/SSL_UnixSocket (44 ms)
[ RUN ] Parameters/TestRpc.TestApplicationFeatureFlagUnsupportedServer/SSL_UnixSocket
I20260924 07:12:10.573709 14478 acceptor_pool.cc:254] collecting diagnostics on the listening RPC socket unix:/tmp/dist-test-taskq2u1UW/test-tmp/rpc-test-97cfcadb5ad2442cb691b5f9f961a3b9.sock every 8 connection(s)
I20260924 07:12:10.573731 14479 acceptor_pool.cc:254] collecting diagnostics on the listening RPC socket unix:/tmp/dist-test-taskq2u1UW/test-tmp/rpc-test-97cfcadb5ad2442cb691b5f9f961a3b9.sock every 8 connection(s)
[ OK ] Parameters/TestRpc.TestApplicationFeatureFlagUnsupportedServer/SSL_UnixSocket (44 ms)
[ RUN ] Parameters/TestRpc.TestCancellationAsync/SSL_UnixSocket
I20260924 07:12:10.612811 14503 acceptor_pool.cc:254] collecting diagnostics on the listening RPC socket unix:/tmp/dist-test-taskq2u1UW/test-tmp/rpc-test-39a02f4f472542368bc923463955ba81.sock every 8 connection(s)
I20260924 07:12:10.612870 14504 acceptor_pool.cc:254] collecting diagnostics on the listening RPC socket unix:/tmp/dist-test-taskq2u1UW/test-tmp/rpc-test-39a02f4f472542368bc923463955ba81.sock every 8 connection(s)
I20260924 07:12:10.612998 14071 rpc-test.cc:1716] Connecting to unix:/tmp/dist-test-taskq2u1UW/test-tmp/rpc-test-39a02f4f472542368bc923463955ba81.sock
I20260924 07:12:10.624372 14071 test_util.cc:268] Using random seed: 1367338352
I20260924 07:12:10.636361 14507 rpc-test-base.h:240] got call: sleep_micros: 500 pattern: 4294967295 num_repetitions: 2097152 sidecar_idx: 0
I20260924 07:12:10.646322 14507 rpc-test-base.h:240] got call: sleep_micros: 500 pattern: 4294967295 num_repetitions: 2097152 sidecar_idx: 0
I20260924 07:12:10.655975 14507 rpc-test-base.h:240] got call: sleep_micros: 500 pattern: 4294967295 num_repetitions: 2097152 sidecar_idx: 0
I20260924 07:12:10.666872 14507 rpc-test-base.h:240] got call: sleep_micros: 500 pattern: 4294967295 num_repetitions: 2097152 sidecar_idx: 0
I20260924 07:12:10.677778 14507 rpc-test-base.h:240] got call: sleep_micros: 500 pattern: 4294967295 num_repetitions: 2097152 sidecar_idx: 0
I20260924 07:12:10.688225 14507 rpc-test-base.h:240] got call: sleep_micros: 500 pattern: 4294967295 num_repetitions: 2097152 sidecar_idx: 0
I20260924 07:12:10.697669 14507 rpc-test-base.h:240] got call: sleep_micros: 500 pattern: 4294967295 num_repetitions: 2097152 sidecar_idx: 0
I20260924 07:12:10.707676 14507 rpc-test-base.h:240] got call: sleep_micros: 500 pattern: 4294967295 num_repetitions: 2097152 sidecar_idx: 0
W20260924 07:12:10.709092 14500 connection.cc:196] Error closing socket: Network error: TlsSocket::Close: Broken pipe
W20260924 07:12:10.710898 14500 connection.cc:441] server connection from unix:<unnamed> torn down before Call kudu.rpc.GenericCalculatorService.SleepWithSidecar from unix:<unnamed> (request call id 9) could send its response
[ OK ] Parameters/TestRpc.TestCancellationAsync/SSL_UnixSocket (111 ms)
[ RUN ] Parameters/TestRpc.TestPerformanceBySocketType/SSL_UnixSocket
I20260924 07:12:10.735442 14528 acceptor_pool.cc:254] collecting diagnostics on the listening RPC socket unix:/tmp/dist-test-taskq2u1UW/test-tmp/rpc-test-db8a58464bd541a986c3efb1247e7f1c.sock every 8 connection(s)
I20260924 07:12:10.735446 14529 acceptor_pool.cc:254] collecting diagnostics on the listening RPC socket unix:/tmp/dist-test-taskq2u1UW/test-tmp/rpc-test-db8a58464bd541a986c3efb1247e7f1c.sock every 8 connection(s)
I20260924 07:12:10.735587 14071 rpc-test.cc:1846] Connecting to unix:/tmp/dist-test-taskq2u1UW/test-tmp/rpc-test-db8a58464bd541a986c3efb1247e7f1c.sock
I20260924 07:12:11.911403 14071 rpc-test.cc:1859] Sending 1024MB via ssl-enabled unix socket: real 1.143s user 1.254s sys 0.806s
I20260924 07:12:13.035022 14071 rpc-test.cc:1859] Sending 1024MB via ssl-enabled unix socket: real 1.124s user 1.315s sys 0.714s
I20260924 07:12:14.165189 14071 rpc-test.cc:1859] Sending 1024MB via ssl-enabled unix socket: real 1.130s user 1.284s sys 0.763s
I20260924 07:12:15.343019 14071 rpc-test.cc:1859] Sending 1024MB via ssl-enabled unix socket: real 1.178s user 1.351s sys 0.778s
I20260924 07:12:16.517570 14071 rpc-test.cc:1859] Sending 1024MB via ssl-enabled unix socket: real 1.174s user 1.272s sys 0.846s
W20260924 07:12:16.518240 14525 connection.cc:196] Error closing socket: Network error: TlsSocket::Close: Broken pipe
[ OK ] Parameters/TestRpc.TestPerformanceBySocketType/SSL_UnixSocket (5807 ms)
[----------] 20 tests from Parameters/TestRpc (24659 ms total)
[----------] 1 test from Parameters/TestRpcSocketTxRxQueue
[ RUN ] Parameters/TestRpcSocketTxRxQueue.AcceptorRxQueueSizeMetric/0
I20260924 07:12:16.524048 14553 acceptor_pool.cc:254] collecting diagnostics on the listening RPC socket 0.0.0.0:44739 every 1 connection(s)
I20260924 07:12:16.524129 14554 acceptor_pool.cc:254] collecting diagnostics on the listening RPC socket 0.0.0.0:44739 every 1 connection(s)
W20260924 07:12:16.524609 14549 negotiation.cc:337] Failed RPC negotiation. Trace:
0924 07:12:16.524448 (+ 0us) reactor.cc:625] Submitting negotiation task for server connection from 127.0.0.1:33204 (local address 127.0.0.1:44739)
0924 07:12:16.524489 (+ 41us) server_negotiation.cc:206] Beginning negotiation
0924 07:12:16.524491 (+ 2us) server_negotiation.cc:399] Waiting for connection header
0924 07:12:16.524564 (+ 73us) negotiation.cc:327] Negotiation complete: Network error: Server connection negotiation failed: server connection from 127.0.0.1:33204: BlockingRecv error: recv got EOF from 127.0.0.1:33204 (error 108)
Metrics: {"server-negotiator.queue_time_us":13}
[ OK ] Parameters/TestRpcSocketTxRxQueue.AcceptorRxQueueSizeMetric/0 (7 ms)
[----------] 1 test from Parameters/TestRpcSocketTxRxQueue (7 ms total)
[----------] Global test environment tear-down
[==========] 21 tests from 2 test suites ran. (24667 ms total)
[ PASSED ] 20 tests.
[ FAILED ] 1 test, listed below:
[ FAILED ] Parameters/TestRpc.TestCallWithChainCertAndChainCA/SSL_UnixSocket, where GetParam() = (true, true)
1 FAILED TEST