Diagnosed failure

Parameters/TestRpc.TestCallWithChainCertAndChainCA/SSL_UnixSocket: /data0/somelongdirectorytoavoidrpathissues/src/kudu/src/kudu/rpc/rpc-test.cc:270: Failure
Failed
Bad status: Runtime error: could not verify certificate chain (error with cert: subject=CN = localhost, ST = sadfjas, C = AS, emailAddress = sdflkdsajf, O = lskdfjlsad, OU = sldfkja, issuer=C = AS, ST = ASDfkjdhf, L = lskdjf, O = saldfja, OU = skdjf, CN = localhost, emailAddress = sadjflkadsj): : certificate has expired
Google Test trace:
/data0/somelongdirectorytoavoidrpathissues/src/kudu/src/kudu/rpc/rpc-test.cc:267: Connecting to unix:/tmp/dist-test-taskDRrOpR/test-tmp/rpc-test-70b888e513114e448b27983de4d34a22.sock
I20260924 15:18:35.208721 26947 test_util.cc:175] -----------------------------------------------
I20260924 15:18:35.208779 26947 test_util.cc:176] Had fatal failures, leaving test files at /tmp/dist-test-taskDRrOpR/test-tmp/rpc-test.6.Parameters_TestRpc.TestCallWithChainCertAndChainCA_SSL_UnixSocket.1790263115136923-26947-0

Full log

Note: This is test shard 7 of 8.
[==========] Running 21 tests from 2 test suites.
[----------] Global test environment set-up.
[----------] 20 tests from Parameters/TestRpc
[ RUN      ] Parameters/TestRpc.TestMessengerCreateDestroy/SSL_UnixSocket
WARNING: Logging before InitGoogleLogging() is written to STDERR
I20260924 15:18:35.160723 26947 rpc-test.cc:169] started messenger TestCreateDestroy
[       OK ] Parameters/TestRpc.TestMessengerCreateDestroy/SSL_UnixSocket (22 ms)
[ RUN      ] Parameters/TestRpc.TestNegotiationDeadlock/SSL_UnixSocket
I20260924 15:18:35.181092 26968 acceptor_pool.cc:254] collecting diagnostics on the listening RPC socket unix:/tmp/dist-test-taskDRrOpR/test-tmp/rpc-test-3767e6c3a66741499ca039c7d7958ab3.sock every 8 connection(s)
I20260924 15:18:35.181166 26967 acceptor_pool.cc:254] collecting diagnostics on the listening RPC socket unix:/tmp/dist-test-taskDRrOpR/test-tmp/rpc-test-3767e6c3a66741499ca039c7d7958ab3.sock every 8 connection(s)
[       OK ] Parameters/TestRpc.TestNegotiationDeadlock/SSL_UnixSocket (29 ms)
[ RUN      ] Parameters/TestRpc.TestCallWithChainCertAndChainCA/SSL_UnixSocket
I20260924 15:18:35.204289 26983 acceptor_pool.cc:254] collecting diagnostics on the listening RPC socket unix:/tmp/dist-test-taskDRrOpR/test-tmp/rpc-test-70b888e513114e448b27983de4d34a22.sock every 8 connection(s)
I20260924 15:18:35.204298 26984 acceptor_pool.cc:254] collecting diagnostics on the listening RPC socket unix:/tmp/dist-test-taskDRrOpR/test-tmp/rpc-test-70b888e513114e448b27983de4d34a22.sock every 8 connection(s)
/data0/somelongdirectorytoavoidrpathissues/src/kudu/src/kudu/rpc/rpc-test.cc:270: Failure
Failed
Bad status: Runtime error: could not verify certificate chain (error with cert: subject=CN = localhost, ST = sadfjas, C = AS, emailAddress = sdflkdsajf, O = lskdfjlsad, OU = sldfkja, issuer=C = AS, ST = ASDfkjdhf, L = lskdjf, O = saldfja, OU = skdjf, CN = localhost, emailAddress = sadjflkadsj): : certificate has expired
Google Test trace:
/data0/somelongdirectorytoavoidrpathissues/src/kudu/src/kudu/rpc/rpc-test.cc:267: Connecting to unix:/tmp/dist-test-taskDRrOpR/test-tmp/rpc-test-70b888e513114e448b27983de4d34a22.sock
I20260924 15:18:35.208721 26947 test_util.cc:175] -----------------------------------------------
I20260924 15:18:35.208779 26947 test_util.cc:176] Had fatal failures, leaving test files at /tmp/dist-test-taskDRrOpR/test-tmp/rpc-test.6.Parameters_TestRpc.TestCallWithChainCertAndChainCA_SSL_UnixSocket.1790263115136923-26947-0
[  FAILED  ] Parameters/TestRpc.TestCallWithChainCertAndChainCA/SSL_UnixSocket, where GetParam() = (true, true) (17 ms)
[ RUN      ] Parameters/TestRpc.TestCallWithPasswordProtectedKey/SSL_UnixSocket
I20260924 15:18:35.218400 27008 acceptor_pool.cc:254] collecting diagnostics on the listening RPC socket unix:/tmp/dist-test-taskDRrOpR/test-tmp/rpc-test-8ae3551ef86f4a97b1ef79984f18db14.sock every 8 connection(s)
I20260924 15:18:35.218444 27009 acceptor_pool.cc:254] collecting diagnostics on the listening RPC socket unix:/tmp/dist-test-taskDRrOpR/test-tmp/rpc-test-8ae3551ef86f4a97b1ef79984f18db14.sock every 8 connection(s)
W20260924 15:18:35.231858 27005 connection.cc:196] Error closing socket: Network error: TlsSocket::Close: Broken pipe
[       OK ] Parameters/TestRpc.TestCallWithPasswordProtectedKey/SSL_UnixSocket (24 ms)
[ RUN      ] Parameters/TestRpc.TestCallToBadServer/SSL_UnixSocket
I20260924 15:18:35.249332 26947 rpc-test.cc:394] Status: Network error: Client connection negotiation failed: client connection to 0.0.0.0:0: connect: Connection refused (error 111)
I20260924 15:18:35.249681 26947 rpc-test.cc:394] Status: Network error: Client connection negotiation failed: client connection to 0.0.0.0:0: connect: Connection refused (error 111)
I20260924 15:18:35.249944 26947 rpc-test.cc:394] Status: Network error: Client connection negotiation failed: client connection to 0.0.0.0:0: connect: Connection refused (error 111)
I20260924 15:18:35.250138 26947 rpc-test.cc:394] Status: Network error: Client connection negotiation failed: client connection to 0.0.0.0:0: connect: Connection refused (error 111)
I20260924 15:18:35.250303 26947 rpc-test.cc:394] Status: Network error: Client connection negotiation failed: client connection to 0.0.0.0:0: connect: Connection refused (error 111)
[       OK ] Parameters/TestRpc.TestCallToBadServer/SSL_UnixSocket (17 ms)
[ RUN      ] Parameters/TestRpc.TestWrongService/SSL_UnixSocket
I20260924 15:18:35.257157 27043 acceptor_pool.cc:254] collecting diagnostics on the listening RPC socket unix:/tmp/dist-test-taskDRrOpR/test-tmp/rpc-test-deca12c7148c4b8d9cd503e04a48f7c8.sock every 8 connection(s)
I20260924 15:18:35.257206 27044 acceptor_pool.cc:254] collecting diagnostics on the listening RPC socket unix:/tmp/dist-test-taskDRrOpR/test-tmp/rpc-test-deca12c7148c4b8d9cd503e04a48f7c8.sock every 8 connection(s)
I20260924 15:18:35.288959 27040 messenger.cc:345] service WrongServiceName not registered on TestServer
[       OK ] Parameters/TestRpc.TestWrongService/SSL_UnixSocket (39 ms)
[ RUN      ] Parameters/TestRpc.TestConnectionKeepalive/SSL_UnixSocket
I20260924 15:18:35.304297 27066 acceptor_pool.cc:254] collecting diagnostics on the listening RPC socket unix:/tmp/dist-test-taskDRrOpR/test-tmp/rpc-test-9f4df755d879441490db086f3d9d770b.sock every 8 connection(s)
I20260924 15:18:35.304349 27067 acceptor_pool.cc:254] collecting diagnostics on the listening RPC socket unix:/tmp/dist-test-taskDRrOpR/test-tmp/rpc-test-9f4df755d879441490db086f3d9d770b.sock every 8 connection(s)
I20260924 15:18:35.304497 26947 rpc-test.cc:488] Connecting to unix:/tmp/dist-test-taskDRrOpR/test-tmp/rpc-test-9f4df755d879441490db086f3d9d770b.sock
W20260924 15:18:35.793148 27079 connection.cc:196] Error closing socket: Network error: TlsSocket::Close: Broken pipe
[       OK ] Parameters/TestRpc.TestConnectionKeepalive/SSL_UnixSocket (1036 ms)
[ RUN      ] Parameters/TestRpc.TestClientConnectionMetrics/SSL_UnixSocket
I20260924 15:18:36.342188 27091 acceptor_pool.cc:254] collecting diagnostics on the listening RPC socket unix:/tmp/dist-test-taskDRrOpR/test-tmp/rpc-test-f5a5e4bd98a44f91bf513c7ec52c0bd4.sock every 8 connection(s)
I20260924 15:18:36.342219 27092 acceptor_pool.cc:254] collecting diagnostics on the listening RPC socket unix:/tmp/dist-test-taskDRrOpR/test-tmp/rpc-test-f5a5e4bd98a44f91bf513c7ec52c0bd4.sock every 8 connection(s)
I20260924 15:18:36.342445 26947 rpc-test.cc:569] Connecting to unix:/tmp/dist-test-taskDRrOpR/test-tmp/rpc-test-f5a5e4bd98a44f91bf513c7ec52c0bd4.sock
W20260924 15:18:44.926796 27088 connection.cc:196] Error closing socket: Network error: TlsSocket::Close: Broken pipe
[       OK ] Parameters/TestRpc.TestClientConnectionMetrics/SSL_UnixSocket (8600 ms)
[ RUN      ] Parameters/TestRpc.TestCredentialsPolicy/SSL_UnixSocket
I20260924 15:18:44.937187 27114 acceptor_pool.cc:254] collecting diagnostics on the listening RPC socket unix:/tmp/dist-test-taskDRrOpR/test-tmp/rpc-test-7a404956b3f246979fb005249db54ae4.sock every 8 connection(s)
I20260924 15:18:44.937309 27115 acceptor_pool.cc:254] collecting diagnostics on the listening RPC socket unix:/tmp/dist-test-taskDRrOpR/test-tmp/rpc-test-7a404956b3f246979fb005249db54ae4.sock every 8 connection(s)
I20260924 15:18:44.937465 26947 rpc-test.cc:700] Connecting to unix:/tmp/dist-test-taskDRrOpR/test-tmp/rpc-test-7a404956b3f246979fb005249db54ae4.sock
W20260924 15:18:44.953217 27113 connection.cc:196] Error closing socket: Network error: TlsSocket::Close: Broken pipe
[       OK ] Parameters/TestRpc.TestCredentialsPolicy/SSL_UnixSocket (30 ms)
[ RUN      ] Parameters/TestRpc.TestCallLongerThanKeepalive/SSL_UnixSocket
I20260924 15:18:44.972038 27139 acceptor_pool.cc:254] collecting diagnostics on the listening RPC socket unix:/tmp/dist-test-taskDRrOpR/test-tmp/rpc-test-646d197826be471281435df97010a305.sock every 8 connection(s)
I20260924 15:18:44.972043 27140 acceptor_pool.cc:254] collecting diagnostics on the listening RPC socket unix:/tmp/dist-test-taskDRrOpR/test-tmp/rpc-test-646d197826be471281435df97010a305.sock every 8 connection(s)
I20260924 15:18:44.983294 27143 rpc-test-base.h:222] got call: sleep_micros: 3000000 deferred: true
I20260924 15:18:47.983999 27143 rpcz_store.cc:275] Call kudu.rpc.GenericCalculatorService.Sleep from unix:<unnamed> (request call id 0) took 3000 ms. Trace:
I20260924 15:18:47.984112 27143 rpcz_store.cc:276] 0924 15:18:44.983166 (+     0us) service_pool.cc:170] Inserting onto call queue
0924 15:18:44.983258 (+    92us) service_pool.cc:227] Handling call
0924 15:18:47.983979 (+3000721us) inbound_call.cc:173] Queueing success response
Metrics: {}
[       OK ] Parameters/TestRpc.TestCallLongerThanKeepalive/SSL_UnixSocket (3028 ms)
[ RUN      ] Parameters/TestRpc.TestRpcSidecar/SSL_UnixSocket
I20260924 15:18:48.001408 27164 acceptor_pool.cc:254] collecting diagnostics on the listening RPC socket unix:/tmp/dist-test-taskDRrOpR/test-tmp/rpc-test-c155ae315f1b40b698a50f0f8d028d6b.sock every 8 connection(s)
I20260924 15:18:48.001451 27165 acceptor_pool.cc:254] collecting diagnostics on the listening RPC socket unix:/tmp/dist-test-taskDRrOpR/test-tmp/rpc-test-c155ae315f1b40b698a50f0f8d028d6b.sock every 8 connection(s)
W20260924 15:18:48.067695 27161 connection.cc:196] Error closing socket: Network error: TlsSocket::Close: Broken pipe
[       OK ] Parameters/TestRpc.TestRpcSidecar/SSL_UnixSocket (82 ms)
[ RUN      ] Parameters/TestRpc.TestRpcSidecarLimits/SSL_UnixSocket
I20260924 15:18:49.691835 27189 acceptor_pool.cc:254] collecting diagnostics on the listening RPC socket unix:/tmp/dist-test-taskDRrOpR/test-tmp/rpc-test-01319590c18d4570a0cd6a3af76f31a8.sock every 8 connection(s)
I20260924 15:18:49.691892 27190 acceptor_pool.cc:254] collecting diagnostics on the listening RPC socket unix:/tmp/dist-test-taskDRrOpR/test-tmp/rpc-test-01319590c18d4570a0cd6a3af76f31a8.sock every 8 connection(s)
W20260924 15:18:49.707851 26947 serialization.cc:72] Serialized kudu.rpc_test.PushStringsRequestPB (2147483654 bytes) is larger than the maximum configured RPC message size (52428800 bytes). Sending anyway, but peer may reject the data.
W20260924 15:18:49.710785 27186 connection.cc:535] server connection from unix:<unnamed> recv error: Network error: RPC frame had a length of 2147483714, but we only support messages up to 52428800 bytes long.
W20260924 15:18:49.710847 27186 connection.cc:158] shutting down server connection from unix:<unnamed> with pending inbound data: 4/2147483714 bytes received; last active 0 ns ago: status Network error: RPC frame had a length of 2147483714, but we only support messages up to 52428800 bytes long.
W20260924 15:18:49.711050 27202 connection.cc:196] Error closing socket: Network error: TlsSocket::Close: Broken pipe
I20260924 15:18:49.726308 27214 acceptor_pool.cc:254] collecting diagnostics on the listening RPC socket unix:/tmp/dist-test-taskDRrOpR/test-tmp/rpc-test-01319590c18d4570a0cd6a3af76f31a8.sock every 8 connection(s)
I20260924 15:18:49.726408 27215 acceptor_pool.cc:254] collecting diagnostics on the listening RPC socket unix:/tmp/dist-test-taskDRrOpR/test-tmp/rpc-test-01319590c18d4570a0cd6a3af76f31a8.sock every 8 connection(s)
W20260924 15:18:53.879148 27211 connection.cc:577] server connection from unix:<unnamed>: received bad data: 'Corruption: Invalid packet: message had a length of 2147483710, but we only support messages up to 2147483647 bytes
'
W20260924 15:18:53.879534 27227 connection.cc:196] Error closing socket: Network error: TlsSocket::Close: Broken pipe
[       OK ] Parameters/TestRpc.TestRpcSidecarLimits/SSL_UnixSocket (5813 ms)
[ RUN      ] Parameters/TestRpc.TestCallTimeoutDoesntAffectNegotiation/SSL_UnixSocket
I20260924 15:18:53.896345 27239 acceptor_pool.cc:254] collecting diagnostics on the listening RPC socket unix:/tmp/dist-test-taskDRrOpR/test-tmp/rpc-test-ef96d30ff2f54f82a207b4784131483f.sock every 8 connection(s)
I20260924 15:18:53.896358 27240 acceptor_pool.cc:254] collecting diagnostics on the listening RPC socket unix:/tmp/dist-test-taskDRrOpR/test-tmp/rpc-test-ef96d30ff2f54f82a207b4784131483f.sock every 8 connection(s)
W20260924 15:18:53.905853 27235 negotiation.cc:266] Injecting 500ms delay in negotiation
I20260924 15:18:53.956147 26947 rpc-test-base.h:595] status: Timed out: connection negotiation to unix:/tmp/dist-test-taskDRrOpR/test-tmp/rpc-test-ef96d30ff2f54f82a207b4784131483f.sock for RPC Sleep timed out after 0.050s (ON_OUTBOUND_QUEUE), seconds elapsed: 0.0506016
[       OK ] Parameters/TestRpc.TestCallTimeoutDoesntAffectNegotiation/SSL_UnixSocket (528 ms)
[ RUN      ] Parameters/TestRpc.TestRpcHandlerLatencyMetric/SSL_UnixSocket
I20260924 15:18:54.422544 27264 acceptor_pool.cc:254] collecting diagnostics on the listening RPC socket unix:/tmp/dist-test-taskDRrOpR/test-tmp/rpc-test-aae3cd4a83534e88b75653acb41667cc.sock every 8 connection(s)
I20260924 15:18:54.422647 27265 acceptor_pool.cc:254] collecting diagnostics on the listening RPC socket unix:/tmp/dist-test-taskDRrOpR/test-tmp/rpc-test-aae3cd4a83534e88b75653acb41667cc.sock every 8 connection(s)
I20260924 15:18:54.467101 26947 rpc-test.cc:1236] Sleep() min lat: 20337
I20260924 15:18:54.467170 26947 rpc-test.cc:1237] Sleep() mean lat: 20337
I20260924 15:18:54.467248 26947 rpc-test.cc:1238] Sleep() max lat: 20337
I20260924 15:18:54.467273 26947 rpc-test.cc:1239] Sleep() #calls: 1
W20260924 15:18:54.467844 27261 connection.cc:196] Error closing socket: Network error: TlsSocket::Close: Broken pipe
[       OK ] Parameters/TestRpc.TestRpcHandlerLatencyMetric/SSL_UnixSocket (57 ms)
[ RUN      ] Parameters/TestRpc.TimedOutOnResponseMetricServiceQueue/SSL_UnixSocket
I20260924 15:18:54.480904 27290 acceptor_pool.cc:254] collecting diagnostics on the listening RPC socket unix:/tmp/dist-test-taskDRrOpR/test-tmp/rpc-test-bc62fe35e70a4bc6bde5df3579c5066f.sock every 8 connection(s)
I20260924 15:18:54.480948 27291 acceptor_pool.cc:254] collecting diagnostics on the listening RPC socket unix:/tmp/dist-test-taskDRrOpR/test-tmp/rpc-test-bc62fe35e70a4bc6bde5df3579c5066f.sock every 8 connection(s)
W20260924 15:18:54.536952 27292 rpcz_store.cc:267] Call kudu.rpc_test.CalculatorService.Sleep from unix:<unnamed> (request call id 2) took 20 ms (client timeout 20 ms). Trace:
W20260924 15:18:54.537050 27292 rpcz_store.cc:269] 0924 15:18:54.516580 (+     0us) service_pool.cc:170] Inserting onto call queue
0924 15:18:54.536867 (+ 20287us) service_pool.cc:214] Skipping call since client already timed out
0924 15:18:54.536881 (+    14us) inbound_call.cc:173] Queueing failure response
Metrics: {}
W20260924 15:18:54.537781 27287 connection.cc:196] Error closing socket: Network error: TlsSocket::Close: Broken pipe
[       OK ] Parameters/TestRpc.TimedOutOnResponseMetricServiceQueue/SSL_UnixSocket (69 ms)
[ RUN      ] Parameters/TestRpc.RpcPendingConnectionsMetric/SSL_UnixSocket
I20260924 15:18:54.540405 27313 acceptor_pool.cc:254] collecting diagnostics on the listening RPC socket 0.0.0.0:39789 every 8 connection(s)
I20260924 15:18:54.540474 27314 acceptor_pool.cc:254] collecting diagnostics on the listening RPC socket 0.0.0.0:39789 every 8 connection(s)
W20260924 15:18:54.541038 27309 negotiation.cc:337] Failed RPC negotiation. Trace:
0924 15:18:54.540872 (+     0us) reactor.cc:625] Submitting negotiation task for server connection from 127.0.0.1:32828 (local address 127.0.0.1:39789)
0924 15:18:54.540914 (+    42us) server_negotiation.cc:206] Beginning negotiation
0924 15:18:54.540915 (+     1us) server_negotiation.cc:399] Waiting for connection header
0924 15:18:54.540985 (+    70us) negotiation.cc:327] Negotiation complete: Network error: Server connection negotiation failed: server connection from 127.0.0.1:32828: BlockingRecv error: recv got EOF from 127.0.0.1:32828 (error 108)
Metrics: {"server-negotiator.queue_time_us":12}
[       OK ] Parameters/TestRpc.RpcPendingConnectionsMetric/SSL_UnixSocket (13 ms)
[ RUN      ] Parameters/TestRpc.TestRpcContextClientDeadline/SSL_UnixSocket
I20260924 15:18:54.572571 27329 acceptor_pool.cc:254] collecting diagnostics on the listening RPC socket unix:/tmp/dist-test-taskDRrOpR/test-tmp/rpc-test-18b50838528642cf9760302d1112f3b6.sock every 8 connection(s)
I20260924 15:18:54.572613 27330 acceptor_pool.cc:254] collecting diagnostics on the listening RPC socket unix:/tmp/dist-test-taskDRrOpR/test-tmp/rpc-test-18b50838528642cf9760302d1112f3b6.sock every 8 connection(s)
[       OK ] Parameters/TestRpc.TestRpcContextClientDeadline/SSL_UnixSocket (74 ms)
[ RUN      ] Parameters/TestRpc.TestApplicationFeatureFlagUnsupportedServer/SSL_UnixSocket
I20260924 15:18:54.643740 27354 acceptor_pool.cc:254] collecting diagnostics on the listening RPC socket unix:/tmp/dist-test-taskDRrOpR/test-tmp/rpc-test-9133940ba73249a090e863dc87fca52b.sock every 8 connection(s)
I20260924 15:18:54.643790 27355 acceptor_pool.cc:254] collecting diagnostics on the listening RPC socket unix:/tmp/dist-test-taskDRrOpR/test-tmp/rpc-test-9133940ba73249a090e863dc87fca52b.sock every 8 connection(s)
[       OK ] Parameters/TestRpc.TestApplicationFeatureFlagUnsupportedServer/SSL_UnixSocket (31 ms)
[ RUN      ] Parameters/TestRpc.TestCancellationAsync/SSL_UnixSocket
I20260924 15:18:54.669353 27379 acceptor_pool.cc:254] collecting diagnostics on the listening RPC socket unix:/tmp/dist-test-taskDRrOpR/test-tmp/rpc-test-c885d89c466940129408ac0ac85a82cf.sock every 8 connection(s)
I20260924 15:18:54.669409 27380 acceptor_pool.cc:254] collecting diagnostics on the listening RPC socket unix:/tmp/dist-test-taskDRrOpR/test-tmp/rpc-test-c885d89c466940129408ac0ac85a82cf.sock every 8 connection(s)
I20260924 15:18:54.669570 26947 rpc-test.cc:1716] Connecting to unix:/tmp/dist-test-taskDRrOpR/test-tmp/rpc-test-c885d89c466940129408ac0ac85a82cf.sock
I20260924 15:18:54.683389 26947 test_util.cc:268] Using random seed: 506626298
I20260924 15:18:54.703481 27383 rpc-test-base.h:240] got call: sleep_micros: 500 pattern: 4294967295 num_repetitions: 2097152 sidecar_idx: 0
I20260924 15:18:54.713832 27383 rpc-test-base.h:240] got call: sleep_micros: 500 pattern: 4294967295 num_repetitions: 2097152 sidecar_idx: 0
I20260924 15:18:54.724740 27383 rpc-test-base.h:240] got call: sleep_micros: 500 pattern: 4294967295 num_repetitions: 2097152 sidecar_idx: 0
I20260924 15:18:54.735453 27383 rpc-test-base.h:240] got call: sleep_micros: 500 pattern: 4294967295 num_repetitions: 2097152 sidecar_idx: 0
I20260924 15:18:54.746271 27383 rpc-test-base.h:240] got call: sleep_micros: 500 pattern: 4294967295 num_repetitions: 2097152 sidecar_idx: 0
I20260924 15:18:54.756878 27383 rpc-test-base.h:240] got call: sleep_micros: 500 pattern: 4294967295 num_repetitions: 2097152 sidecar_idx: 0
W20260924 15:18:54.758556 27376 connection.cc:196] Error closing socket: Network error: TlsSocket::Close: Broken pipe
W20260924 15:18:54.760017 27376 connection.cc:441] server connection from unix:<unnamed> torn down before Call kudu.rpc.GenericCalculatorService.SleepWithSidecar from unix:<unnamed> (request call id 9) could send its response
[       OK ] Parameters/TestRpc.TestCancellationAsync/SSL_UnixSocket (102 ms)
[ RUN      ] Parameters/TestRpc.TestPerformanceBySocketType/SSL_UnixSocket
I20260924 15:18:54.786896 27404 acceptor_pool.cc:254] collecting diagnostics on the listening RPC socket unix:/tmp/dist-test-taskDRrOpR/test-tmp/rpc-test-c81ee80d02ef4fb387b381d6240c8eca.sock every 8 connection(s)
I20260924 15:18:54.787101 26947 rpc-test.cc:1846] Connecting to unix:/tmp/dist-test-taskDRrOpR/test-tmp/rpc-test-c81ee80d02ef4fb387b381d6240c8eca.sock
I20260924 15:18:54.786926 27405 acceptor_pool.cc:254] collecting diagnostics on the listening RPC socket unix:/tmp/dist-test-taskDRrOpR/test-tmp/rpc-test-c81ee80d02ef4fb387b381d6240c8eca.sock every 8 connection(s)
I20260924 15:18:56.141562 26947 rpc-test.cc:1859] Sending 1024MB via ssl-enabled unix socket: real 1.348s	user 1.533s	sys 0.868s
I20260924 15:18:57.474826 26947 rpc-test.cc:1859] Sending 1024MB via ssl-enabled unix socket: real 1.333s	user 1.486s	sys 0.891s
I20260924 15:18:58.816500 26947 rpc-test.cc:1859] Sending 1024MB via ssl-enabled unix socket: real 1.342s	user 1.363s	sys 1.020s
I20260924 15:19:00.137627 26947 rpc-test.cc:1859] Sending 1024MB via ssl-enabled unix socket: real 1.321s	user 1.477s	sys 0.877s
I20260924 15:19:01.478520 26947 rpc-test.cc:1859] Sending 1024MB via ssl-enabled unix socket: real 1.341s	user 1.398s	sys 0.977s
W20260924 15:19:01.479286 27401 connection.cc:196] Error closing socket: Network error: TlsSocket::Close: Broken pipe
[       OK ] Parameters/TestRpc.TestPerformanceBySocketType/SSL_UnixSocket (6719 ms)
[----------] 20 tests from Parameters/TestRpc (26341 ms total)

[----------] 1 test from Parameters/TestRpcSocketTxRxQueue
[ RUN      ] Parameters/TestRpcSocketTxRxQueue.AcceptorRxQueueSizeMetric/0
I20260924 15:19:01.485698 27429 acceptor_pool.cc:254] collecting diagnostics on the listening RPC socket 0.0.0.0:33077 every 1 connection(s)
I20260924 15:19:01.485760 27430 acceptor_pool.cc:254] collecting diagnostics on the listening RPC socket 0.0.0.0:33077 every 1 connection(s)
W20260924 15:19:01.486318 27425 negotiation.cc:337] Failed RPC negotiation. Trace:
0924 15:19:01.486172 (+     0us) reactor.cc:625] Submitting negotiation task for server connection from 127.0.0.1:57420 (local address 127.0.0.1:33077)
0924 15:19:01.486217 (+    45us) server_negotiation.cc:206] Beginning negotiation
0924 15:19:01.486219 (+     2us) server_negotiation.cc:399] Waiting for connection header
0924 15:19:01.486287 (+    68us) negotiation.cc:327] Negotiation complete: Network error: Server connection negotiation failed: server connection from 127.0.0.1:57420: BlockingRecv error: recv got EOF from 127.0.0.1:57420 (error 108)
Metrics: {"server-negotiator.queue_time_us":16}
[       OK ] Parameters/TestRpcSocketTxRxQueue.AcceptorRxQueueSizeMetric/0 (7 ms)
[----------] 1 test from Parameters/TestRpcSocketTxRxQueue (7 ms total)

[----------] Global test environment tear-down
[==========] 21 tests from 2 test suites ran. (26349 ms total)
[  PASSED  ] 20 tests.
[  FAILED  ] 1 test, listed below:
[  FAILED  ] Parameters/TestRpc.TestCallWithChainCertAndChainCA/SSL_UnixSocket, where GetParam() = (true, true)

 1 FAILED TEST