Diagnosed failure

Parameters/TestRpc.TestCallWithChainCertAndChainCA/SSL_UnixSocket: /data0/somelongdirectorytoavoidrpathissues/src/kudu/src/kudu/rpc/rpc-test.cc:270: Failure
Failed
Bad status: Runtime error: could not verify certificate chain (error with cert: subject=CN = localhost, ST = sadfjas, C = AS, emailAddress = sdflkdsajf, O = lskdfjlsad, OU = sldfkja, issuer=C = AS, ST = ASDfkjdhf, L = lskdjf, O = saldfja, OU = skdjf, CN = localhost, emailAddress = sadjflkadsj): : certificate has expired
Google Test trace:
/data0/somelongdirectorytoavoidrpathissues/src/kudu/src/kudu/rpc/rpc-test.cc:267: Connecting to unix:/tmp/dist-test-tasknBh2dr/test-tmp/rpc-test-5b89ebb35c1c425fa334a238a677c2c6.sock
I20260926 22:40:00.018313 22292 test_util.cc:175] -----------------------------------------------
I20260926 22:40:00.018370 22292 test_util.cc:176] Had fatal failures, leaving test files at /tmp/dist-test-tasknBh2dr/test-tmp/rpc-test.6.Parameters_TestRpc.TestCallWithChainCertAndChainCA_SSL_UnixSocket.1790462399941897-22292-0

Full log

Note: This is test shard 7 of 8.
[==========] Running 21 tests from 2 test suites.
[----------] Global test environment set-up.
[----------] 20 tests from Parameters/TestRpc
[ RUN      ] Parameters/TestRpc.TestMessengerCreateDestroy/SSL_UnixSocket
WARNING: Logging before InitGoogleLogging() is written to STDERR
I20260926 22:39:59.976449 22292 rpc-test.cc:169] started messenger TestCreateDestroy
[       OK ] Parameters/TestRpc.TestMessengerCreateDestroy/SSL_UnixSocket (32 ms)
[ RUN      ] Parameters/TestRpc.TestNegotiationDeadlock/SSL_UnixSocket
I20260926 22:39:59.988490 22313 acceptor_pool.cc:254] collecting diagnostics on the listening RPC socket unix:/tmp/dist-test-tasknBh2dr/test-tmp/rpc-test-d1676ef7df7d4f18821abdb55d885c7c.sock every 8 connection(s)
I20260926 22:39:59.988498 22312 acceptor_pool.cc:254] collecting diagnostics on the listening RPC socket unix:/tmp/dist-test-tasknBh2dr/test-tmp/rpc-test-d1676ef7df7d4f18821abdb55d885c7c.sock every 8 connection(s)
[       OK ] Parameters/TestRpc.TestNegotiationDeadlock/SSL_UnixSocket (18 ms)
[ RUN      ] Parameters/TestRpc.TestCallWithChainCertAndChainCA/SSL_UnixSocket
I20260926 22:40:00.014230 22328 acceptor_pool.cc:254] collecting diagnostics on the listening RPC socket unix:/tmp/dist-test-tasknBh2dr/test-tmp/rpc-test-5b89ebb35c1c425fa334a238a677c2c6.sock every 8 connection(s)
I20260926 22:40:00.014237 22329 acceptor_pool.cc:254] collecting diagnostics on the listening RPC socket unix:/tmp/dist-test-tasknBh2dr/test-tmp/rpc-test-5b89ebb35c1c425fa334a238a677c2c6.sock every 8 connection(s)
/data0/somelongdirectorytoavoidrpathissues/src/kudu/src/kudu/rpc/rpc-test.cc:270: Failure
Failed
Bad status: Runtime error: could not verify certificate chain (error with cert: subject=CN = localhost, ST = sadfjas, C = AS, emailAddress = sdflkdsajf, O = lskdfjlsad, OU = sldfkja, issuer=C = AS, ST = ASDfkjdhf, L = lskdjf, O = saldfja, OU = skdjf, CN = localhost, emailAddress = sadjflkadsj): : certificate has expired
Google Test trace:
/data0/somelongdirectorytoavoidrpathissues/src/kudu/src/kudu/rpc/rpc-test.cc:267: Connecting to unix:/tmp/dist-test-tasknBh2dr/test-tmp/rpc-test-5b89ebb35c1c425fa334a238a677c2c6.sock
I20260926 22:40:00.018313 22292 test_util.cc:175] -----------------------------------------------
I20260926 22:40:00.018370 22292 test_util.cc:176] Had fatal failures, leaving test files at /tmp/dist-test-tasknBh2dr/test-tmp/rpc-test.6.Parameters_TestRpc.TestCallWithChainCertAndChainCA_SSL_UnixSocket.1790462399941897-22292-0
[  FAILED  ] Parameters/TestRpc.TestCallWithChainCertAndChainCA/SSL_UnixSocket, where GetParam() = (true, true) (22 ms)
[ RUN      ] Parameters/TestRpc.TestCallWithPasswordProtectedKey/SSL_UnixSocket
I20260926 22:40:00.043108 22354 acceptor_pool.cc:254] collecting diagnostics on the listening RPC socket unix:/tmp/dist-test-tasknBh2dr/test-tmp/rpc-test-e29042103e3f4d06946bcd873b1f3822.sock every 8 connection(s)
I20260926 22:40:00.043112 22353 acceptor_pool.cc:254] collecting diagnostics on the listening RPC socket unix:/tmp/dist-test-tasknBh2dr/test-tmp/rpc-test-e29042103e3f4d06946bcd873b1f3822.sock every 8 connection(s)
W20260926 22:40:00.055974 22350 connection.cc:196] Error closing socket: Network error: TlsSocket::Close: Broken pipe
[       OK ] Parameters/TestRpc.TestCallWithPasswordProtectedKey/SSL_UnixSocket (38 ms)
[ RUN      ] Parameters/TestRpc.TestCallToBadServer/SSL_UnixSocket
I20260926 22:40:00.072054 22292 rpc-test.cc:394] Status: Network error: Client connection negotiation failed: client connection to 0.0.0.0:0: connect: Connection refused (error 111)
I20260926 22:40:00.072310 22292 rpc-test.cc:394] Status: Network error: Client connection negotiation failed: client connection to 0.0.0.0:0: connect: Connection refused (error 111)
I20260926 22:40:00.072570 22292 rpc-test.cc:394] Status: Network error: Client connection negotiation failed: client connection to 0.0.0.0:0: connect: Connection refused (error 111)
I20260926 22:40:00.072758 22292 rpc-test.cc:394] Status: Network error: Client connection negotiation failed: client connection to 0.0.0.0:0: connect: Connection refused (error 111)
I20260926 22:40:00.072938 22292 rpc-test.cc:394] Status: Network error: Client connection negotiation failed: client connection to 0.0.0.0:0: connect: Connection refused (error 111)
[       OK ] Parameters/TestRpc.TestCallToBadServer/SSL_UnixSocket (16 ms)
[ RUN      ] Parameters/TestRpc.TestWrongService/SSL_UnixSocket
I20260926 22:40:00.079041 22388 acceptor_pool.cc:254] collecting diagnostics on the listening RPC socket unix:/tmp/dist-test-tasknBh2dr/test-tmp/rpc-test-82cf73da9b3843b2a037518a54b686da.sock every 8 connection(s)
I20260926 22:40:00.079090 22389 acceptor_pool.cc:254] collecting diagnostics on the listening RPC socket unix:/tmp/dist-test-tasknBh2dr/test-tmp/rpc-test-82cf73da9b3843b2a037518a54b686da.sock every 8 connection(s)
I20260926 22:40:00.098014 22385 messenger.cc:345] service WrongServiceName not registered on TestServer
[       OK ] Parameters/TestRpc.TestWrongService/SSL_UnixSocket (27 ms)
[ RUN      ] Parameters/TestRpc.TestConnectionKeepalive/SSL_UnixSocket
I20260926 22:40:00.109798 22411 acceptor_pool.cc:254] collecting diagnostics on the listening RPC socket unix:/tmp/dist-test-tasknBh2dr/test-tmp/rpc-test-5c4806b8292f47ed8ba8d530728712b3.sock every 8 connection(s)
I20260926 22:40:00.109850 22412 acceptor_pool.cc:254] collecting diagnostics on the listening RPC socket unix:/tmp/dist-test-tasknBh2dr/test-tmp/rpc-test-5c4806b8292f47ed8ba8d530728712b3.sock every 8 connection(s)
I20260926 22:40:00.110018 22292 rpc-test.cc:488] Connecting to unix:/tmp/dist-test-tasknBh2dr/test-tmp/rpc-test-5c4806b8292f47ed8ba8d530728712b3.sock
W20260926 22:40:00.602075 22424 connection.cc:196] Error closing socket: Network error: TlsSocket::Close: Broken pipe
[       OK ] Parameters/TestRpc.TestConnectionKeepalive/SSL_UnixSocket (1028 ms)
[ RUN      ] Parameters/TestRpc.TestClientConnectionMetrics/SSL_UnixSocket
I20260926 22:40:01.136461 22437 acceptor_pool.cc:254] collecting diagnostics on the listening RPC socket unix:/tmp/dist-test-tasknBh2dr/test-tmp/rpc-test-0f5cc6da976840e098999d87cbad0f58.sock every 8 connection(s)
I20260926 22:40:01.136462 22436 acceptor_pool.cc:254] collecting diagnostics on the listening RPC socket unix:/tmp/dist-test-tasknBh2dr/test-tmp/rpc-test-0f5cc6da976840e098999d87cbad0f58.sock every 8 connection(s)
I20260926 22:40:01.136651 22292 rpc-test.cc:569] Connecting to unix:/tmp/dist-test-tasknBh2dr/test-tmp/rpc-test-0f5cc6da976840e098999d87cbad0f58.sock
W20260926 22:40:10.042243 22433 connection.cc:196] Error closing socket: Network error: TlsSocket::Close: Broken pipe
[       OK ] Parameters/TestRpc.TestClientConnectionMetrics/SSL_UnixSocket (8913 ms)
[ RUN      ] Parameters/TestRpc.TestCredentialsPolicy/SSL_UnixSocket
I20260926 22:40:10.051891 22459 acceptor_pool.cc:254] collecting diagnostics on the listening RPC socket unix:/tmp/dist-test-tasknBh2dr/test-tmp/rpc-test-fe8dc27d10b44612949d3cade7c0d651.sock every 8 connection(s)
I20260926 22:40:10.051914 22460 acceptor_pool.cc:254] collecting diagnostics on the listening RPC socket unix:/tmp/dist-test-tasknBh2dr/test-tmp/rpc-test-fe8dc27d10b44612949d3cade7c0d651.sock every 8 connection(s)
I20260926 22:40:10.052070 22292 rpc-test.cc:700] Connecting to unix:/tmp/dist-test-tasknBh2dr/test-tmp/rpc-test-fe8dc27d10b44612949d3cade7c0d651.sock
W20260926 22:40:10.067839 22458 connection.cc:196] Error closing socket: Network error: TlsSocket::Close: Broken pipe
[       OK ] Parameters/TestRpc.TestCredentialsPolicy/SSL_UnixSocket (28 ms)
[ RUN      ] Parameters/TestRpc.TestCallLongerThanKeepalive/SSL_UnixSocket
I20260926 22:40:10.081597 22484 acceptor_pool.cc:254] collecting diagnostics on the listening RPC socket unix:/tmp/dist-test-tasknBh2dr/test-tmp/rpc-test-4ac7b7545e7244b58d1933e7b74e0545.sock every 8 connection(s)
I20260926 22:40:10.081640 22485 acceptor_pool.cc:254] collecting diagnostics on the listening RPC socket unix:/tmp/dist-test-tasknBh2dr/test-tmp/rpc-test-4ac7b7545e7244b58d1933e7b74e0545.sock every 8 connection(s)
I20260926 22:40:10.105283 22488 rpc-test-base.h:222] got call: sleep_micros: 3000000 deferred: true
I20260926 22:40:13.106097 22488 rpcz_store.cc:275] Call kudu.rpc.GenericCalculatorService.Sleep from unix:<unnamed> (request call id 0) took 3000 ms. Trace:
I20260926 22:40:13.106230 22488 rpcz_store.cc:276] 0926 22:40:10.105224 (+     0us) service_pool.cc:170] Inserting onto call queue
0926 22:40:10.105258 (+    34us) service_pool.cc:227] Handling call
0926 22:40:13.106081 (+3000823us) inbound_call.cc:173] Queueing success response
Metrics: {}
[       OK ] Parameters/TestRpc.TestCallLongerThanKeepalive/SSL_UnixSocket (3037 ms)
[ RUN      ] Parameters/TestRpc.TestRpcSidecar/SSL_UnixSocket
I20260926 22:40:13.119825 22509 acceptor_pool.cc:254] collecting diagnostics on the listening RPC socket unix:/tmp/dist-test-tasknBh2dr/test-tmp/rpc-test-181da3d8a56a402ebb6961aa026e4284.sock every 8 connection(s)
I20260926 22:40:13.119848 22510 acceptor_pool.cc:254] collecting diagnostics on the listening RPC socket unix:/tmp/dist-test-tasknBh2dr/test-tmp/rpc-test-181da3d8a56a402ebb6961aa026e4284.sock every 8 connection(s)
[       OK ] Parameters/TestRpc.TestRpcSidecar/SSL_UnixSocket (46 ms)
[ RUN      ] Parameters/TestRpc.TestRpcSidecarLimits/SSL_UnixSocket
I20260926 22:40:15.090087 22534 acceptor_pool.cc:254] collecting diagnostics on the listening RPC socket unix:/tmp/dist-test-tasknBh2dr/test-tmp/rpc-test-33afba80cc604585862eba105453ff13.sock every 8 connection(s)
I20260926 22:40:15.090194 22535 acceptor_pool.cc:254] collecting diagnostics on the listening RPC socket unix:/tmp/dist-test-tasknBh2dr/test-tmp/rpc-test-33afba80cc604585862eba105453ff13.sock every 8 connection(s)
W20260926 22:40:15.113619 22292 serialization.cc:72] Serialized kudu.rpc_test.PushStringsRequestPB (2147483654 bytes) is larger than the maximum configured RPC message size (52428800 bytes). Sending anyway, but peer may reject the data.
W20260926 22:40:15.117302 22531 connection.cc:535] server connection from unix:<unnamed> recv error: Network error: RPC frame had a length of 2147483714, but we only support messages up to 52428800 bytes long.
W20260926 22:40:15.117434 22531 connection.cc:158] shutting down server connection from unix:<unnamed> with pending inbound data: 4/2147483714 bytes received; last active 0 ns ago: status Network error: RPC frame had a length of 2147483714, but we only support messages up to 52428800 bytes long.
W20260926 22:40:15.117681 22547 connection.cc:196] Error closing socket: Network error: TlsSocket::Close: Broken pipe
I20260926 22:40:15.126853 22559 acceptor_pool.cc:254] collecting diagnostics on the listening RPC socket unix:/tmp/dist-test-tasknBh2dr/test-tmp/rpc-test-33afba80cc604585862eba105453ff13.sock every 8 connection(s)
I20260926 22:40:15.127033 22560 acceptor_pool.cc:254] collecting diagnostics on the listening RPC socket unix:/tmp/dist-test-tasknBh2dr/test-tmp/rpc-test-33afba80cc604585862eba105453ff13.sock every 8 connection(s)
W20260926 22:40:20.045739 22556 connection.cc:577] server connection from unix:<unnamed>: received bad data: 'Corruption: Invalid packet: message had a length of 2147483710, but we only support messages up to 2147483647 bytes
'
W20260926 22:40:20.046025 22572 connection.cc:196] Error closing socket: Network error: TlsSocket::Close: Broken pipe
[       OK ] Parameters/TestRpc.TestRpcSidecarLimits/SSL_UnixSocket (6891 ms)
[ RUN      ] Parameters/TestRpc.TestCallTimeoutDoesntAffectNegotiation/SSL_UnixSocket
I20260926 22:40:20.061471 22584 acceptor_pool.cc:254] collecting diagnostics on the listening RPC socket unix:/tmp/dist-test-tasknBh2dr/test-tmp/rpc-test-3ae9d18842b34138bc75a72bf62bf0b6.sock every 8 connection(s)
I20260926 22:40:20.061589 22585 acceptor_pool.cc:254] collecting diagnostics on the listening RPC socket unix:/tmp/dist-test-tasknBh2dr/test-tmp/rpc-test-3ae9d18842b34138bc75a72bf62bf0b6.sock every 8 connection(s)
W20260926 22:40:20.071973 22580 negotiation.cc:266] Injecting 500ms delay in negotiation
I20260926 22:40:20.122331 22292 rpc-test-base.h:595] status: Timed out: connection negotiation to unix:/tmp/dist-test-tasknBh2dr/test-tmp/rpc-test-3ae9d18842b34138bc75a72bf62bf0b6.sock for RPC Sleep timed out after 0.050s (ON_OUTBOUND_QUEUE), seconds elapsed: 0.0506524
[       OK ] Parameters/TestRpc.TestCallTimeoutDoesntAffectNegotiation/SSL_UnixSocket (529 ms)
[ RUN      ] Parameters/TestRpc.TestRpcHandlerLatencyMetric/SSL_UnixSocket
I20260926 22:40:20.603713 22609 acceptor_pool.cc:254] collecting diagnostics on the listening RPC socket unix:/tmp/dist-test-tasknBh2dr/test-tmp/rpc-test-ff0520b0b8ef4371adc169864c283275.sock every 8 connection(s)
I20260926 22:40:20.603749 22610 acceptor_pool.cc:254] collecting diagnostics on the listening RPC socket unix:/tmp/dist-test-tasknBh2dr/test-tmp/rpc-test-ff0520b0b8ef4371adc169864c283275.sock every 8 connection(s)
I20260926 22:40:20.641641 22292 rpc-test.cc:1236] Sleep() min lat: 20368
I20260926 22:40:20.641736 22292 rpc-test.cc:1237] Sleep() mean lat: 20368
I20260926 22:40:20.641773 22292 rpc-test.cc:1238] Sleep() max lat: 20368
I20260926 22:40:20.641795 22292 rpc-test.cc:1239] Sleep() #calls: 1
W20260926 22:40:20.642376 22606 connection.cc:196] Error closing socket: Network error: TlsSocket::Close: Broken pipe
[       OK ] Parameters/TestRpc.TestRpcHandlerLatencyMetric/SSL_UnixSocket (66 ms)
[ RUN      ] Parameters/TestRpc.TimedOutOnResponseMetricServiceQueue/SSL_UnixSocket
I20260926 22:40:20.657986 22635 acceptor_pool.cc:254] collecting diagnostics on the listening RPC socket unix:/tmp/dist-test-tasknBh2dr/test-tmp/rpc-test-a2c1660bc8dd40d6a37829438e303752.sock every 8 connection(s)
I20260926 22:40:20.658015 22636 acceptor_pool.cc:254] collecting diagnostics on the listening RPC socket unix:/tmp/dist-test-tasknBh2dr/test-tmp/rpc-test-a2c1660bc8dd40d6a37829438e303752.sock every 8 connection(s)
W20260926 22:40:20.732229 22637 rpcz_store.cc:267] Call kudu.rpc_test.CalculatorService.Sleep from unix:<unnamed> (request call id 2) took 20 ms (client timeout 20 ms). Trace:
W20260926 22:40:20.732352 22637 rpcz_store.cc:269] 0926 22:40:20.711934 (+     0us) service_pool.cc:170] Inserting onto call queue
0926 22:40:20.732205 (+ 20271us) service_pool.cc:214] Skipping call since client already timed out
0926 22:40:20.732214 (+     9us) inbound_call.cc:173] Queueing failure response
Metrics: {}
[       OK ] Parameters/TestRpc.TimedOutOnResponseMetricServiceQueue/SSL_UnixSocket (90 ms)
[ RUN      ] Parameters/TestRpc.RpcPendingConnectionsMetric/SSL_UnixSocket
I20260926 22:40:20.735584 22658 acceptor_pool.cc:254] collecting diagnostics on the listening RPC socket 0.0.0.0:44963 every 8 connection(s)
I20260926 22:40:20.735648 22659 acceptor_pool.cc:254] collecting diagnostics on the listening RPC socket 0.0.0.0:44963 every 8 connection(s)
W20260926 22:40:20.736323 22654 negotiation.cc:337] Failed RPC negotiation. Trace:
0926 22:40:20.736134 (+     0us) reactor.cc:625] Submitting negotiation task for server connection from 127.0.0.1:34358 (local address 127.0.0.1:44963)
0926 22:40:20.736183 (+    49us) server_negotiation.cc:206] Beginning negotiation
0926 22:40:20.736185 (+     2us) server_negotiation.cc:399] Waiting for connection header
0926 22:40:20.736271 (+    86us) negotiation.cc:327] Negotiation complete: Network error: Server connection negotiation failed: server connection from 127.0.0.1:34358: BlockingRecv error: recv got EOF from 127.0.0.1:34358 (error 108)
Metrics: {"server-negotiator.queue_time_us":14}
[       OK ] Parameters/TestRpc.RpcPendingConnectionsMetric/SSL_UnixSocket (13 ms)
[ RUN      ] Parameters/TestRpc.TestRpcContextClientDeadline/SSL_UnixSocket
I20260926 22:40:20.774371 22674 acceptor_pool.cc:254] collecting diagnostics on the listening RPC socket unix:/tmp/dist-test-tasknBh2dr/test-tmp/rpc-test-0e74aae557f7489eb6ffd6ba4a27bd04.sock every 8 connection(s)
I20260926 22:40:20.774407 22675 acceptor_pool.cc:254] collecting diagnostics on the listening RPC socket unix:/tmp/dist-test-tasknBh2dr/test-tmp/rpc-test-0e74aae557f7489eb6ffd6ba4a27bd04.sock every 8 connection(s)
[       OK ] Parameters/TestRpc.TestRpcContextClientDeadline/SSL_UnixSocket (59 ms)
[ RUN      ] Parameters/TestRpc.TestApplicationFeatureFlagUnsupportedServer/SSL_UnixSocket
I20260926 22:40:20.838227 22699 acceptor_pool.cc:254] collecting diagnostics on the listening RPC socket unix:/tmp/dist-test-tasknBh2dr/test-tmp/rpc-test-29beb79a0857404ba7259f7fa4874f6e.sock every 8 connection(s)
I20260926 22:40:20.838264 22700 acceptor_pool.cc:254] collecting diagnostics on the listening RPC socket unix:/tmp/dist-test-tasknBh2dr/test-tmp/rpc-test-29beb79a0857404ba7259f7fa4874f6e.sock every 8 connection(s)
W20260926 22:40:20.862437 22696 connection.cc:196] Error closing socket: Network error: TlsSocket::Close: Broken pipe
[       OK ] Parameters/TestRpc.TestApplicationFeatureFlagUnsupportedServer/SSL_UnixSocket (56 ms)
[ RUN      ] Parameters/TestRpc.TestCancellationAsync/SSL_UnixSocket
I20260926 22:40:20.889366 22724 acceptor_pool.cc:254] collecting diagnostics on the listening RPC socket unix:/tmp/dist-test-tasknBh2dr/test-tmp/rpc-test-e517e2be84ac4cbf83b917db109763bf.sock every 8 connection(s)
I20260926 22:40:20.889394 22725 acceptor_pool.cc:254] collecting diagnostics on the listening RPC socket unix:/tmp/dist-test-tasknBh2dr/test-tmp/rpc-test-e517e2be84ac4cbf83b917db109763bf.sock every 8 connection(s)
I20260926 22:40:20.889562 22292 rpc-test.cc:1716] Connecting to unix:/tmp/dist-test-tasknBh2dr/test-tmp/rpc-test-e517e2be84ac4cbf83b917db109763bf.sock
I20260926 22:40:20.899652 22292 test_util.cc:268] Using random seed: -2070620353
I20260926 22:40:20.914829 22728 rpc-test-base.h:240] got call: sleep_micros: 500 pattern: 4294967295 num_repetitions: 2097152 sidecar_idx: 0
I20260926 22:40:20.925879 22728 rpc-test-base.h:240] got call: sleep_micros: 500 pattern: 4294967295 num_repetitions: 2097152 sidecar_idx: 0
I20260926 22:40:20.936659 22728 rpc-test-base.h:240] got call: sleep_micros: 500 pattern: 4294967295 num_repetitions: 2097152 sidecar_idx: 0
I20260926 22:40:20.947484 22728 rpc-test-base.h:240] got call: sleep_micros: 500 pattern: 4294967295 num_repetitions: 2097152 sidecar_idx: 0
I20260926 22:40:20.958272 22728 rpc-test-base.h:240] got call: sleep_micros: 500 pattern: 4294967295 num_repetitions: 2097152 sidecar_idx: 0
I20260926 22:40:20.969141 22728 rpc-test-base.h:240] got call: sleep_micros: 500 pattern: 4294967295 num_repetitions: 2097152 sidecar_idx: 0
I20260926 22:40:20.979785 22728 rpc-test-base.h:240] got call: sleep_micros: 500 pattern: 4294967295 num_repetitions: 2097152 sidecar_idx: 0
I20260926 22:40:20.990087 22728 rpc-test-base.h:240] got call: sleep_micros: 500 pattern: 4294967295 num_repetitions: 2097152 sidecar_idx: 0
W20260926 22:40:20.992003 22721 connection.cc:196] Error closing socket: Network error: TlsSocket::Close: Broken pipe
W20260926 22:40:20.993350 22721 connection.cc:441] server connection from unix:<unnamed> torn down before Call kudu.rpc.GenericCalculatorService.SleepWithSidecar from unix:<unnamed> (request call id 9) could send its response
[       OK ] Parameters/TestRpc.TestCancellationAsync/SSL_UnixSocket (130 ms)
[ RUN      ] Parameters/TestRpc.TestPerformanceBySocketType/SSL_UnixSocket
I20260926 22:40:21.004906 22749 acceptor_pool.cc:254] collecting diagnostics on the listening RPC socket unix:/tmp/dist-test-tasknBh2dr/test-tmp/rpc-test-338a29ad9ab847a2af9722cf778d043f.sock every 8 connection(s)
I20260926 22:40:21.004957 22750 acceptor_pool.cc:254] collecting diagnostics on the listening RPC socket unix:/tmp/dist-test-tasknBh2dr/test-tmp/rpc-test-338a29ad9ab847a2af9722cf778d043f.sock every 8 connection(s)
I20260926 22:40:21.005127 22292 rpc-test.cc:1846] Connecting to unix:/tmp/dist-test-tasknBh2dr/test-tmp/rpc-test-338a29ad9ab847a2af9722cf778d043f.sock
I20260926 22:40:22.299021 22292 rpc-test.cc:1859] Sending 1024MB via ssl-enabled unix socket: real 1.284s	user 1.329s	sys 0.967s
I20260926 22:40:23.627823 22292 rpc-test.cc:1859] Sending 1024MB via ssl-enabled unix socket: real 1.329s	user 1.503s	sys 0.863s
I20260926 22:40:24.923776 22292 rpc-test.cc:1859] Sending 1024MB via ssl-enabled unix socket: real 1.296s	user 1.360s	sys 0.956s
I20260926 22:40:26.309372 22292 rpc-test.cc:1859] Sending 1024MB via ssl-enabled unix socket: real 1.385s	user 1.532s	sys 0.930s
I20260926 22:40:27.647347 22292 rpc-test.cc:1859] Sending 1024MB via ssl-enabled unix socket: real 1.338s	user 1.376s	sys 0.999s
W20260926 22:40:27.648118 22746 connection.cc:196] Error closing socket: Network error: TlsSocket::Close: Broken pipe
[       OK ] Parameters/TestRpc.TestPerformanceBySocketType/SSL_UnixSocket (6654 ms)
[----------] 20 tests from Parameters/TestRpc (27704 ms total)

[----------] 1 test from Parameters/TestRpcSocketTxRxQueue
[ RUN      ] Parameters/TestRpcSocketTxRxQueue.AcceptorRxQueueSizeMetric/0
I20260926 22:40:27.656064 22774 acceptor_pool.cc:254] collecting diagnostics on the listening RPC socket 0.0.0.0:38665 every 1 connection(s)
I20260926 22:40:27.656113 22775 acceptor_pool.cc:254] collecting diagnostics on the listening RPC socket 0.0.0.0:38665 every 1 connection(s)
W20260926 22:40:27.656651 22770 negotiation.cc:337] Failed RPC negotiation. Trace:
0926 22:40:27.656502 (+     0us) reactor.cc:625] Submitting negotiation task for server connection from 127.0.0.1:46952 (local address 127.0.0.1:38665)
0926 22:40:27.656550 (+    48us) server_negotiation.cc:206] Beginning negotiation
0926 22:40:27.656552 (+     2us) server_negotiation.cc:399] Waiting for connection header
0926 22:40:27.656619 (+    67us) negotiation.cc:327] Negotiation complete: Network error: Server connection negotiation failed: server connection from 127.0.0.1:46952: BlockingRecv error: recv got EOF from 127.0.0.1:46952 (error 108)
Metrics: {"server-negotiator.queue_time_us":22}
[       OK ] Parameters/TestRpcSocketTxRxQueue.AcceptorRxQueueSizeMetric/0 (10 ms)
[----------] 1 test from Parameters/TestRpcSocketTxRxQueue (10 ms total)

[----------] Global test environment tear-down
[==========] 21 tests from 2 test suites ran. (27714 ms total)
[  PASSED  ] 20 tests.
[  FAILED  ] 1 test, listed below:
[  FAILED  ] Parameters/TestRpc.TestCallWithChainCertAndChainCA/SSL_UnixSocket, where GetParam() = (true, true)

 1 FAILED TEST