Diagnosed failure

Parameters/TestRpc.TestCallWithChainCertAndChainCA/SSL_TCP: /data0/somelongdirectorytoavoidrpathissues/src/kudu/src/kudu/rpc/rpc-test.cc:270: Failure
Failed
Bad status: Runtime error: could not verify certificate chain (error with cert: subject=CN = localhost, ST = sadfjas, C = AS, emailAddress = sdflkdsajf, O = lskdfjlsad, OU = sldfkja, issuer=C = AS, ST = ASDfkjdhf, L = lskdjf, O = saldfja, OU = skdjf, CN = localhost, emailAddress = sadjflkadsj): : certificate has expired
Google Test trace:
/data0/somelongdirectorytoavoidrpathissues/src/kudu/src/kudu/rpc/rpc-test.cc:267: Connecting to 0.0.0.0:44161
I20260928 22:44:38.501349   383 test_util.cc:175] -----------------------------------------------
I20260928 22:44:38.501534   383 test_util.cc:176] Had fatal failures, leaving test files at /tmp/dist-test-task7VoBBc/test-tmp/rpc-test.5.Parameters_TestRpc.TestCallWithChainCertAndChainCA_SSL_TCP.1790635478448618-383-0

Full log

Note: This is test shard 6 of 8.
[==========] Running 21 tests from 2 test suites.
[----------] Global test environment set-up.
[----------] 20 tests from Parameters/TestRpc
[ RUN      ] Parameters/TestRpc.TestMessengerCreateDestroy/SSL_TCP
WARNING: Logging before InitGoogleLogging() is written to STDERR
I20260928 22:44:38.465263   383 rpc-test.cc:169] started messenger TestCreateDestroy
[       OK ] Parameters/TestRpc.TestMessengerCreateDestroy/SSL_TCP (14 ms)
[ RUN      ] Parameters/TestRpc.TestNegotiationDeadlock/SSL_TCP
I20260928 22:44:38.476701   404 acceptor_pool.cc:254] collecting diagnostics on the listening RPC socket 0.0.0.0:37845 every 8 connection(s)
I20260928 22:44:38.476701   403 acceptor_pool.cc:254] collecting diagnostics on the listening RPC socket 0.0.0.0:37845 every 8 connection(s)
[       OK ] Parameters/TestRpc.TestNegotiationDeadlock/SSL_TCP (19 ms)
[ RUN      ] Parameters/TestRpc.TestCallWithChainCertAndChainCA/SSL_TCP
I20260928 22:44:38.495990   420 acceptor_pool.cc:254] collecting diagnostics on the listening RPC socket 0.0.0.0:44161 every 8 connection(s)
I20260928 22:44:38.495990   419 acceptor_pool.cc:254] collecting diagnostics on the listening RPC socket 0.0.0.0:44161 every 8 connection(s)
/data0/somelongdirectorytoavoidrpathissues/src/kudu/src/kudu/rpc/rpc-test.cc:270: Failure
Failed
Bad status: Runtime error: could not verify certificate chain (error with cert: subject=CN = localhost, ST = sadfjas, C = AS, emailAddress = sdflkdsajf, O = lskdfjlsad, OU = sldfkja, issuer=C = AS, ST = ASDfkjdhf, L = lskdjf, O = saldfja, OU = skdjf, CN = localhost, emailAddress = sadjflkadsj): : certificate has expired
Google Test trace:
/data0/somelongdirectorytoavoidrpathissues/src/kudu/src/kudu/rpc/rpc-test.cc:267: Connecting to 0.0.0.0:44161
I20260928 22:44:38.501349   383 test_util.cc:175] -----------------------------------------------
I20260928 22:44:38.501534   383 test_util.cc:176] Had fatal failures, leaving test files at /tmp/dist-test-task7VoBBc/test-tmp/rpc-test.5.Parameters_TestRpc.TestCallWithChainCertAndChainCA_SSL_TCP.1790635478448618-383-0
[  FAILED  ] Parameters/TestRpc.TestCallWithChainCertAndChainCA/SSL_TCP, where GetParam() = (true, false) (15 ms)
[ RUN      ] Parameters/TestRpc.TestCallWithPasswordProtectedKey/SSL_TCP
I20260928 22:44:38.511404   445 acceptor_pool.cc:254] collecting diagnostics on the listening RPC socket 0.0.0.0:35909 every 8 connection(s)
I20260928 22:44:38.511396   444 acceptor_pool.cc:254] collecting diagnostics on the listening RPC socket 0.0.0.0:35909 every 8 connection(s)
[       OK ] Parameters/TestRpc.TestCallWithPasswordProtectedKey/SSL_TCP (25 ms)
[ RUN      ] Parameters/TestRpc.TestCallToBadServer/SSL_TCP
I20260928 22:44:38.553826   383 rpc-test.cc:394] Status: Network error: Client connection negotiation failed: client connection to 0.0.0.0:0: connect: Connection refused (error 111)
I20260928 22:44:38.554288   383 rpc-test.cc:394] Status: Network error: Client connection negotiation failed: client connection to 0.0.0.0:0: connect: Connection refused (error 111)
I20260928 22:44:38.554577   383 rpc-test.cc:394] Status: Network error: Client connection negotiation failed: client connection to 0.0.0.0:0: connect: Connection refused (error 111)
I20260928 22:44:38.554885   383 rpc-test.cc:394] Status: Network error: Client connection negotiation failed: client connection to 0.0.0.0:0: connect: Connection refused (error 111)
I20260928 22:44:38.555352   383 rpc-test.cc:394] Status: Network error: Client connection negotiation failed: client connection to 0.0.0.0:0: connect: Connection refused (error 111)
[       OK ] Parameters/TestRpc.TestCallToBadServer/SSL_TCP (29 ms)
[ RUN      ] Parameters/TestRpc.TestWrongService/SSL_TCP
I20260928 22:44:38.565325   479 acceptor_pool.cc:254] collecting diagnostics on the listening RPC socket 0.0.0.0:35865 every 8 connection(s)
I20260928 22:44:38.565377   480 acceptor_pool.cc:254] collecting diagnostics on the listening RPC socket 0.0.0.0:35865 every 8 connection(s)
I20260928 22:44:38.582438   476 messenger.cc:345] service WrongServiceName not registered on TestServer
[       OK ] Parameters/TestRpc.TestWrongService/SSL_TCP (28 ms)
[ RUN      ] Parameters/TestRpc.TestConnectionKeepalive/SSL_TCP
I20260928 22:44:38.589833   502 acceptor_pool.cc:254] collecting diagnostics on the listening RPC socket 0.0.0.0:44753 every 8 connection(s)
I20260928 22:44:38.589900   503 acceptor_pool.cc:254] collecting diagnostics on the listening RPC socket 0.0.0.0:44753 every 8 connection(s)
I20260928 22:44:38.590073   383 rpc-test.cc:488] Connecting to 0.0.0.0:44753
[       OK ] Parameters/TestRpc.TestConnectionKeepalive/SSL_TCP (1039 ms)
[ RUN      ] Parameters/TestRpc.TestClientConnectionMetrics/SSL_TCP
I20260928 22:44:39.635205   527 acceptor_pool.cc:254] collecting diagnostics on the listening RPC socket 0.0.0.0:35495 every 8 connection(s)
I20260928 22:44:39.635372   528 acceptor_pool.cc:254] collecting diagnostics on the listening RPC socket 0.0.0.0:35495 every 8 connection(s)
I20260928 22:44:39.635478   383 rpc-test.cc:569] Connecting to 0.0.0.0:35495
[       OK ] Parameters/TestRpc.TestClientConnectionMetrics/SSL_TCP (13628 ms)
[ RUN      ] Parameters/TestRpc.TestCredentialsPolicy/SSL_TCP
I20260928 22:44:53.284072   550 acceptor_pool.cc:254] collecting diagnostics on the listening RPC socket 0.0.0.0:45269 every 8 connection(s)
I20260928 22:44:53.284106   551 acceptor_pool.cc:254] collecting diagnostics on the listening RPC socket 0.0.0.0:45269 every 8 connection(s)
I20260928 22:44:53.284262   383 rpc-test.cc:700] Connecting to 0.0.0.0:45269
[       OK ] Parameters/TestRpc.TestCredentialsPolicy/SSL_TCP (63 ms)
[ RUN      ] Parameters/TestRpc.TestCallLongerThanKeepalive/SSL_TCP
I20260928 22:44:53.325367   575 acceptor_pool.cc:254] collecting diagnostics on the listening RPC socket 0.0.0.0:42267 every 8 connection(s)
I20260928 22:44:53.325415   576 acceptor_pool.cc:254] collecting diagnostics on the listening RPC socket 0.0.0.0:42267 every 8 connection(s)
I20260928 22:44:53.340145   579 rpc-test-base.h:222] got call: sleep_micros: 3000000 deferred: true
I20260928 22:44:56.340934   579 rpcz_store.cc:275] Call kudu.rpc.GenericCalculatorService.Sleep from 127.0.0.1:56506 (request call id 0) took 3000 ms. Trace:
I20260928 22:44:56.341064   579 rpcz_store.cc:276] 0928 22:44:53.340072 (+     0us) service_pool.cc:170] Inserting onto call queue
0928 22:44:53.340122 (+    50us) service_pool.cc:227] Handling call
0928 22:44:56.340913 (+3000791us) inbound_call.cc:173] Queueing success response
Metrics: {}
[       OK ] Parameters/TestRpc.TestCallLongerThanKeepalive/SSL_TCP (3027 ms)
[ RUN      ] Parameters/TestRpc.TestRpcSidecar/SSL_TCP
I20260928 22:44:56.358774   600 acceptor_pool.cc:254] collecting diagnostics on the listening RPC socket 0.0.0.0:36327 every 8 connection(s)
I20260928 22:44:56.358817   601 acceptor_pool.cc:254] collecting diagnostics on the listening RPC socket 0.0.0.0:36327 every 8 connection(s)
[       OK ] Parameters/TestRpc.TestRpcSidecar/SSL_TCP (64 ms)
[ RUN      ] Parameters/TestRpc.TestRpcSidecarLimits/SSL_TCP
I20260928 22:44:58.165853   626 acceptor_pool.cc:254] collecting diagnostics on the listening RPC socket 0.0.0.0:38173 every 8 connection(s)
I20260928 22:44:58.165855   625 acceptor_pool.cc:254] collecting diagnostics on the listening RPC socket 0.0.0.0:38173 every 8 connection(s)
W20260928 22:44:58.188558   383 serialization.cc:72] Serialized kudu.rpc_test.PushStringsRequestPB (2147483654 bytes) is larger than the maximum configured RPC message size (52428800 bytes). Sending anyway, but peer may reject the data.
W20260928 22:44:58.192358   624 connection.cc:535] server connection from 127.0.0.1:57664 recv error: Network error: RPC frame had a length of 2147483714, but we only support messages up to 52428800 bytes long.
W20260928 22:44:58.192492   624 connection.cc:158] shutting down server connection from 127.0.0.1:57664 with pending inbound data: 4/2147483714 bytes received; last active 0 ns ago: status Network error: RPC frame had a length of 2147483714, but we only support messages up to 52428800 bytes long.
W20260928 22:44:58.192763   638 connection.cc:196] Error closing socket: Network error: TlsSocket::Close: Connection reset by peer
I20260928 22:44:58.230728   650 acceptor_pool.cc:254] collecting diagnostics on the listening RPC socket 0.0.0.0:40599 every 8 connection(s)
I20260928 22:44:58.230785   651 acceptor_pool.cc:254] collecting diagnostics on the listening RPC socket 0.0.0.0:40599 every 8 connection(s)
W20260928 22:45:02.105726   648 connection.cc:577] server connection from 127.0.0.1:46448: received bad data: 'Corruption: Invalid packet: message had a length of 2147483710, but we only support messages up to 2147483647 bytes
'
[       OK ] Parameters/TestRpc.TestRpcSidecarLimits/SSL_TCP (5699 ms)
[ RUN      ] Parameters/TestRpc.TestCallTimeoutDoesntAffectNegotiation/SSL_TCP
I20260928 22:45:02.126391   675 acceptor_pool.cc:254] collecting diagnostics on the listening RPC socket 0.0.0.0:45615 every 8 connection(s)
I20260928 22:45:02.126403   676 acceptor_pool.cc:254] collecting diagnostics on the listening RPC socket 0.0.0.0:45615 every 8 connection(s)
W20260928 22:45:02.158063   669 negotiation.cc:266] Injecting 500ms delay in negotiation
I20260928 22:45:02.208451   383 rpc-test-base.h:595] status: Timed out: connection negotiation to 0.0.0.0:45615 for RPC Sleep timed out after 0.050s (ON_OUTBOUND_QUEUE), seconds elapsed: 0.0510846
[       OK ] Parameters/TestRpc.TestCallTimeoutDoesntAffectNegotiation/SSL_TCP (555 ms)
[ RUN      ] Parameters/TestRpc.TestRpcHandlerLatencyMetric/SSL_TCP
I20260928 22:45:02.706322   701 acceptor_pool.cc:254] collecting diagnostics on the listening RPC socket 0.0.0.0:46305 every 8 connection(s)
I20260928 22:45:02.706375   700 acceptor_pool.cc:254] collecting diagnostics on the listening RPC socket 0.0.0.0:46305 every 8 connection(s)
I20260928 22:45:02.753093   383 rpc-test.cc:1236] Sleep() min lat: 20426
I20260928 22:45:02.753206   383 rpc-test.cc:1237] Sleep() mean lat: 20426
I20260928 22:45:02.753238   383 rpc-test.cc:1238] Sleep() max lat: 20426
I20260928 22:45:02.753254   383 rpc-test.cc:1239] Sleep() #calls: 1
[       OK ] Parameters/TestRpc.TestRpcHandlerLatencyMetric/SSL_TCP (91 ms)
[ RUN      ] Parameters/TestRpc.TimedOutOnResponseMetricServiceQueue/SSL_TCP
I20260928 22:45:02.762068   727 acceptor_pool.cc:254] collecting diagnostics on the listening RPC socket 0.0.0.0:45721 every 8 connection(s)
I20260928 22:45:02.762230   726 acceptor_pool.cc:254] collecting diagnostics on the listening RPC socket 0.0.0.0:45721 every 8 connection(s)
W20260928 22:45:02.819260   728 rpcz_store.cc:267] Call kudu.rpc_test.CalculatorService.Sleep from 127.0.0.1:54614 (request call id 2) took 20 ms (client timeout 20 ms). Trace:
W20260928 22:45:02.819391   728 rpcz_store.cc:269] 0928 22:45:02.798850 (+     0us) service_pool.cc:170] Inserting onto call queue
0928 22:45:02.819229 (+ 20379us) service_pool.cc:214] Skipping call since client already timed out
0928 22:45:02.819243 (+    14us) inbound_call.cc:173] Queueing failure response
Metrics: {}
[       OK ] Parameters/TestRpc.TimedOutOnResponseMetricServiceQueue/SSL_TCP (65 ms)
[ RUN      ] Parameters/TestRpc.RpcPendingConnectionsMetric/SSL_TCP
I20260928 22:45:02.823256   749 acceptor_pool.cc:254] collecting diagnostics on the listening RPC socket 0.0.0.0:34301 every 8 connection(s)
I20260928 22:45:02.823274   750 acceptor_pool.cc:254] collecting diagnostics on the listening RPC socket 0.0.0.0:34301 every 8 connection(s)
W20260928 22:45:02.832672   745 negotiation.cc:337] Failed RPC negotiation. Trace:
0928 22:45:02.832260 (+     0us) reactor.cc:625] Submitting negotiation task for server connection from 127.0.0.1:41660 (local address 127.0.0.1:34301)
0928 22:45:02.832373 (+   113us) server_negotiation.cc:206] Beginning negotiation
0928 22:45:02.832376 (+     3us) server_negotiation.cc:399] Waiting for connection header
0928 22:45:02.832529 (+   153us) negotiation.cc:327] Negotiation complete: Network error: Server connection negotiation failed: server connection from 127.0.0.1:41660: BlockingRecv error: recv got EOF from 127.0.0.1:41660 (error 108)
Metrics: {"server-negotiator.queue_time_us":39}
[       OK ] Parameters/TestRpc.RpcPendingConnectionsMetric/SSL_TCP (22 ms)
[ RUN      ] Parameters/TestRpc.TestRpcContextClientDeadline/SSL_TCP
I20260928 22:45:02.865628   765 acceptor_pool.cc:254] collecting diagnostics on the listening RPC socket 0.0.0.0:35641 every 8 connection(s)
I20260928 22:45:02.865684   766 acceptor_pool.cc:254] collecting diagnostics on the listening RPC socket 0.0.0.0:35641 every 8 connection(s)
[       OK ] Parameters/TestRpc.TestRpcContextClientDeadline/SSL_TCP (60 ms)
[ RUN      ] Parameters/TestRpc.TestApplicationFeatureFlagUnsupportedServer/SSL_TCP
I20260928 22:45:02.911221   790 acceptor_pool.cc:254] collecting diagnostics on the listening RPC socket 0.0.0.0:33801 every 8 connection(s)
I20260928 22:45:02.911243   791 acceptor_pool.cc:254] collecting diagnostics on the listening RPC socket 0.0.0.0:33801 every 8 connection(s)
[       OK ] Parameters/TestRpc.TestApplicationFeatureFlagUnsupportedServer/SSL_TCP (33 ms)
[ RUN      ] Parameters/TestRpc.TestCancellationAsync/SSL_TCP
I20260928 22:45:02.961649   815 acceptor_pool.cc:254] collecting diagnostics on the listening RPC socket 0.0.0.0:44767 every 8 connection(s)
I20260928 22:45:02.961697   816 acceptor_pool.cc:254] collecting diagnostics on the listening RPC socket 0.0.0.0:44767 every 8 connection(s)
I20260928 22:45:02.961905   383 rpc-test.cc:1716] Connecting to 0.0.0.0:44767
I20260928 22:45:02.977711   383 test_util.cc:268] Using random seed: -787234132
I20260928 22:45:03.002869   819 rpc-test-base.h:240] got call: sleep_micros: 500 pattern: 4294967295 num_repetitions: 2097152 sidecar_idx: 0
I20260928 22:45:03.020018   819 rpc-test-base.h:240] got call: sleep_micros: 500 pattern: 4294967295 num_repetitions: 2097152 sidecar_idx: 0
I20260928 22:45:03.037930   819 rpc-test-base.h:240] got call: sleep_micros: 500 pattern: 4294967295 num_repetitions: 2097152 sidecar_idx: 0
I20260928 22:45:03.058804   819 rpc-test-base.h:240] got call: sleep_micros: 500 pattern: 4294967295 num_repetitions: 2097152 sidecar_idx: 0
I20260928 22:45:03.078298   819 rpc-test-base.h:240] got call: sleep_micros: 500 pattern: 4294967295 num_repetitions: 2097152 sidecar_idx: 0
I20260928 22:45:03.095875   819 rpc-test-base.h:240] got call: sleep_micros: 500 pattern: 4294967295 num_repetitions: 2097152 sidecar_idx: 0
I20260928 22:45:03.113893   819 rpc-test-base.h:240] got call: sleep_micros: 500 pattern: 4294967295 num_repetitions: 2097152 sidecar_idx: 0
I20260928 22:45:03.132251   819 rpc-test-base.h:240] got call: sleep_micros: 500 pattern: 4294967295 num_repetitions: 2097152 sidecar_idx: 0
W20260928 22:45:03.136786   813 connection.cc:441] server connection from 127.0.0.1:42082 torn down before Call kudu.rpc.GenericCalculatorService.SleepWithSidecar from 127.0.0.1:42082 (request call id 9) could send its response
[       OK ] Parameters/TestRpc.TestCancellationAsync/SSL_TCP (199 ms)
[ RUN      ] Parameters/TestRpc.TestPerformanceBySocketType/SSL_TCP
I20260928 22:45:03.153123   840 acceptor_pool.cc:254] collecting diagnostics on the listening RPC socket 0.0.0.0:42651 every 8 connection(s)
I20260928 22:45:03.153304   383 rpc-test.cc:1846] Connecting to 0.0.0.0:42651
I20260928 22:45:03.153124   841 acceptor_pool.cc:254] collecting diagnostics on the listening RPC socket 0.0.0.0:42651 every 8 connection(s)
I20260928 22:45:05.322188   383 rpc-test.cc:1859] Sending 1024MB via ssl-enabled tcp socket: real 2.146s	user 1.800s	sys 1.979s
I20260928 22:45:07.415915   383 rpc-test.cc:1859] Sending 1024MB via ssl-enabled tcp socket: real 2.094s	user 1.583s	sys 2.141s
I20260928 22:45:09.511432   383 rpc-test.cc:1859] Sending 1024MB via ssl-enabled tcp socket: real 2.095s	user 1.603s	sys 2.115s
I20260928 22:45:11.683156   383 rpc-test.cc:1859] Sending 1024MB via ssl-enabled tcp socket: real 2.172s	user 1.738s	sys 2.111s
I20260928 22:45:13.580108   383 rpc-test.cc:1859] Sending 1024MB via ssl-enabled tcp socket: real 1.897s	user 1.689s	sys 1.735s
[       OK ] Parameters/TestRpc.TestPerformanceBySocketType/SSL_TCP (10445 ms)
[----------] 20 tests from Parameters/TestRpc (35132 ms total)

[----------] 1 test from Parameters/TestRpcSocketTxRxQueue
[ RUN      ] Parameters/TestRpcSocketTxRxQueue.OverCapacity/0
W20260928 22:45:13.860762   884 negotiation.cc:337] Failed RPC negotiation. Trace:
0928 22:45:13.596350 (+     0us) reactor.cc:625] Submitting negotiation task for client connection to 0.0.0.0:35719 (local address 127.0.0.1:46426)
0928 22:45:13.596428 (+    78us) negotiation.cc:107] Waiting for socket to connect
0928 22:45:13.596439 (+    11us) client_negotiation.cc:174] Beginning negotiation
0928 22:45:13.596493 (+    54us) client_negotiation.cc:252] Sending NEGOTIATE NegotiatePB request
0928 22:45:13.860713 (+264220us) negotiation.cc:327] Negotiation complete: Network error: Client connection negotiation failed: client connection to 0.0.0.0:35719: BlockingRecv error: recv error from unknown peer: Transport endpoint is not connected (error 107)
Metrics: {"client-negotiator.queue_time_us":43}
W20260928 22:45:13.860651   893 negotiation.cc:337] Failed RPC negotiation. Trace:
0928 22:45:13.597347 (+     0us) reactor.cc:625] Submitting negotiation task for client connection to 0.0.0.0:35719 (local address 127.0.0.1:46440)
0928 22:45:13.597412 (+    65us) negotiation.cc:107] Waiting for socket to connect
0928 22:45:13.597421 (+     9us) client_negotiation.cc:174] Beginning negotiation
0928 22:45:13.597474 (+    53us) client_negotiation.cc:252] Sending NEGOTIATE NegotiatePB request
0928 22:45:13.860574 (+263100us) negotiation.cc:327] Negotiation complete: Network error: Client connection negotiation failed: client connection to 0.0.0.0:35719: BlockingRecv error: recv error from unknown peer: Transport endpoint is not connected (error 107)
Metrics: {"client-negotiator.queue_time_us":41}
W20260928 22:45:13.860970   902 negotiation.cc:337] Failed RPC negotiation. Trace:
0928 22:45:13.598501 (+     0us) reactor.cc:625] Submitting negotiation task for client connection to 0.0.0.0:35719 (local address 127.0.0.1:46442)
0928 22:45:13.598590 (+    89us) negotiation.cc:107] Waiting for socket to connect
0928 22:45:13.598603 (+    13us) client_negotiation.cc:174] Beginning negotiation
0928 22:45:13.598667 (+    64us) client_negotiation.cc:252] Sending NEGOTIATE NegotiatePB request
0928 22:45:13.860878 (+262211us) negotiation.cc:327] Negotiation complete: Network error: Client connection negotiation failed: client connection to 0.0.0.0:35719: BlockingRecv error: recv error from unknown peer: Transport endpoint is not connected (error 107)
Metrics: {"client-negotiator.queue_time_us":49}
W20260928 22:45:13.860651   857 negotiation.cc:337] Failed RPC negotiation. Trace:
0928 22:45:13.592958 (+     0us) reactor.cc:625] Submitting negotiation task for client connection to 0.0.0.0:35719 (local address 127.0.0.1:46396)
0928 22:45:13.593038 (+    80us) negotiation.cc:107] Waiting for socket to connect
0928 22:45:13.593050 (+    12us) client_negotiation.cc:174] Beginning negotiation
0928 22:45:13.593133 (+    83us) client_negotiation.cc:252] Sending NEGOTIATE NegotiatePB request
0928 22:45:13.860504 (+267371us) negotiation.cc:327] Negotiation complete: Network error: Client connection negotiation failed: client connection to 0.0.0.0:35719: BlockingRecv error: recv error from unknown peer: Transport endpoint is not connected (error 107)
Metrics: {"client-negotiator.queue_time_us":37}
W20260928 22:45:13.861123   872 negotiation.cc:337] Failed RPC negotiation. Trace:
0928 22:45:13.595302 (+     0us) reactor.cc:625] Submitting negotiation task for client connection to 0.0.0.0:35719 (local address 127.0.0.1:46414)
0928 22:45:13.595366 (+    64us) negotiation.cc:107] Waiting for socket to connect
0928 22:45:13.595376 (+    10us) client_negotiation.cc:174] Beginning negotiation
0928 22:45:13.595435 (+    59us) client_negotiation.cc:252] Sending NEGOTIATE NegotiatePB request
0928 22:45:13.860681 (+265246us) negotiation.cc:327] Negotiation complete: Network error: Client connection negotiation failed: client connection to 0.0.0.0:35719: BlockingRecv error: recv error from unknown peer: Transport endpoint is not connected (error 107)
Metrics: {"client-negotiator.queue_time_us":38}
W20260928 22:45:13.861310   866 negotiation.cc:337] Failed RPC negotiation. Trace:
0928 22:45:13.594104 (+     0us) reactor.cc:625] Submitting negotiation task for client connection to 0.0.0.0:35719 (local address 127.0.0.1:46398)
0928 22:45:13.594158 (+    54us) negotiation.cc:107] Waiting for socket to connect
0928 22:45:13.594169 (+    11us) client_negotiation.cc:174] Beginning negotiation
0928 22:45:13.594228 (+    59us) client_negotiation.cc:252] Sending NEGOTIATE NegotiatePB request
0928 22:45:13.860681 (+266453us) negotiation.cc:327] Negotiation complete: Network error: Client connection negotiation failed: client connection to 0.0.0.0:35719: BlockingRecv error: recv error from unknown peer: Transport endpoint is not connected (error 107)
Metrics: {"client-negotiator.queue_time_us":26}
[       OK ] Parameters/TestRpcSocketTxRxQueue.OverCapacity/0 (1043 ms)
[----------] 1 test from Parameters/TestRpcSocketTxRxQueue (1043 ms total)

[----------] Global test environment tear-down
[==========] 21 tests from 2 test suites ran. (36175 ms total)
[  PASSED  ] 20 tests.
[  FAILED  ] 1 test, listed below:
[  FAILED  ] Parameters/TestRpc.TestCallWithChainCertAndChainCA/SSL_TCP, where GetParam() = (true, false)

 1 FAILED TEST