Diagnosed failure
Parameters/TestRpc.TestCallWithChainCertAndChainCA/SSL_UnixSocket: /data0/somelongdirectorytoavoidrpathissues/src/kudu/src/kudu/rpc/rpc-test.cc:270: Failure
Failed
Bad status: Runtime error: could not verify certificate chain (error with cert: subject=CN = localhost, ST = sadfjas, C = AS, emailAddress = sdflkdsajf, O = lskdfjlsad, OU = sldfkja, issuer=C = AS, ST = ASDfkjdhf, L = lskdjf, O = saldfja, OU = skdjf, CN = localhost, emailAddress = sadjflkadsj): : certificate has expired
Google Test trace:
/data0/somelongdirectorytoavoidrpathissues/src/kudu/src/kudu/rpc/rpc-test.cc:267: Connecting to unix:/tmp/dist-test-task0qfb0V/test-tmp/rpc-test-1af98261adb44b77a761bdb16465fafc.sock
I20260928 14:51:50.908635 26693 test_util.cc:175] -----------------------------------------------
I20260928 14:51:50.908756 26693 test_util.cc:176] Had fatal failures, leaving test files at /tmp/dist-test-task0qfb0V/test-tmp/rpc-test.6.Parameters_TestRpc.TestCallWithChainCertAndChainCA_SSL_UnixSocket.1790607110771238-26693-0
Full log
Note: This is test shard 7 of 8.
[==========] Running 21 tests from 2 test suites.
[----------] Global test environment set-up.
[----------] 20 tests from Parameters/TestRpc
[ RUN ] Parameters/TestRpc.TestMessengerCreateDestroy/SSL_UnixSocket
WARNING: Logging before InitGoogleLogging() is written to STDERR
I20260928 14:51:50.822009 26693 rpc-test.cc:169] started messenger TestCreateDestroy
[ OK ] Parameters/TestRpc.TestMessengerCreateDestroy/SSL_UnixSocket (33 ms)
[ RUN ] Parameters/TestRpc.TestNegotiationDeadlock/SSL_UnixSocket
I20260928 14:51:50.846489 26713 acceptor_pool.cc:254] collecting diagnostics on the listening RPC socket unix:/tmp/dist-test-task0qfb0V/test-tmp/rpc-test-25797126db0049b3a0abd18d9e4269a3.sock every 8 connection(s)
I20260928 14:51:50.846778 26714 acceptor_pool.cc:254] collecting diagnostics on the listening RPC socket unix:/tmp/dist-test-task0qfb0V/test-tmp/rpc-test-25797126db0049b3a0abd18d9e4269a3.sock every 8 connection(s)
[ OK ] Parameters/TestRpc.TestNegotiationDeadlock/SSL_UnixSocket (45 ms)
[ RUN ] Parameters/TestRpc.TestCallWithChainCertAndChainCA/SSL_UnixSocket
I20260928 14:51:50.893702 26729 acceptor_pool.cc:254] collecting diagnostics on the listening RPC socket unix:/tmp/dist-test-task0qfb0V/test-tmp/rpc-test-1af98261adb44b77a761bdb16465fafc.sock every 8 connection(s)
I20260928 14:51:50.894060 26730 acceptor_pool.cc:254] collecting diagnostics on the listening RPC socket unix:/tmp/dist-test-task0qfb0V/test-tmp/rpc-test-1af98261adb44b77a761bdb16465fafc.sock every 8 connection(s)
/data0/somelongdirectorytoavoidrpathissues/src/kudu/src/kudu/rpc/rpc-test.cc:270: Failure
Failed
Bad status: Runtime error: could not verify certificate chain (error with cert: subject=CN = localhost, ST = sadfjas, C = AS, emailAddress = sdflkdsajf, O = lskdfjlsad, OU = sldfkja, issuer=C = AS, ST = ASDfkjdhf, L = lskdjf, O = saldfja, OU = skdjf, CN = localhost, emailAddress = sadjflkadsj): : certificate has expired
Google Test trace:
/data0/somelongdirectorytoavoidrpathissues/src/kudu/src/kudu/rpc/rpc-test.cc:267: Connecting to unix:/tmp/dist-test-task0qfb0V/test-tmp/rpc-test-1af98261adb44b77a761bdb16465fafc.sock
I20260928 14:51:50.908635 26693 test_util.cc:175] -----------------------------------------------
I20260928 14:51:50.908756 26693 test_util.cc:176] Had fatal failures, leaving test files at /tmp/dist-test-task0qfb0V/test-tmp/rpc-test.6.Parameters_TestRpc.TestCallWithChainCertAndChainCA_SSL_UnixSocket.1790607110771238-26693-0
[ FAILED ] Parameters/TestRpc.TestCallWithChainCertAndChainCA/SSL_UnixSocket, where GetParam() = (true, true) (36 ms)
[ RUN ] Parameters/TestRpc.TestCallWithPasswordProtectedKey/SSL_UnixSocket
I20260928 14:51:50.931979 26754 acceptor_pool.cc:254] collecting diagnostics on the listening RPC socket unix:/tmp/dist-test-task0qfb0V/test-tmp/rpc-test-5dbfe7fa07c4455c92305a544d81cf2d.sock every 8 connection(s)
I20260928 14:51:50.932150 26755 acceptor_pool.cc:254] collecting diagnostics on the listening RPC socket unix:/tmp/dist-test-task0qfb0V/test-tmp/rpc-test-5dbfe7fa07c4455c92305a544d81cf2d.sock every 8 connection(s)
W20260928 14:51:50.975762 26751 connection.cc:196] Error closing socket: Network error: TlsSocket::Close: Broken pipe
[ OK ] Parameters/TestRpc.TestCallWithPasswordProtectedKey/SSL_UnixSocket (71 ms)
[ RUN ] Parameters/TestRpc.TestCallToBadServer/SSL_UnixSocket
I20260928 14:51:51.000109 26693 rpc-test.cc:394] Status: Network error: Client connection negotiation failed: client connection to 0.0.0.0:0: connect: Connection refused (error 111)
I20260928 14:51:51.001181 26693 rpc-test.cc:394] Status: Network error: Client connection negotiation failed: client connection to 0.0.0.0:0: connect: Connection refused (error 111)
I20260928 14:51:51.002177 26693 rpc-test.cc:394] Status: Network error: Client connection negotiation failed: client connection to 0.0.0.0:0: connect: Connection refused (error 111)
I20260928 14:51:51.003183 26693 rpc-test.cc:394] Status: Network error: Client connection negotiation failed: client connection to 0.0.0.0:0: connect: Connection refused (error 111)
I20260928 14:51:51.004158 26693 rpc-test.cc:394] Status: Network error: Client connection negotiation failed: client connection to 0.0.0.0:0: connect: Connection refused (error 111)
[ OK ] Parameters/TestRpc.TestCallToBadServer/SSL_UnixSocket (26 ms)
[ RUN ] Parameters/TestRpc.TestWrongService/SSL_UnixSocket
I20260928 14:51:51.022799 26789 acceptor_pool.cc:254] collecting diagnostics on the listening RPC socket unix:/tmp/dist-test-task0qfb0V/test-tmp/rpc-test-2d1eee46321747719696d394e14ac2a7.sock every 8 connection(s)
I20260928 14:51:51.023089 26790 acceptor_pool.cc:254] collecting diagnostics on the listening RPC socket unix:/tmp/dist-test-task0qfb0V/test-tmp/rpc-test-2d1eee46321747719696d394e14ac2a7.sock every 8 connection(s)
I20260928 14:51:51.072444 26786 messenger.cc:345] service WrongServiceName not registered on TestServer
[ OK ] Parameters/TestRpc.TestWrongService/SSL_UnixSocket (71 ms)
[ RUN ] Parameters/TestRpc.TestConnectionKeepalive/SSL_UnixSocket
I20260928 14:51:51.105031 26812 acceptor_pool.cc:254] collecting diagnostics on the listening RPC socket unix:/tmp/dist-test-task0qfb0V/test-tmp/rpc-test-a61fb8d333c7493a910bfb252e24c14c.sock every 8 connection(s)
I20260928 14:51:51.105356 26813 acceptor_pool.cc:254] collecting diagnostics on the listening RPC socket unix:/tmp/dist-test-task0qfb0V/test-tmp/rpc-test-a61fb8d333c7493a910bfb252e24c14c.sock every 8 connection(s)
I20260928 14:51:51.106534 26693 rpc-test.cc:488] Connecting to unix:/tmp/dist-test-task0qfb0V/test-tmp/rpc-test-a61fb8d333c7493a910bfb252e24c14c.sock
W20260928 14:51:51.582880 26825 connection.cc:196] Error closing socket: Network error: TlsSocket::Close: Broken pipe
[ OK ] Parameters/TestRpc.TestConnectionKeepalive/SSL_UnixSocket (1071 ms)
[ RUN ] Parameters/TestRpc.TestClientConnectionMetrics/SSL_UnixSocket
I20260928 14:51:52.172905 26837 acceptor_pool.cc:254] collecting diagnostics on the listening RPC socket unix:/tmp/dist-test-task0qfb0V/test-tmp/rpc-test-6464e1d4a7c5476f829997f071fcacaf.sock every 8 connection(s)
I20260928 14:51:52.173292 26838 acceptor_pool.cc:254] collecting diagnostics on the listening RPC socket unix:/tmp/dist-test-task0qfb0V/test-tmp/rpc-test-6464e1d4a7c5476f829997f071fcacaf.sock every 8 connection(s)
I20260928 14:51:52.174325 26693 rpc-test.cc:569] Connecting to unix:/tmp/dist-test-task0qfb0V/test-tmp/rpc-test-6464e1d4a7c5476f829997f071fcacaf.sock
W20260928 14:52:14.903316 26834 connection.cc:196] Error closing socket: Network error: TlsSocket::Close: Broken pipe
[ OK ] Parameters/TestRpc.TestClientConnectionMetrics/SSL_UnixSocket (22759 ms)
[ RUN ] Parameters/TestRpc.TestCredentialsPolicy/SSL_UnixSocket
I20260928 14:52:14.948477 26860 acceptor_pool.cc:254] collecting diagnostics on the listening RPC socket unix:/tmp/dist-test-task0qfb0V/test-tmp/rpc-test-a7330fb4ea944249b887cf47c5458d40.sock every 8 connection(s)
I20260928 14:52:14.948763 26861 acceptor_pool.cc:254] collecting diagnostics on the listening RPC socket unix:/tmp/dist-test-task0qfb0V/test-tmp/rpc-test-a7330fb4ea944249b887cf47c5458d40.sock every 8 connection(s)
I20260928 14:52:14.949764 26693 rpc-test.cc:700] Connecting to unix:/tmp/dist-test-task0qfb0V/test-tmp/rpc-test-a7330fb4ea944249b887cf47c5458d40.sock
W20260928 14:52:14.972983 26859 connection.cc:196] Error closing socket: Network error: TlsSocket::Close: Broken pipe
[ OK ] Parameters/TestRpc.TestCredentialsPolicy/SSL_UnixSocket (74 ms)
[ RUN ] Parameters/TestRpc.TestCallLongerThanKeepalive/SSL_UnixSocket
I20260928 14:52:15.003641 26885 acceptor_pool.cc:254] collecting diagnostics on the listening RPC socket unix:/tmp/dist-test-task0qfb0V/test-tmp/rpc-test-c2284b98d68141d9a1e2b92c961d25c2.sock every 8 connection(s)
I20260928 14:52:15.003827 26886 acceptor_pool.cc:254] collecting diagnostics on the listening RPC socket unix:/tmp/dist-test-task0qfb0V/test-tmp/rpc-test-c2284b98d68141d9a1e2b92c961d25c2.sock every 8 connection(s)
I20260928 14:52:15.033674 26889 rpc-test-base.h:222] got call: sleep_micros: 3000000 deferred: true
I20260928 14:52:18.035553 26889 rpcz_store.cc:275] Call kudu.rpc.GenericCalculatorService.Sleep from unix:<unnamed> (request call id 0) took 3001 ms. Trace:
I20260928 14:52:18.035763 26889 rpcz_store.cc:276] 0928 14:52:15.033554 (+ 0us) service_pool.cc:170] Inserting onto call queue
0928 14:52:15.033621 (+ 67us) service_pool.cc:227] Handling call
0928 14:52:18.035432 (+3001811us) inbound_call.cc:173] Queueing success response
Metrics: {}
W20260928 14:52:18.037873 26882 connection.cc:196] Error closing socket: Network error: TlsSocket::Close: Broken pipe
[ OK ] Parameters/TestRpc.TestCallLongerThanKeepalive/SSL_UnixSocket (3057 ms)
[ RUN ] Parameters/TestRpc.TestRpcSidecar/SSL_UnixSocket
I20260928 14:52:18.073695 26910 acceptor_pool.cc:254] collecting diagnostics on the listening RPC socket unix:/tmp/dist-test-task0qfb0V/test-tmp/rpc-test-f660ec25f4194efcb6396003eff22f28.sock every 8 connection(s)
I20260928 14:52:18.073935 26911 acceptor_pool.cc:254] collecting diagnostics on the listening RPC socket unix:/tmp/dist-test-task0qfb0V/test-tmp/rpc-test-f660ec25f4194efcb6396003eff22f28.sock every 8 connection(s)
W20260928 14:52:18.182040 26907 connection.cc:196] Error closing socket: Network error: TlsSocket::Close: Broken pipe
[ OK ] Parameters/TestRpc.TestRpcSidecar/SSL_UnixSocket (143 ms)
[ RUN ] Parameters/TestRpc.TestRpcSidecarLimits/SSL_UnixSocket
I20260928 14:52:20.285552 26935 acceptor_pool.cc:254] collecting diagnostics on the listening RPC socket unix:/tmp/dist-test-task0qfb0V/test-tmp/rpc-test-e53a7912a84f45679513c5b04ed4578f.sock every 8 connection(s)
I20260928 14:52:20.285820 26936 acceptor_pool.cc:254] collecting diagnostics on the listening RPC socket unix:/tmp/dist-test-task0qfb0V/test-tmp/rpc-test-e53a7912a84f45679513c5b04ed4578f.sock every 8 connection(s)
W20260928 14:52:20.307873 26693 serialization.cc:72] Serialized kudu.rpc_test.PushStringsRequestPB (2147483654 bytes) is larger than the maximum configured RPC message size (52428800 bytes). Sending anyway, but peer may reject the data.
W20260928 14:52:20.314126 26932 connection.cc:535] server connection from unix:<unnamed> recv error: Network error: RPC frame had a length of 2147483714, but we only support messages up to 52428800 bytes long.
W20260928 14:52:20.314288 26932 connection.cc:158] shutting down server connection from unix:<unnamed> with pending inbound data: 4/2147483714 bytes received; last active 0 ns ago: status Network error: RPC frame had a length of 2147483714, but we only support messages up to 52428800 bytes long.
W20260928 14:52:20.314788 26948 connection.cc:196] Error closing socket: Network error: TlsSocket::Close: Broken pipe
I20260928 14:52:20.331971 26960 acceptor_pool.cc:254] collecting diagnostics on the listening RPC socket unix:/tmp/dist-test-task0qfb0V/test-tmp/rpc-test-e53a7912a84f45679513c5b04ed4578f.sock every 8 connection(s)
I20260928 14:52:20.332177 26961 acceptor_pool.cc:254] collecting diagnostics on the listening RPC socket unix:/tmp/dist-test-task0qfb0V/test-tmp/rpc-test-e53a7912a84f45679513c5b04ed4578f.sock every 8 connection(s)
W20260928 14:52:27.868376 26957 connection.cc:577] server connection from unix:<unnamed>: received bad data: 'Corruption: Invalid packet: message had a length of 2147483710, but we only support messages up to 2147483647 bytes
'
W20260928 14:52:27.869088 26973 connection.cc:196] Error closing socket: Network error: TlsSocket::Close: Broken pipe
[ OK ] Parameters/TestRpc.TestRpcSidecarLimits/SSL_UnixSocket (10188 ms)
[ RUN ] Parameters/TestRpc.TestCallTimeoutDoesntAffectNegotiation/SSL_UnixSocket
I20260928 14:52:28.385524 26985 acceptor_pool.cc:254] collecting diagnostics on the listening RPC socket unix:/tmp/dist-test-task0qfb0V/test-tmp/rpc-test-97b66f5310844f75b6f17e5b4b20c3ef.sock every 8 connection(s)
I20260928 14:52:28.385807 26986 acceptor_pool.cc:254] collecting diagnostics on the listening RPC socket unix:/tmp/dist-test-task0qfb0V/test-tmp/rpc-test-97b66f5310844f75b6f17e5b4b20c3ef.sock every 8 connection(s)
W20260928 14:52:28.405143 26981 negotiation.cc:266] Injecting 500ms delay in negotiation
I20260928 14:52:28.455559 26693 rpc-test-base.h:595] status: Timed out: connection negotiation to unix:/tmp/dist-test-task0qfb0V/test-tmp/rpc-test-97b66f5310844f75b6f17e5b4b20c3ef.sock for RPC Sleep timed out after 0.050s (ON_OUTBOUND_QUEUE), seconds elapsed: 0.0511876
W20260928 14:52:28.912170 26982 connection.cc:196] Error closing socket: Network error: TlsSocket::Close: Broken pipe
[ OK ] Parameters/TestRpc.TestCallTimeoutDoesntAffectNegotiation/SSL_UnixSocket (541 ms)
[ RUN ] Parameters/TestRpc.TestRpcHandlerLatencyMetric/SSL_UnixSocket
I20260928 14:52:28.929515 27010 acceptor_pool.cc:254] collecting diagnostics on the listening RPC socket unix:/tmp/dist-test-task0qfb0V/test-tmp/rpc-test-96460890ec984603a87c15dddb46f2d3.sock every 8 connection(s)
I20260928 14:52:28.929768 27011 acceptor_pool.cc:254] collecting diagnostics on the listening RPC socket unix:/tmp/dist-test-task0qfb0V/test-tmp/rpc-test-96460890ec984603a87c15dddb46f2d3.sock every 8 connection(s)
I20260928 14:52:28.979866 26693 rpc-test.cc:1236] Sleep() min lat: 20786
I20260928 14:52:28.980017 26693 rpc-test.cc:1237] Sleep() mean lat: 20786
I20260928 14:52:28.980077 26693 rpc-test.cc:1238] Sleep() max lat: 20786
I20260928 14:52:28.980106 26693 rpc-test.cc:1239] Sleep() #calls: 1
W20260928 14:52:28.981877 27007 connection.cc:196] Error closing socket: Network error: TlsSocket::Close: Broken pipe
[ OK ] Parameters/TestRpc.TestRpcHandlerLatencyMetric/SSL_UnixSocket (70 ms)
[ RUN ] Parameters/TestRpc.TimedOutOnResponseMetricServiceQueue/SSL_UnixSocket
I20260928 14:52:29.004521 27036 acceptor_pool.cc:254] collecting diagnostics on the listening RPC socket unix:/tmp/dist-test-task0qfb0V/test-tmp/rpc-test-00095c6e6f4641ab82b77449d88aae49.sock every 8 connection(s)
I20260928 14:52:29.004741 27037 acceptor_pool.cc:254] collecting diagnostics on the listening RPC socket unix:/tmp/dist-test-task0qfb0V/test-tmp/rpc-test-00095c6e6f4641ab82b77449d88aae49.sock every 8 connection(s)
W20260928 14:52:29.077903 27038 rpcz_store.cc:267] Call kudu.rpc_test.CalculatorService.Sleep from unix:<unnamed> (request call id 2) took 20 ms (client timeout 20 ms). Trace:
W20260928 14:52:29.078058 27038 rpcz_store.cc:269] 0928 14:52:29.057356 (+ 0us) service_pool.cc:170] Inserting onto call queue
0928 14:52:29.077765 (+ 20409us) service_pool.cc:214] Skipping call since client already timed out
0928 14:52:29.077822 (+ 57us) inbound_call.cc:173] Queueing failure response
Metrics: {}
W20260928 14:52:29.079319 27033 connection.cc:196] Error closing socket: Network error: TlsSocket::Close: Broken pipe
[ OK ] Parameters/TestRpc.TimedOutOnResponseMetricServiceQueue/SSL_UnixSocket (97 ms)
[ RUN ] Parameters/TestRpc.RpcPendingConnectionsMetric/SSL_UnixSocket
I20260928 14:52:29.087744 27059 acceptor_pool.cc:254] collecting diagnostics on the listening RPC socket 0.0.0.0:43135 every 8 connection(s)
I20260928 14:52:29.087988 27060 acceptor_pool.cc:254] collecting diagnostics on the listening RPC socket 0.0.0.0:43135 every 8 connection(s)
W20260928 14:52:29.090092 27055 negotiation.cc:337] Failed RPC negotiation. Trace:
0928 14:52:29.089449 (+ 0us) reactor.cc:625] Submitting negotiation task for server connection from 127.0.0.1:59122 (local address 127.0.0.1:43135)
0928 14:52:29.089614 (+ 165us) server_negotiation.cc:206] Beginning negotiation
0928 14:52:29.089618 (+ 4us) server_negotiation.cc:399] Waiting for connection header
0928 14:52:29.089754 (+ 136us) negotiation.cc:327] Negotiation complete: Network error: Server connection negotiation failed: server connection from 127.0.0.1:59122: BlockingRecv error: recv got EOF from 127.0.0.1:59122 (error 108)
Metrics: {"server-negotiator.queue_time_us":52}
[ OK ] Parameters/TestRpc.RpcPendingConnectionsMetric/SSL_UnixSocket (20 ms)
[ RUN ] Parameters/TestRpc.TestRpcContextClientDeadline/SSL_UnixSocket
I20260928 14:52:29.138733 27075 acceptor_pool.cc:254] collecting diagnostics on the listening RPC socket unix:/tmp/dist-test-task0qfb0V/test-tmp/rpc-test-501075adfc7d4fc497b9989789162ec1.sock every 8 connection(s)
I20260928 14:52:29.138954 27076 acceptor_pool.cc:254] collecting diagnostics on the listening RPC socket unix:/tmp/dist-test-task0qfb0V/test-tmp/rpc-test-501075adfc7d4fc497b9989789162ec1.sock every 8 connection(s)
[ OK ] Parameters/TestRpc.TestRpcContextClientDeadline/SSL_UnixSocket (83 ms)
[ RUN ] Parameters/TestRpc.TestApplicationFeatureFlagUnsupportedServer/SSL_UnixSocket
I20260928 14:52:29.217789 27100 acceptor_pool.cc:254] collecting diagnostics on the listening RPC socket unix:/tmp/dist-test-task0qfb0V/test-tmp/rpc-test-5d1ec007426647999c30dfa8cd124570.sock every 8 connection(s)
I20260928 14:52:29.218057 27101 acceptor_pool.cc:254] collecting diagnostics on the listening RPC socket unix:/tmp/dist-test-task0qfb0V/test-tmp/rpc-test-5d1ec007426647999c30dfa8cd124570.sock every 8 connection(s)
[ OK ] Parameters/TestRpc.TestApplicationFeatureFlagUnsupportedServer/SSL_UnixSocket (61 ms)
[ RUN ] Parameters/TestRpc.TestCancellationAsync/SSL_UnixSocket
I20260928 14:52:29.281867 27125 acceptor_pool.cc:254] collecting diagnostics on the listening RPC socket unix:/tmp/dist-test-task0qfb0V/test-tmp/rpc-test-b21dfdf8fcfd45bf9cf05351f8dc158b.sock every 8 connection(s)
I20260928 14:52:29.282107 27126 acceptor_pool.cc:254] collecting diagnostics on the listening RPC socket unix:/tmp/dist-test-task0qfb0V/test-tmp/rpc-test-b21dfdf8fcfd45bf9cf05351f8dc158b.sock every 8 connection(s)
I20260928 14:52:29.283077 26693 rpc-test.cc:1716] Connecting to unix:/tmp/dist-test-task0qfb0V/test-tmp/rpc-test-b21dfdf8fcfd45bf9cf05351f8dc158b.sock
I20260928 14:52:29.306136 26693 test_util.cc:268] Using random seed: 923865348
I20260928 14:52:29.342151 27129 rpc-test-base.h:240] got call: sleep_micros: 500 pattern: 4294967295 num_repetitions: 2097152 sidecar_idx: 0
I20260928 14:52:29.372273 27128 rpc-test-base.h:240] got call: sleep_micros: 500 pattern: 4294967295 num_repetitions: 2097152 sidecar_idx: 0
I20260928 14:52:29.403790 27129 rpc-test-base.h:240] got call: sleep_micros: 500 pattern: 4294967295 num_repetitions: 2097152 sidecar_idx: 0
I20260928 14:52:29.444115 27129 rpc-test-base.h:240] got call: sleep_micros: 500 pattern: 4294967295 num_repetitions: 2097152 sidecar_idx: 0
I20260928 14:52:29.479914 27129 rpc-test-base.h:240] got call: sleep_micros: 500 pattern: 4294967295 num_repetitions: 2097152 sidecar_idx: 0
I20260928 14:52:29.514330 27129 rpc-test-base.h:240] got call: sleep_micros: 500 pattern: 4294967295 num_repetitions: 2097152 sidecar_idx: 0
I20260928 14:52:29.543887 27128 rpc-test-base.h:240] got call: sleep_micros: 500 pattern: 4294967295 num_repetitions: 2097152 sidecar_idx: 0
W20260928 14:52:29.546564 27122 connection.cc:196] Error closing socket: Network error: TlsSocket::Close: Broken pipe
W20260928 14:52:29.569203 27122 connection.cc:441] server connection from unix:<unnamed> torn down before Call kudu.rpc.GenericCalculatorService.SleepWithSidecar from unix:<unnamed> (request call id 8) could send its response
W20260928 14:52:29.585763 27122 connection.cc:441] server connection from unix:<unnamed> torn down before Call kudu.rpc.GenericCalculatorService.SleepWithSidecar from unix:<unnamed> (request call id 9) could send its response
[ OK ] Parameters/TestRpc.TestCancellationAsync/SSL_UnixSocket (341 ms)
[ RUN ] Parameters/TestRpc.TestPerformanceBySocketType/SSL_UnixSocket
I20260928 14:52:29.610790 27150 acceptor_pool.cc:254] collecting diagnostics on the listening RPC socket unix:/tmp/dist-test-task0qfb0V/test-tmp/rpc-test-9ddcd1fc73ce41ceb8e0262c0ae2f791.sock every 8 connection(s)
I20260928 14:52:29.611029 27151 acceptor_pool.cc:254] collecting diagnostics on the listening RPC socket unix:/tmp/dist-test-task0qfb0V/test-tmp/rpc-test-9ddcd1fc73ce41ceb8e0262c0ae2f791.sock every 8 connection(s)
I20260928 14:52:29.612015 26693 rpc-test.cc:1846] Connecting to unix:/tmp/dist-test-task0qfb0V/test-tmp/rpc-test-9ddcd1fc73ce41ceb8e0262c0ae2f791.sock
I20260928 14:52:32.969681 26693 rpc-test.cc:1859] Sending 1024MB via ssl-enabled unix socket: real 3.341s user 3.197s sys 2.436s
I20260928 14:52:36.611696 26693 rpc-test.cc:1859] Sending 1024MB via ssl-enabled unix socket: real 3.642s user 3.622s sys 2.528s
I20260928 14:52:40.225044 26693 rpc-test.cc:1859] Sending 1024MB via ssl-enabled unix socket: real 3.613s user 3.557s sys 2.477s
I20260928 14:52:43.575865 26693 rpc-test.cc:1859] Sending 1024MB via ssl-enabled unix socket: real 3.351s user 3.124s sys 2.491s
I20260928 14:52:46.874648 26693 rpc-test.cc:1859] Sending 1024MB via ssl-enabled unix socket: real 3.299s user 3.206s sys 2.325s
[ OK ] Parameters/TestRpc.TestPerformanceBySocketType/SSL_UnixSocket (17294 ms)
[----------] 20 tests from Parameters/TestRpc (56090 ms total)
[----------] 1 test from Parameters/TestRpcSocketTxRxQueue
[ RUN ] Parameters/TestRpcSocketTxRxQueue.AcceptorRxQueueSizeMetric/0
I20260928 14:52:46.888245 27175 acceptor_pool.cc:254] collecting diagnostics on the listening RPC socket 0.0.0.0:41059 every 1 connection(s)
I20260928 14:52:46.888440 27176 acceptor_pool.cc:254] collecting diagnostics on the listening RPC socket 0.0.0.0:41059 every 1 connection(s)
W20260928 14:52:46.890175 27171 negotiation.cc:337] Failed RPC negotiation. Trace:
0928 14:52:46.889769 (+ 0us) reactor.cc:625] Submitting negotiation task for server connection from 127.0.0.1:43498 (local address 127.0.0.1:41059)
0928 14:52:46.889929 (+ 160us) server_negotiation.cc:206] Beginning negotiation
0928 14:52:46.889934 (+ 5us) server_negotiation.cc:399] Waiting for connection header
0928 14:52:46.890063 (+ 129us) negotiation.cc:327] Negotiation complete: Network error: Server connection negotiation failed: server connection from 127.0.0.1:43498: BlockingRecv error: recv got EOF from 127.0.0.1:43498 (error 108)
Metrics: {"server-negotiator.queue_time_us":56}
[ OK ] Parameters/TestRpcSocketTxRxQueue.AcceptorRxQueueSizeMetric/0 (11 ms)
[----------] 1 test from Parameters/TestRpcSocketTxRxQueue (11 ms total)
[----------] Global test environment tear-down
[==========] 21 tests from 2 test suites ran. (56102 ms total)
[ PASSED ] 20 tests.
[ FAILED ] 1 test, listed below:
[ FAILED ] Parameters/TestRpc.TestCallWithChainCertAndChainCA/SSL_UnixSocket, where GetParam() = (true, true)
1 FAILED TEST