Diagnosed failure

Parameters/TestRpc.TestCallWithChainCertAndChainCA/SSL_UnixSocket: /data0/somelongdirectorytoavoidrpathissues/src/kudu/src/kudu/rpc/rpc-test.cc:270: Failure
Failed
Bad status: Runtime error: could not verify certificate chain (error with cert: subject=CN = localhost, ST = sadfjas, C = AS, emailAddress = sdflkdsajf, O = lskdfjlsad, OU = sldfkja, issuer=C = AS, ST = ASDfkjdhf, L = lskdjf, O = saldfja, OU = skdjf, CN = localhost, emailAddress = sadjflkadsj): : certificate has expired
Google Test trace:
/data0/somelongdirectorytoavoidrpathissues/src/kudu/src/kudu/rpc/rpc-test.cc:267: Connecting to unix:/tmp/dist-test-taskJkyIP2/test-tmp/rpc-test-cd749700ef714689984c2d8f89d9101a.sock
I20260926 07:30:26.877974 11772 test_util.cc:175] -----------------------------------------------
I20260926 07:30:26.878074 11772 test_util.cc:176] Had fatal failures, leaving test files at /tmp/dist-test-taskJkyIP2/test-tmp/rpc-test.6.Parameters_TestRpc.TestCallWithChainCertAndChainCA_SSL_UnixSocket.1790407826726963-11772-0

Full log

Note: This is test shard 7 of 8.
[==========] Running 21 tests from 2 test suites.
[----------] Global test environment set-up.
[----------] 20 tests from Parameters/TestRpc
[ RUN      ] Parameters/TestRpc.TestMessengerCreateDestroy/SSL_UnixSocket
WARNING: Logging before InitGoogleLogging() is written to STDERR
I20260926 07:30:26.782065 11772 rpc-test.cc:169] started messenger TestCreateDestroy
[       OK ] Parameters/TestRpc.TestMessengerCreateDestroy/SSL_UnixSocket (38 ms)
[ RUN      ] Parameters/TestRpc.TestNegotiationDeadlock/SSL_UnixSocket
I20260926 07:30:26.799620 11792 acceptor_pool.cc:254] collecting diagnostics on the listening RPC socket unix:/tmp/dist-test-taskJkyIP2/test-tmp/rpc-test-61b8ea5ba3254b7b99a17afd5481e3d0.sock every 8 connection(s)
I20260926 07:30:26.799948 11793 acceptor_pool.cc:254] collecting diagnostics on the listening RPC socket unix:/tmp/dist-test-taskJkyIP2/test-tmp/rpc-test-61b8ea5ba3254b7b99a17afd5481e3d0.sock every 8 connection(s)
[       OK ] Parameters/TestRpc.TestNegotiationDeadlock/SSL_UnixSocket (35 ms)
[ RUN      ] Parameters/TestRpc.TestCallWithChainCertAndChainCA/SSL_UnixSocket
I20260926 07:30:26.865185 11808 acceptor_pool.cc:254] collecting diagnostics on the listening RPC socket unix:/tmp/dist-test-taskJkyIP2/test-tmp/rpc-test-cd749700ef714689984c2d8f89d9101a.sock every 8 connection(s)
I20260926 07:30:26.865516 11809 acceptor_pool.cc:254] collecting diagnostics on the listening RPC socket unix:/tmp/dist-test-taskJkyIP2/test-tmp/rpc-test-cd749700ef714689984c2d8f89d9101a.sock every 8 connection(s)
/data0/somelongdirectorytoavoidrpathissues/src/kudu/src/kudu/rpc/rpc-test.cc:270: Failure
Failed
Bad status: Runtime error: could not verify certificate chain (error with cert: subject=CN = localhost, ST = sadfjas, C = AS, emailAddress = sdflkdsajf, O = lskdfjlsad, OU = sldfkja, issuer=C = AS, ST = ASDfkjdhf, L = lskdjf, O = saldfja, OU = skdjf, CN = localhost, emailAddress = sadjflkadsj): : certificate has expired
Google Test trace:
/data0/somelongdirectorytoavoidrpathissues/src/kudu/src/kudu/rpc/rpc-test.cc:267: Connecting to unix:/tmp/dist-test-taskJkyIP2/test-tmp/rpc-test-cd749700ef714689984c2d8f89d9101a.sock
I20260926 07:30:26.877974 11772 test_util.cc:175] -----------------------------------------------
I20260926 07:30:26.878074 11772 test_util.cc:176] Had fatal failures, leaving test files at /tmp/dist-test-taskJkyIP2/test-tmp/rpc-test.6.Parameters_TestRpc.TestCallWithChainCertAndChainCA_SSL_UnixSocket.1790407826726963-11772-0
[  FAILED  ] Parameters/TestRpc.TestCallWithChainCertAndChainCA/SSL_UnixSocket, where GetParam() = (true, true) (57 ms)
[ RUN      ] Parameters/TestRpc.TestCallWithPasswordProtectedKey/SSL_UnixSocket
I20260926 07:30:26.903182 11833 acceptor_pool.cc:254] collecting diagnostics on the listening RPC socket unix:/tmp/dist-test-taskJkyIP2/test-tmp/rpc-test-ed849043c9ea468eacb7184e195d64fe.sock every 8 connection(s)
I20260926 07:30:26.903443 11834 acceptor_pool.cc:254] collecting diagnostics on the listening RPC socket unix:/tmp/dist-test-taskJkyIP2/test-tmp/rpc-test-ed849043c9ea468eacb7184e195d64fe.sock every 8 connection(s)
W20260926 07:30:26.934996 11830 connection.cc:196] Error closing socket: Network error: TlsSocket::Close: Broken pipe
[       OK ] Parameters/TestRpc.TestCallWithPasswordProtectedKey/SSL_UnixSocket (60 ms)
[ RUN      ] Parameters/TestRpc.TestCallToBadServer/SSL_UnixSocket
I20260926 07:30:26.950850 11772 rpc-test.cc:394] Status: Network error: Client connection negotiation failed: client connection to 0.0.0.0:0: connect: Connection refused (error 111)
I20260926 07:30:26.951581 11772 rpc-test.cc:394] Status: Network error: Client connection negotiation failed: client connection to 0.0.0.0:0: connect: Connection refused (error 111)
I20260926 07:30:26.952284 11772 rpc-test.cc:394] Status: Network error: Client connection negotiation failed: client connection to 0.0.0.0:0: connect: Connection refused (error 111)
I20260926 07:30:26.952841 11772 rpc-test.cc:394] Status: Network error: Client connection negotiation failed: client connection to 0.0.0.0:0: connect: Connection refused (error 111)
I20260926 07:30:26.953356 11772 rpc-test.cc:394] Status: Network error: Client connection negotiation failed: client connection to 0.0.0.0:0: connect: Connection refused (error 111)
[       OK ] Parameters/TestRpc.TestCallToBadServer/SSL_UnixSocket (15 ms)
[ RUN      ] Parameters/TestRpc.TestWrongService/SSL_UnixSocket
I20260926 07:30:26.968209 11868 acceptor_pool.cc:254] collecting diagnostics on the listening RPC socket unix:/tmp/dist-test-taskJkyIP2/test-tmp/rpc-test-7ab313d3d65241a8b6fe47443d373a32.sock every 8 connection(s)
I20260926 07:30:26.968437 11869 acceptor_pool.cc:254] collecting diagnostics on the listening RPC socket unix:/tmp/dist-test-taskJkyIP2/test-tmp/rpc-test-7ab313d3d65241a8b6fe47443d373a32.sock every 8 connection(s)
I20260926 07:30:26.992515 11865 messenger.cc:345] service WrongServiceName not registered on TestServer
[       OK ] Parameters/TestRpc.TestWrongService/SSL_UnixSocket (42 ms)
[ RUN      ] Parameters/TestRpc.TestConnectionKeepalive/SSL_UnixSocket
I20260926 07:30:27.013870 11891 acceptor_pool.cc:254] collecting diagnostics on the listening RPC socket unix:/tmp/dist-test-taskJkyIP2/test-tmp/rpc-test-008e0ab6d6604af9ae2af207e9c18534.sock every 8 connection(s)
I20260926 07:30:27.014070 11892 acceptor_pool.cc:254] collecting diagnostics on the listening RPC socket unix:/tmp/dist-test-taskJkyIP2/test-tmp/rpc-test-008e0ab6d6604af9ae2af207e9c18534.sock every 8 connection(s)
I20260926 07:30:27.015048 11772 rpc-test.cc:488] Connecting to unix:/tmp/dist-test-taskJkyIP2/test-tmp/rpc-test-008e0ab6d6604af9ae2af207e9c18534.sock
W20260926 07:30:27.501042 11904 connection.cc:196] Error closing socket: Network error: TlsSocket::Close: Broken pipe
[       OK ] Parameters/TestRpc.TestConnectionKeepalive/SSL_UnixSocket (1049 ms)
[ RUN      ] Parameters/TestRpc.TestClientConnectionMetrics/SSL_UnixSocket
I20260926 07:30:28.067740 11916 acceptor_pool.cc:254] collecting diagnostics on the listening RPC socket unix:/tmp/dist-test-taskJkyIP2/test-tmp/rpc-test-6344333feabc44e9ad9d7835446f9875.sock every 8 connection(s)
I20260926 07:30:28.068009 11917 acceptor_pool.cc:254] collecting diagnostics on the listening RPC socket unix:/tmp/dist-test-taskJkyIP2/test-tmp/rpc-test-6344333feabc44e9ad9d7835446f9875.sock every 8 connection(s)
I20260926 07:30:28.069016 11772 rpc-test.cc:569] Connecting to unix:/tmp/dist-test-taskJkyIP2/test-tmp/rpc-test-6344333feabc44e9ad9d7835446f9875.sock
W20260926 07:30:49.250133 11913 connection.cc:196] Error closing socket: Network error: TlsSocket::Close: Broken pipe
[       OK ] Parameters/TestRpc.TestClientConnectionMetrics/SSL_UnixSocket (21208 ms)
[ RUN      ] Parameters/TestRpc.TestCredentialsPolicy/SSL_UnixSocket
I20260926 07:30:49.275588 11939 acceptor_pool.cc:254] collecting diagnostics on the listening RPC socket unix:/tmp/dist-test-taskJkyIP2/test-tmp/rpc-test-d090fee5bee64824bd95d24940842392.sock every 8 connection(s)
I20260926 07:30:49.275815 11940 acceptor_pool.cc:254] collecting diagnostics on the listening RPC socket unix:/tmp/dist-test-taskJkyIP2/test-tmp/rpc-test-d090fee5bee64824bd95d24940842392.sock every 8 connection(s)
I20260926 07:30:49.276762 11772 rpc-test.cc:700] Connecting to unix:/tmp/dist-test-taskJkyIP2/test-tmp/rpc-test-d090fee5bee64824bd95d24940842392.sock
W20260926 07:30:49.313228 11938 connection.cc:196] Error closing socket: Network error: TlsSocket::Close: Broken pipe
[       OK ] Parameters/TestRpc.TestCredentialsPolicy/SSL_UnixSocket (67 ms)
[ RUN      ] Parameters/TestRpc.TestCallLongerThanKeepalive/SSL_UnixSocket
I20260926 07:30:49.348147 11964 acceptor_pool.cc:254] collecting diagnostics on the listening RPC socket unix:/tmp/dist-test-taskJkyIP2/test-tmp/rpc-test-348c24c076c24c38b47dfe8557191958.sock every 8 connection(s)
I20260926 07:30:49.348417 11965 acceptor_pool.cc:254] collecting diagnostics on the listening RPC socket unix:/tmp/dist-test-taskJkyIP2/test-tmp/rpc-test-348c24c076c24c38b47dfe8557191958.sock every 8 connection(s)
I20260926 07:30:49.364738 11968 rpc-test-base.h:222] got call: sleep_micros: 3000000 deferred: true
I20260926 07:30:52.366623 11968 rpcz_store.cc:275] Call kudu.rpc.GenericCalculatorService.Sleep from unix:<unnamed> (request call id 0) took 3002 ms. Trace:
I20260926 07:30:52.366786 11968 rpcz_store.cc:276] 0926 07:30:49.364595 (+     0us) service_pool.cc:170] Inserting onto call queue
0926 07:30:49.364685 (+    90us) service_pool.cc:227] Handling call
0926 07:30:52.366579 (+3001894us) inbound_call.cc:173] Queueing success response
Metrics: {}
W20260926 07:30:52.370020 11961 connection.cc:196] Error closing socket: Network error: TlsSocket::Close: Broken pipe
[       OK ] Parameters/TestRpc.TestCallLongerThanKeepalive/SSL_UnixSocket (3050 ms)
[ RUN      ] Parameters/TestRpc.TestRpcSidecar/SSL_UnixSocket
I20260926 07:30:52.384408 11989 acceptor_pool.cc:254] collecting diagnostics on the listening RPC socket unix:/tmp/dist-test-taskJkyIP2/test-tmp/rpc-test-4f7304ae65104ae184bace83d18b16ce.sock every 8 connection(s)
I20260926 07:30:52.384644 11990 acceptor_pool.cc:254] collecting diagnostics on the listening RPC socket unix:/tmp/dist-test-taskJkyIP2/test-tmp/rpc-test-4f7304ae65104ae184bace83d18b16ce.sock every 8 connection(s)
W20260926 07:30:52.522092 11986 connection.cc:196] Error closing socket: Network error: TlsSocket::Close: Broken pipe
[       OK ] Parameters/TestRpc.TestRpcSidecar/SSL_UnixSocket (151 ms)
[ RUN      ] Parameters/TestRpc.TestRpcSidecarLimits/SSL_UnixSocket
I20260926 07:30:54.653895 12014 acceptor_pool.cc:254] collecting diagnostics on the listening RPC socket unix:/tmp/dist-test-taskJkyIP2/test-tmp/rpc-test-a97d3b7d9b2c4cdd8987c3d43c11bf8f.sock every 8 connection(s)
I20260926 07:30:54.654053 12015 acceptor_pool.cc:254] collecting diagnostics on the listening RPC socket unix:/tmp/dist-test-taskJkyIP2/test-tmp/rpc-test-a97d3b7d9b2c4cdd8987c3d43c11bf8f.sock every 8 connection(s)
W20260926 07:30:54.674664 11772 serialization.cc:72] Serialized kudu.rpc_test.PushStringsRequestPB (2147483654 bytes) is larger than the maximum configured RPC message size (52428800 bytes). Sending anyway, but peer may reject the data.
W20260926 07:30:54.680806 12011 connection.cc:535] server connection from unix:<unnamed> recv error: Network error: RPC frame had a length of 2147483714, but we only support messages up to 52428800 bytes long.
W20260926 07:30:54.680953 12011 connection.cc:158] shutting down server connection from unix:<unnamed> with pending inbound data: 4/2147483714 bytes received; last active 0 ns ago: status Network error: RPC frame had a length of 2147483714, but we only support messages up to 52428800 bytes long.
W20260926 07:30:54.681456 12027 connection.cc:196] Error closing socket: Network error: TlsSocket::Close: Broken pipe
I20260926 07:30:54.700649 12039 acceptor_pool.cc:254] collecting diagnostics on the listening RPC socket unix:/tmp/dist-test-taskJkyIP2/test-tmp/rpc-test-a97d3b7d9b2c4cdd8987c3d43c11bf8f.sock every 8 connection(s)
I20260926 07:30:54.701059 12040 acceptor_pool.cc:254] collecting diagnostics on the listening RPC socket unix:/tmp/dist-test-taskJkyIP2/test-tmp/rpc-test-a97d3b7d9b2c4cdd8987c3d43c11bf8f.sock every 8 connection(s)
W20260926 07:31:00.563593 12036 connection.cc:577] server connection from unix:<unnamed>: received bad data: 'Corruption: Invalid packet: message had a length of 2147483710, but we only support messages up to 2147483647 bytes
'
W20260926 07:31:00.564344 12052 connection.cc:196] Error closing socket: Network error: TlsSocket::Close: Broken pipe
[       OK ] Parameters/TestRpc.TestRpcSidecarLimits/SSL_UnixSocket (8456 ms)
[ RUN      ] Parameters/TestRpc.TestCallTimeoutDoesntAffectNegotiation/SSL_UnixSocket
I20260926 07:31:01.017330 12064 acceptor_pool.cc:254] collecting diagnostics on the listening RPC socket unix:/tmp/dist-test-taskJkyIP2/test-tmp/rpc-test-65d964bd70884cc096cb8e023e594062.sock every 8 connection(s)
I20260926 07:31:01.017577 12065 acceptor_pool.cc:254] collecting diagnostics on the listening RPC socket unix:/tmp/dist-test-taskJkyIP2/test-tmp/rpc-test-65d964bd70884cc096cb8e023e594062.sock every 8 connection(s)
W20260926 07:31:01.039094 12060 negotiation.cc:266] Injecting 500ms delay in negotiation
I20260926 07:31:01.089432 11772 rpc-test-base.h:595] status: Timed out: connection negotiation to unix:/tmp/dist-test-taskJkyIP2/test-tmp/rpc-test-65d964bd70884cc096cb8e023e594062.sock for RPC Sleep timed out after 0.050s (ON_OUTBOUND_QUEUE), seconds elapsed: 0.051021
[       OK ] Parameters/TestRpc.TestCallTimeoutDoesntAffectNegotiation/SSL_UnixSocket (566 ms)
[ RUN      ] Parameters/TestRpc.TestRpcHandlerLatencyMetric/SSL_UnixSocket
I20260926 07:31:01.564493 12089 acceptor_pool.cc:254] collecting diagnostics on the listening RPC socket unix:/tmp/dist-test-taskJkyIP2/test-tmp/rpc-test-548a0d8d28e1474d9433b9e71b800cd1.sock every 8 connection(s)
I20260926 07:31:01.564738 12090 acceptor_pool.cc:254] collecting diagnostics on the listening RPC socket unix:/tmp/dist-test-taskJkyIP2/test-tmp/rpc-test-548a0d8d28e1474d9433b9e71b800cd1.sock every 8 connection(s)
I20260926 07:31:01.600744 11772 rpc-test.cc:1236] Sleep() min lat: 20712
I20260926 07:31:01.600873 11772 rpc-test.cc:1237] Sleep() mean lat: 20712
I20260926 07:31:01.600919 11772 rpc-test.cc:1238] Sleep() max lat: 20712
I20260926 07:31:01.600936 11772 rpc-test.cc:1239] Sleep() #calls: 1
[       OK ] Parameters/TestRpc.TestRpcHandlerLatencyMetric/SSL_UnixSocket (56 ms)
[ RUN      ] Parameters/TestRpc.TimedOutOnResponseMetricServiceQueue/SSL_UnixSocket
I20260926 07:31:01.638571 12115 acceptor_pool.cc:254] collecting diagnostics on the listening RPC socket unix:/tmp/dist-test-taskJkyIP2/test-tmp/rpc-test-1140d02b110e4c96844e8f092613f5a6.sock every 8 connection(s)
I20260926 07:31:01.638792 12116 acceptor_pool.cc:254] collecting diagnostics on the listening RPC socket unix:/tmp/dist-test-taskJkyIP2/test-tmp/rpc-test-1140d02b110e4c96844e8f092613f5a6.sock every 8 connection(s)
W20260926 07:31:01.706462 12117 rpcz_store.cc:267] Call kudu.rpc_test.CalculatorService.Sleep from unix:<unnamed> (request call id 2) took 20 ms (client timeout 20 ms). Trace:
W20260926 07:31:01.706616 12117 rpcz_store.cc:269] 0926 07:31:01.685991 (+     0us) service_pool.cc:170] Inserting onto call queue
0926 07:31:01.706383 (+ 20392us) service_pool.cc:214] Skipping call since client already timed out
0926 07:31:01.706439 (+    56us) inbound_call.cc:173] Queueing failure response
Metrics: {}
[       OK ] Parameters/TestRpc.TimedOutOnResponseMetricServiceQueue/SSL_UnixSocket (104 ms)
[ RUN      ] Parameters/TestRpc.RpcPendingConnectionsMetric/SSL_UnixSocket
I20260926 07:31:01.717378 12138 acceptor_pool.cc:254] collecting diagnostics on the listening RPC socket 0.0.0.0:41155 every 8 connection(s)
I20260926 07:31:01.717578 12139 acceptor_pool.cc:254] collecting diagnostics on the listening RPC socket 0.0.0.0:41155 every 8 connection(s)
W20260926 07:31:01.719538 12134 negotiation.cc:337] Failed RPC negotiation. Trace:
0926 07:31:01.718923 (+     0us) reactor.cc:625] Submitting negotiation task for server connection from 127.0.0.1:40130 (local address 127.0.0.1:41155)
0926 07:31:01.719078 (+   155us) server_negotiation.cc:206] Beginning negotiation
0926 07:31:01.719082 (+     4us) server_negotiation.cc:399] Waiting for connection header
0926 07:31:01.719233 (+   151us) negotiation.cc:327] Negotiation complete: Network error: Server connection negotiation failed: server connection from 127.0.0.1:40130: BlockingRecv error: recv got EOF from 127.0.0.1:40130 (error 108)
Metrics: {"server-negotiator.queue_time_us":55}
[       OK ] Parameters/TestRpc.RpcPendingConnectionsMetric/SSL_UnixSocket (21 ms)
[ RUN      ] Parameters/TestRpc.TestRpcContextClientDeadline/SSL_UnixSocket
I20260926 07:31:01.747020 12154 acceptor_pool.cc:254] collecting diagnostics on the listening RPC socket unix:/tmp/dist-test-taskJkyIP2/test-tmp/rpc-test-9224c725fc1e45dca96c59b6ccfbe878.sock every 8 connection(s)
I20260926 07:31:01.747205 12155 acceptor_pool.cc:254] collecting diagnostics on the listening RPC socket unix:/tmp/dist-test-taskJkyIP2/test-tmp/rpc-test-9224c725fc1e45dca96c59b6ccfbe878.sock every 8 connection(s)
[       OK ] Parameters/TestRpc.TestRpcContextClientDeadline/SSL_UnixSocket (67 ms)
[ RUN      ] Parameters/TestRpc.TestApplicationFeatureFlagUnsupportedServer/SSL_UnixSocket
I20260926 07:31:01.815979 12179 acceptor_pool.cc:254] collecting diagnostics on the listening RPC socket unix:/tmp/dist-test-taskJkyIP2/test-tmp/rpc-test-b39e14236c8e43abb0c6e25fdb8d445f.sock every 8 connection(s)
I20260926 07:31:01.816164 12180 acceptor_pool.cc:254] collecting diagnostics on the listening RPC socket unix:/tmp/dist-test-taskJkyIP2/test-tmp/rpc-test-b39e14236c8e43abb0c6e25fdb8d445f.sock every 8 connection(s)
[       OK ] Parameters/TestRpc.TestApplicationFeatureFlagUnsupportedServer/SSL_UnixSocket (38 ms)
[ RUN      ] Parameters/TestRpc.TestCancellationAsync/SSL_UnixSocket
I20260926 07:31:01.855295 12204 acceptor_pool.cc:254] collecting diagnostics on the listening RPC socket unix:/tmp/dist-test-taskJkyIP2/test-tmp/rpc-test-6039b4af507f4f65b046c2281d19db6a.sock every 8 connection(s)
I20260926 07:31:01.855480 12205 acceptor_pool.cc:254] collecting diagnostics on the listening RPC socket unix:/tmp/dist-test-taskJkyIP2/test-tmp/rpc-test-6039b4af507f4f65b046c2281d19db6a.sock every 8 connection(s)
I20260926 07:31:01.856318 11772 rpc-test.cc:1716] Connecting to unix:/tmp/dist-test-taskJkyIP2/test-tmp/rpc-test-6039b4af507f4f65b046c2281d19db6a.sock
I20260926 07:31:01.871315 11772 test_util.cc:268] Using random seed: -795073857
I20260926 07:31:01.912997 12208 rpc-test-base.h:240] got call: sleep_micros: 500 pattern: 4294967295 num_repetitions: 2097152 sidecar_idx: 0
I20260926 07:31:01.943384 12207 rpc-test-base.h:240] got call: sleep_micros: 500 pattern: 4294967295 num_repetitions: 2097152 sidecar_idx: 0
I20260926 07:31:01.966636 12208 rpc-test-base.h:240] got call: sleep_micros: 500 pattern: 4294967295 num_repetitions: 2097152 sidecar_idx: 0
I20260926 07:31:01.996661 12207 rpc-test-base.h:240] got call: sleep_micros: 500 pattern: 4294967295 num_repetitions: 2097152 sidecar_idx: 0
I20260926 07:31:02.024868 12208 rpc-test-base.h:240] got call: sleep_micros: 500 pattern: 4294967295 num_repetitions: 2097152 sidecar_idx: 0
I20260926 07:31:02.055588 12207 rpc-test-base.h:240] got call: sleep_micros: 500 pattern: 4294967295 num_repetitions: 2097152 sidecar_idx: 0
I20260926 07:31:02.083539 12208 rpc-test-base.h:240] got call: sleep_micros: 500 pattern: 4294967295 num_repetitions: 2097152 sidecar_idx: 0
W20260926 07:31:02.086191 12201 connection.cc:196] Error closing socket: Network error: TlsSocket::Close: Broken pipe
W20260926 07:31:02.114462 12201 connection.cc:441] server connection from unix:<unnamed> torn down before Call kudu.rpc.GenericCalculatorService.SleepWithSidecar from unix:<unnamed> (request call id 8) could send its response
W20260926 07:31:02.130052 12201 connection.cc:441] server connection from unix:<unnamed> torn down before Call kudu.rpc.GenericCalculatorService.SleepWithSidecar from unix:<unnamed> (request call id 9) could send its response
[       OK ] Parameters/TestRpc.TestCancellationAsync/SSL_UnixSocket (294 ms)
[ RUN      ] Parameters/TestRpc.TestPerformanceBySocketType/SSL_UnixSocket
I20260926 07:31:02.171016 12229 acceptor_pool.cc:254] collecting diagnostics on the listening RPC socket unix:/tmp/dist-test-taskJkyIP2/test-tmp/rpc-test-95526134e2404843bcb5a1824a909d25.sock every 8 connection(s)
I20260926 07:31:02.171238 12230 acceptor_pool.cc:254] collecting diagnostics on the listening RPC socket unix:/tmp/dist-test-taskJkyIP2/test-tmp/rpc-test-95526134e2404843bcb5a1824a909d25.sock every 8 connection(s)
I20260926 07:31:02.172096 11772 rpc-test.cc:1846] Connecting to unix:/tmp/dist-test-taskJkyIP2/test-tmp/rpc-test-95526134e2404843bcb5a1824a909d25.sock
I20260926 07:31:05.365514 11772 rpc-test.cc:1859] Sending 1024MB via ssl-enabled unix socket: real 3.179s	user 3.188s	sys 2.166s
I20260926 07:31:08.644212 11772 rpc-test.cc:1859] Sending 1024MB via ssl-enabled unix socket: real 3.279s	user 3.344s	sys 2.137s
I20260926 07:31:11.989830 11772 rpc-test.cc:1859] Sending 1024MB via ssl-enabled unix socket: real 3.345s	user 3.461s	sys 2.163s
I20260926 07:31:15.191730 11772 rpc-test.cc:1859] Sending 1024MB via ssl-enabled unix socket: real 3.202s	user 3.183s	sys 2.209s
I20260926 07:31:18.445024 11772 rpc-test.cc:1859] Sending 1024MB via ssl-enabled unix socket: real 3.253s	user 3.295s	sys 2.195s
W20260926 07:31:18.446557 12226 connection.cc:196] Error closing socket: Network error: TlsSocket::Close: Broken pipe
[       OK ] Parameters/TestRpc.TestPerformanceBySocketType/SSL_UnixSocket (16320 ms)
[----------] 20 tests from Parameters/TestRpc (51706 ms total)

[----------] 1 test from Parameters/TestRpcSocketTxRxQueue
[ RUN      ] Parameters/TestRpcSocketTxRxQueue.AcceptorRxQueueSizeMetric/0
I20260926 07:31:18.464874 12254 acceptor_pool.cc:254] collecting diagnostics on the listening RPC socket 0.0.0.0:33679 every 1 connection(s)
I20260926 07:31:18.465150 12255 acceptor_pool.cc:254] collecting diagnostics on the listening RPC socket 0.0.0.0:33679 every 1 connection(s)
W20260926 07:31:18.466886 12250 negotiation.cc:337] Failed RPC negotiation. Trace:
0926 07:31:18.466457 (+     0us) reactor.cc:625] Submitting negotiation task for server connection from 127.0.0.1:43606 (local address 127.0.0.1:33679)
0926 07:31:18.466632 (+   175us) server_negotiation.cc:206] Beginning negotiation
0926 07:31:18.466636 (+     4us) server_negotiation.cc:399] Waiting for connection header
0926 07:31:18.466759 (+   123us) negotiation.cc:327] Negotiation complete: Network error: Server connection negotiation failed: server connection from 127.0.0.1:43606: BlockingRecv error: recv got EOF from 127.0.0.1:43606 (error 108)
Metrics: {"server-negotiator.queue_time_us":74}
[       OK ] Parameters/TestRpcSocketTxRxQueue.AcceptorRxQueueSizeMetric/0 (17 ms)
[----------] 1 test from Parameters/TestRpcSocketTxRxQueue (17 ms total)

[----------] Global test environment tear-down
[==========] 21 tests from 2 test suites ran. (51724 ms total)
[  PASSED  ] 20 tests.
[  FAILED  ] 1 test, listed below:
[  FAILED  ] Parameters/TestRpc.TestCallWithChainCertAndChainCA/SSL_UnixSocket, where GetParam() = (true, true)

 1 FAILED TEST