Diagnosed failure
Parameters/TestRpc.TestCallWithChainCertAndChainCA/SSL_UnixSocket: /data0/somelongdirectorytoavoidrpathissues/src/kudu/src/kudu/rpc/rpc-test.cc:270: Failure
Failed
Bad status: Runtime error: could not verify certificate chain (error with cert: subject=CN = localhost, ST = sadfjas, C = AS, emailAddress = sdflkdsajf, O = lskdfjlsad, OU = sldfkja, issuer=C = AS, ST = ASDfkjdhf, L = lskdjf, O = saldfja, OU = skdjf, CN = localhost, emailAddress = sadjflkadsj): : certificate has expired
Google Test trace:
/data0/somelongdirectorytoavoidrpathissues/src/kudu/src/kudu/rpc/rpc-test.cc:267: Connecting to unix:/tmp/dist-test-taskRW48rX/test-tmp/rpc-test-9a9707498efe4c62bf7cda1179131545.sock
I20260927 10:42:49.818990 1258 test_util.cc:175] -----------------------------------------------
I20260927 10:42:49.819098 1258 test_util.cc:176] Had fatal failures, leaving test files at /tmp/dist-test-taskRW48rX/test-tmp/rpc-test.6.Parameters_TestRpc.TestCallWithChainCertAndChainCA_SSL_UnixSocket.1790505769732578-1258-0
Full log
Note: This is test shard 7 of 8.
[==========] Running 21 tests from 2 test suites.
[----------] Global test environment set-up.
[----------] 20 tests from Parameters/TestRpc
[ RUN ] Parameters/TestRpc.TestMessengerCreateDestroy/SSL_UnixSocket
WARNING: Logging before InitGoogleLogging() is written to STDERR
I20260927 10:42:49.759346 1258 rpc-test.cc:169] started messenger TestCreateDestroy
[ OK ] Parameters/TestRpc.TestMessengerCreateDestroy/SSL_UnixSocket (21 ms)
[ RUN ] Parameters/TestRpc.TestNegotiationDeadlock/SSL_UnixSocket
I20260927 10:42:49.783994 1278 acceptor_pool.cc:254] collecting diagnostics on the listening RPC socket unix:/tmp/dist-test-taskRW48rX/test-tmp/rpc-test-5a9a79e0a1044b35854768ef3a51f4e2.sock every 8 connection(s)
I20260927 10:42:49.784008 1279 acceptor_pool.cc:254] collecting diagnostics on the listening RPC socket unix:/tmp/dist-test-taskRW48rX/test-tmp/rpc-test-5a9a79e0a1044b35854768ef3a51f4e2.sock every 8 connection(s)
[ OK ] Parameters/TestRpc.TestNegotiationDeadlock/SSL_UnixSocket (33 ms)
[ RUN ] Parameters/TestRpc.TestCallWithChainCertAndChainCA/SSL_UnixSocket
I20260927 10:42:49.814034 1294 acceptor_pool.cc:254] collecting diagnostics on the listening RPC socket unix:/tmp/dist-test-taskRW48rX/test-tmp/rpc-test-9a9707498efe4c62bf7cda1179131545.sock every 8 connection(s)
I20260927 10:42:49.814051 1295 acceptor_pool.cc:254] collecting diagnostics on the listening RPC socket unix:/tmp/dist-test-taskRW48rX/test-tmp/rpc-test-9a9707498efe4c62bf7cda1179131545.sock every 8 connection(s)
/data0/somelongdirectorytoavoidrpathissues/src/kudu/src/kudu/rpc/rpc-test.cc:270: Failure
Failed
Bad status: Runtime error: could not verify certificate chain (error with cert: subject=CN = localhost, ST = sadfjas, C = AS, emailAddress = sdflkdsajf, O = lskdfjlsad, OU = sldfkja, issuer=C = AS, ST = ASDfkjdhf, L = lskdjf, O = saldfja, OU = skdjf, CN = localhost, emailAddress = sadjflkadsj): : certificate has expired
Google Test trace:
/data0/somelongdirectorytoavoidrpathissues/src/kudu/src/kudu/rpc/rpc-test.cc:267: Connecting to unix:/tmp/dist-test-taskRW48rX/test-tmp/rpc-test-9a9707498efe4c62bf7cda1179131545.sock
I20260927 10:42:49.818990 1258 test_util.cc:175] -----------------------------------------------
I20260927 10:42:49.819098 1258 test_util.cc:176] Had fatal failures, leaving test files at /tmp/dist-test-taskRW48rX/test-tmp/rpc-test.6.Parameters_TestRpc.TestCallWithChainCertAndChainCA_SSL_UnixSocket.1790505769732578-1258-0
[ FAILED ] Parameters/TestRpc.TestCallWithChainCertAndChainCA/SSL_UnixSocket, where GetParam() = (true, true) (24 ms)
[ RUN ] Parameters/TestRpc.TestCallWithPasswordProtectedKey/SSL_UnixSocket
I20260927 10:42:49.836644 1319 acceptor_pool.cc:254] collecting diagnostics on the listening RPC socket unix:/tmp/dist-test-taskRW48rX/test-tmp/rpc-test-9c938105079e4fd0b50afd26fba6dcf4.sock every 8 connection(s)
I20260927 10:42:49.836699 1320 acceptor_pool.cc:254] collecting diagnostics on the listening RPC socket unix:/tmp/dist-test-taskRW48rX/test-tmp/rpc-test-9c938105079e4fd0b50afd26fba6dcf4.sock every 8 connection(s)
W20260927 10:42:49.850049 1316 connection.cc:196] Error closing socket: Network error: TlsSocket::Close: Broken pipe
[ OK ] Parameters/TestRpc.TestCallWithPasswordProtectedKey/SSL_UnixSocket (32 ms)
[ RUN ] Parameters/TestRpc.TestCallToBadServer/SSL_UnixSocket
I20260927 10:42:49.862118 1258 rpc-test.cc:394] Status: Network error: Client connection negotiation failed: client connection to 0.0.0.0:0: connect: Connection refused (error 111)
I20260927 10:42:49.862571 1258 rpc-test.cc:394] Status: Network error: Client connection negotiation failed: client connection to 0.0.0.0:0: connect: Connection refused (error 111)
I20260927 10:42:49.862937 1258 rpc-test.cc:394] Status: Network error: Client connection negotiation failed: client connection to 0.0.0.0:0: connect: Connection refused (error 111)
I20260927 10:42:49.863345 1258 rpc-test.cc:394] Status: Network error: Client connection negotiation failed: client connection to 0.0.0.0:0: connect: Connection refused (error 111)
I20260927 10:42:49.863730 1258 rpc-test.cc:394] Status: Network error: Client connection negotiation failed: client connection to 0.0.0.0:0: connect: Connection refused (error 111)
[ OK ] Parameters/TestRpc.TestCallToBadServer/SSL_UnixSocket (13 ms)
[ RUN ] Parameters/TestRpc.TestWrongService/SSL_UnixSocket
I20260927 10:42:49.875340 1354 acceptor_pool.cc:254] collecting diagnostics on the listening RPC socket unix:/tmp/dist-test-taskRW48rX/test-tmp/rpc-test-da5b3f0999c8430f9980914a2bac6cb3.sock every 8 connection(s)
I20260927 10:42:49.875360 1355 acceptor_pool.cc:254] collecting diagnostics on the listening RPC socket unix:/tmp/dist-test-taskRW48rX/test-tmp/rpc-test-da5b3f0999c8430f9980914a2bac6cb3.sock every 8 connection(s)
I20260927 10:42:49.900713 1351 messenger.cc:345] service WrongServiceName not registered on TestServer
W20260927 10:42:49.901623 1351 connection.cc:196] Error closing socket: Network error: TlsSocket::Close: Broken pipe
[ OK ] Parameters/TestRpc.TestWrongService/SSL_UnixSocket (38 ms)
[ RUN ] Parameters/TestRpc.TestConnectionKeepalive/SSL_UnixSocket
I20260927 10:42:49.931293 1377 acceptor_pool.cc:254] collecting diagnostics on the listening RPC socket unix:/tmp/dist-test-taskRW48rX/test-tmp/rpc-test-bb8f314820db4b939cad50f354a5c493.sock every 8 connection(s)
I20260927 10:42:49.931310 1378 acceptor_pool.cc:254] collecting diagnostics on the listening RPC socket unix:/tmp/dist-test-taskRW48rX/test-tmp/rpc-test-bb8f314820db4b939cad50f354a5c493.sock every 8 connection(s)
I20260927 10:42:49.931537 1258 rpc-test.cc:488] Connecting to unix:/tmp/dist-test-taskRW48rX/test-tmp/rpc-test-bb8f314820db4b939cad50f354a5c493.sock
W20260927 10:42:50.404448 1390 connection.cc:196] Error closing socket: Network error: TlsSocket::Close: Broken pipe
[ OK ] Parameters/TestRpc.TestConnectionKeepalive/SSL_UnixSocket (1052 ms)
[ RUN ] Parameters/TestRpc.TestClientConnectionMetrics/SSL_UnixSocket
I20260927 10:42:50.970589 1402 acceptor_pool.cc:254] collecting diagnostics on the listening RPC socket unix:/tmp/dist-test-taskRW48rX/test-tmp/rpc-test-4874f06c779947e68844dd6dd1967e67.sock every 8 connection(s)
I20260927 10:42:50.970886 1258 rpc-test.cc:569] Connecting to unix:/tmp/dist-test-taskRW48rX/test-tmp/rpc-test-4874f06c779947e68844dd6dd1967e67.sock
I20260927 10:42:50.970963 1403 acceptor_pool.cc:254] collecting diagnostics on the listening RPC socket unix:/tmp/dist-test-taskRW48rX/test-tmp/rpc-test-4874f06c779947e68844dd6dd1967e67.sock every 8 connection(s)
W20260927 10:43:01.480846 1399 connection.cc:196] Error closing socket: Network error: TlsSocket::Close: Broken pipe
[ OK ] Parameters/TestRpc.TestClientConnectionMetrics/SSL_UnixSocket (10527 ms)
[ RUN ] Parameters/TestRpc.TestCredentialsPolicy/SSL_UnixSocket
I20260927 10:43:01.497985 1425 acceptor_pool.cc:254] collecting diagnostics on the listening RPC socket unix:/tmp/dist-test-taskRW48rX/test-tmp/rpc-test-79048dd010f94139bf4a2d9378eb0cd4.sock every 8 connection(s)
I20260927 10:43:01.498138 1426 acceptor_pool.cc:254] collecting diagnostics on the listening RPC socket unix:/tmp/dist-test-taskRW48rX/test-tmp/rpc-test-79048dd010f94139bf4a2d9378eb0cd4.sock every 8 connection(s)
I20260927 10:43:01.498310 1258 rpc-test.cc:700] Connecting to unix:/tmp/dist-test-taskRW48rX/test-tmp/rpc-test-79048dd010f94139bf4a2d9378eb0cd4.sock
W20260927 10:43:01.521497 1424 connection.cc:196] Error closing socket: Network error: TlsSocket::Close: Broken pipe
W20260927 10:43:01.526599 1424 connection.cc:196] Error closing socket: Network error: TlsSocket::Close: Broken pipe
[ OK ] Parameters/TestRpc.TestCredentialsPolicy/SSL_UnixSocket (45 ms)
[ RUN ] Parameters/TestRpc.TestCallLongerThanKeepalive/SSL_UnixSocket
I20260927 10:43:01.547220 1450 acceptor_pool.cc:254] collecting diagnostics on the listening RPC socket unix:/tmp/dist-test-taskRW48rX/test-tmp/rpc-test-1505c503cb1a44eaa010e6eedc63c897.sock every 8 connection(s)
I20260927 10:43:01.547276 1451 acceptor_pool.cc:254] collecting diagnostics on the listening RPC socket unix:/tmp/dist-test-taskRW48rX/test-tmp/rpc-test-1505c503cb1a44eaa010e6eedc63c897.sock every 8 connection(s)
I20260927 10:43:01.562780 1453 rpc-test-base.h:222] got call: sleep_micros: 3000000 deferred: true
I20260927 10:43:04.563711 1453 rpcz_store.cc:275] Call kudu.rpc.GenericCalculatorService.Sleep from unix:<unnamed> (request call id 0) took 3001 ms. Trace:
I20260927 10:43:04.563827 1453 rpcz_store.cc:276] 0927 10:43:01.562706 (+ 0us) service_pool.cc:170] Inserting onto call queue
0927 10:43:01.562754 (+ 48us) service_pool.cc:227] Handling call
0927 10:43:04.563691 (+3000937us) inbound_call.cc:173] Queueing success response
Metrics: {}
[ OK ] Parameters/TestRpc.TestCallLongerThanKeepalive/SSL_UnixSocket (3038 ms)
[ RUN ] Parameters/TestRpc.TestRpcSidecar/SSL_UnixSocket
I20260927 10:43:04.576351 1475 acceptor_pool.cc:254] collecting diagnostics on the listening RPC socket unix:/tmp/dist-test-taskRW48rX/test-tmp/rpc-test-38a2744284dc4588a015c694470e0de2.sock every 8 connection(s)
I20260927 10:43:04.576423 1476 acceptor_pool.cc:254] collecting diagnostics on the listening RPC socket unix:/tmp/dist-test-taskRW48rX/test-tmp/rpc-test-38a2744284dc4588a015c694470e0de2.sock every 8 connection(s)
W20260927 10:43:04.636502 1472 connection.cc:196] Error closing socket: Network error: TlsSocket::Close: Broken pipe
[ OK ] Parameters/TestRpc.TestRpcSidecar/SSL_UnixSocket (71 ms)
[ RUN ] Parameters/TestRpc.TestRpcSidecarLimits/SSL_UnixSocket
I20260927 10:43:06.349161 1500 acceptor_pool.cc:254] collecting diagnostics on the listening RPC socket unix:/tmp/dist-test-taskRW48rX/test-tmp/rpc-test-d8c610871fd74382a0599932ecd9019d.sock every 8 connection(s)
I20260927 10:43:06.349191 1501 acceptor_pool.cc:254] collecting diagnostics on the listening RPC socket unix:/tmp/dist-test-taskRW48rX/test-tmp/rpc-test-d8c610871fd74382a0599932ecd9019d.sock every 8 connection(s)
W20260927 10:43:06.354888 1258 serialization.cc:72] Serialized kudu.rpc_test.PushStringsRequestPB (2147483654 bytes) is larger than the maximum configured RPC message size (52428800 bytes). Sending anyway, but peer may reject the data.
W20260927 10:43:06.358551 1497 connection.cc:535] server connection from unix:<unnamed> recv error: Network error: RPC frame had a length of 2147483714, but we only support messages up to 52428800 bytes long.
W20260927 10:43:06.358676 1497 connection.cc:158] shutting down server connection from unix:<unnamed> with pending inbound data: 4/2147483714 bytes received; last active 0 ns ago: status Network error: RPC frame had a length of 2147483714, but we only support messages up to 52428800 bytes long.
W20260927 10:43:06.358918 1513 connection.cc:196] Error closing socket: Network error: TlsSocket::Close: Broken pipe
I20260927 10:43:06.365465 1525 acceptor_pool.cc:254] collecting diagnostics on the listening RPC socket unix:/tmp/dist-test-taskRW48rX/test-tmp/rpc-test-d8c610871fd74382a0599932ecd9019d.sock every 8 connection(s)
I20260927 10:43:06.365465 1526 acceptor_pool.cc:254] collecting diagnostics on the listening RPC socket unix:/tmp/dist-test-taskRW48rX/test-tmp/rpc-test-d8c610871fd74382a0599932ecd9019d.sock every 8 connection(s)
W20260927 10:43:11.366009 1522 connection.cc:577] server connection from unix:<unnamed>: received bad data: 'Corruption: Invalid packet: message had a length of 2147483710, but we only support messages up to 2147483647 bytes
'
W20260927 10:43:11.366361 1538 connection.cc:196] Error closing socket: Network error: TlsSocket::Close: Broken pipe
[ OK ] Parameters/TestRpc.TestRpcSidecarLimits/SSL_UnixSocket (6730 ms)
[ RUN ] Parameters/TestRpc.TestCallTimeoutDoesntAffectNegotiation/SSL_UnixSocket
I20260927 10:43:11.380604 1550 acceptor_pool.cc:254] collecting diagnostics on the listening RPC socket unix:/tmp/dist-test-taskRW48rX/test-tmp/rpc-test-4ed238504c89496ea2fb4d112286c487.sock every 8 connection(s)
I20260927 10:43:11.380681 1551 acceptor_pool.cc:254] collecting diagnostics on the listening RPC socket unix:/tmp/dist-test-taskRW48rX/test-tmp/rpc-test-4ed238504c89496ea2fb4d112286c487.sock every 8 connection(s)
W20260927 10:43:11.401660 1546 negotiation.cc:266] Injecting 500ms delay in negotiation
I20260927 10:43:11.452032 1258 rpc-test-base.h:595] status: Timed out: connection negotiation to unix:/tmp/dist-test-taskRW48rX/test-tmp/rpc-test-4ed238504c89496ea2fb4d112286c487.sock for RPC Sleep timed out after 0.050s (ON_OUTBOUND_QUEUE), seconds elapsed: 0.0508066
[ OK ] Parameters/TestRpc.TestCallTimeoutDoesntAffectNegotiation/SSL_UnixSocket (539 ms)
[ RUN ] Parameters/TestRpc.TestRpcHandlerLatencyMetric/SSL_UnixSocket
I20260927 10:43:11.924638 1575 acceptor_pool.cc:254] collecting diagnostics on the listening RPC socket unix:/tmp/dist-test-taskRW48rX/test-tmp/rpc-test-fdda51ccf6634671a51ce6f3bea7026d.sock every 8 connection(s)
I20260927 10:43:11.924656 1576 acceptor_pool.cc:254] collecting diagnostics on the listening RPC socket unix:/tmp/dist-test-taskRW48rX/test-tmp/rpc-test-fdda51ccf6634671a51ce6f3bea7026d.sock every 8 connection(s)
I20260927 10:43:11.956069 1258 rpc-test.cc:1236] Sleep() min lat: 20407
I20260927 10:43:11.956152 1258 rpc-test.cc:1237] Sleep() mean lat: 20407
I20260927 10:43:11.956187 1258 rpc-test.cc:1238] Sleep() max lat: 20407
I20260927 10:43:11.956199 1258 rpc-test.cc:1239] Sleep() #calls: 1
W20260927 10:43:11.956928 1572 connection.cc:196] Error closing socket: Network error: TlsSocket::Close: Broken pipe
[ OK ] Parameters/TestRpc.TestRpcHandlerLatencyMetric/SSL_UnixSocket (50 ms)
[ RUN ] Parameters/TestRpc.TimedOutOnResponseMetricServiceQueue/SSL_UnixSocket
I20260927 10:43:11.973938 1601 acceptor_pool.cc:254] collecting diagnostics on the listening RPC socket unix:/tmp/dist-test-taskRW48rX/test-tmp/rpc-test-6c1a6535edad4d47b8bccdbbe469a6e9.sock every 8 connection(s)
I20260927 10:43:11.973958 1602 acceptor_pool.cc:254] collecting diagnostics on the listening RPC socket unix:/tmp/dist-test-taskRW48rX/test-tmp/rpc-test-6c1a6535edad4d47b8bccdbbe469a6e9.sock every 8 connection(s)
W20260927 10:43:12.033360 1603 rpcz_store.cc:267] Call kudu.rpc_test.CalculatorService.Sleep from unix:<unnamed> (request call id 2) took 20 ms (client timeout 20 ms). Trace:
W20260927 10:43:12.033456 1603 rpcz_store.cc:269] 0927 10:43:12.012869 (+ 0us) service_pool.cc:170] Inserting onto call queue
0927 10:43:12.033284 (+ 20415us) service_pool.cc:214] Skipping call since client already timed out
0927 10:43:12.033319 (+ 35us) inbound_call.cc:173] Queueing failure response
Metrics: {}
[ OK ] Parameters/TestRpc.TimedOutOnResponseMetricServiceQueue/SSL_UnixSocket (76 ms)
[ RUN ] Parameters/TestRpc.RpcPendingConnectionsMetric/SSL_UnixSocket
I20260927 10:43:12.037606 1624 acceptor_pool.cc:254] collecting diagnostics on the listening RPC socket 0.0.0.0:43355 every 8 connection(s)
I20260927 10:43:12.037652 1625 acceptor_pool.cc:254] collecting diagnostics on the listening RPC socket 0.0.0.0:43355 every 8 connection(s)
W20260927 10:43:12.046175 1620 negotiation.cc:337] Failed RPC negotiation. Trace:
0927 10:43:12.045674 (+ 0us) reactor.cc:625] Submitting negotiation task for server connection from 127.0.0.1:38264 (local address 127.0.0.1:43355)
0927 10:43:12.045795 (+ 121us) server_negotiation.cc:206] Beginning negotiation
0927 10:43:12.045799 (+ 4us) server_negotiation.cc:399] Waiting for connection header
0927 10:43:12.045906 (+ 107us) negotiation.cc:327] Negotiation complete: Network error: Server connection negotiation failed: server connection from 127.0.0.1:38264: BlockingRecv error: recv got EOF from 127.0.0.1:38264 (error 108)
Metrics: {"server-negotiator.queue_time_us":40}
[ OK ] Parameters/TestRpc.RpcPendingConnectionsMetric/SSL_UnixSocket (21 ms)
[ RUN ] Parameters/TestRpc.TestRpcContextClientDeadline/SSL_UnixSocket
I20260927 10:43:12.066301 1640 acceptor_pool.cc:254] collecting diagnostics on the listening RPC socket unix:/tmp/dist-test-taskRW48rX/test-tmp/rpc-test-b497224c3ea04af4b1b68f4583b1e2a1.sock every 8 connection(s)
I20260927 10:43:12.066385 1641 acceptor_pool.cc:254] collecting diagnostics on the listening RPC socket unix:/tmp/dist-test-taskRW48rX/test-tmp/rpc-test-b497224c3ea04af4b1b68f4583b1e2a1.sock every 8 connection(s)
[ OK ] Parameters/TestRpc.TestRpcContextClientDeadline/SSL_UnixSocket (42 ms)
[ RUN ] Parameters/TestRpc.TestApplicationFeatureFlagUnsupportedServer/SSL_UnixSocket
I20260927 10:43:12.115693 1665 acceptor_pool.cc:254] collecting diagnostics on the listening RPC socket unix:/tmp/dist-test-taskRW48rX/test-tmp/rpc-test-9d27c7cdab414237b33cd995316f8026.sock every 8 connection(s)
I20260927 10:43:12.115774 1666 acceptor_pool.cc:254] collecting diagnostics on the listening RPC socket unix:/tmp/dist-test-taskRW48rX/test-tmp/rpc-test-9d27c7cdab414237b33cd995316f8026.sock every 8 connection(s)
[ OK ] Parameters/TestRpc.TestApplicationFeatureFlagUnsupportedServer/SSL_UnixSocket (30 ms)
[ RUN ] Parameters/TestRpc.TestCancellationAsync/SSL_UnixSocket
I20260927 10:43:12.159013 1691 acceptor_pool.cc:254] collecting diagnostics on the listening RPC socket unix:/tmp/dist-test-taskRW48rX/test-tmp/rpc-test-5cbb7e2bf0454cc19fa2177a85b465f8.sock every 8 connection(s)
I20260927 10:43:12.159009 1690 acceptor_pool.cc:254] collecting diagnostics on the listening RPC socket unix:/tmp/dist-test-taskRW48rX/test-tmp/rpc-test-5cbb7e2bf0454cc19fa2177a85b465f8.sock every 8 connection(s)
I20260927 10:43:12.159269 1258 rpc-test.cc:1716] Connecting to unix:/tmp/dist-test-taskRW48rX/test-tmp/rpc-test-5cbb7e2bf0454cc19fa2177a85b465f8.sock
I20260927 10:43:12.181284 1258 test_util.cc:268] Using random seed: -1649011679
I20260927 10:43:12.200312 1693 rpc-test-base.h:240] got call: sleep_micros: 500 pattern: 4294967295 num_repetitions: 2097152 sidecar_idx: 0
I20260927 10:43:12.220227 1694 rpc-test-base.h:240] got call: sleep_micros: 500 pattern: 4294967295 num_repetitions: 2097152 sidecar_idx: 0
I20260927 10:43:12.239102 1693 rpc-test-base.h:240] got call: sleep_micros: 500 pattern: 4294967295 num_repetitions: 2097152 sidecar_idx: 0
I20260927 10:43:12.257966 1694 rpc-test-base.h:240] got call: sleep_micros: 500 pattern: 4294967295 num_repetitions: 2097152 sidecar_idx: 0
I20260927 10:43:12.276558 1693 rpc-test-base.h:240] got call: sleep_micros: 500 pattern: 4294967295 num_repetitions: 2097152 sidecar_idx: 0
I20260927 10:43:12.295384 1694 rpc-test-base.h:240] got call: sleep_micros: 500 pattern: 4294967295 num_repetitions: 2097152 sidecar_idx: 0
I20260927 10:43:12.314934 1693 rpc-test-base.h:240] got call: sleep_micros: 500 pattern: 4294967295 num_repetitions: 2097152 sidecar_idx: 0
I20260927 10:43:12.333983 1694 rpc-test-base.h:240] got call: sleep_micros: 500 pattern: 4294967295 num_repetitions: 2097152 sidecar_idx: 0
W20260927 10:43:12.335844 1687 connection.cc:196] Error closing socket: Network error: TlsSocket::Close: Broken pipe
W20260927 10:43:12.339640 1687 connection.cc:441] server connection from unix:<unnamed> torn down before Call kudu.rpc.GenericCalculatorService.SleepWithSidecar from unix:<unnamed> (request call id 8) could send its response
W20260927 10:43:12.352615 1687 connection.cc:441] server connection from unix:<unnamed> torn down before Call kudu.rpc.GenericCalculatorService.SleepWithSidecar from unix:<unnamed> (request call id 9) could send its response
[ OK ] Parameters/TestRpc.TestCancellationAsync/SSL_UnixSocket (223 ms)
[ RUN ] Parameters/TestRpc.TestPerformanceBySocketType/SSL_UnixSocket
I20260927 10:43:12.377534 1715 acceptor_pool.cc:254] collecting diagnostics on the listening RPC socket unix:/tmp/dist-test-taskRW48rX/test-tmp/rpc-test-ff192be7584d4aa4a79acfe74959ba8f.sock every 8 connection(s)
I20260927 10:43:12.377583 1716 acceptor_pool.cc:254] collecting diagnostics on the listening RPC socket unix:/tmp/dist-test-taskRW48rX/test-tmp/rpc-test-ff192be7584d4aa4a79acfe74959ba8f.sock every 8 connection(s)
I20260927 10:43:12.377810 1258 rpc-test.cc:1846] Connecting to unix:/tmp/dist-test-taskRW48rX/test-tmp/rpc-test-ff192be7584d4aa4a79acfe74959ba8f.sock
I20260927 10:43:14.107012 1258 rpc-test.cc:1859] Sending 1024MB via ssl-enabled unix socket: real 1.722s user 2.039s sys 1.030s
I20260927 10:43:15.827375 1258 rpc-test.cc:1859] Sending 1024MB via ssl-enabled unix socket: real 1.720s user 2.164s sys 0.902s
I20260927 10:43:17.553229 1258 rpc-test.cc:1859] Sending 1024MB via ssl-enabled unix socket: real 1.726s user 2.132s sys 0.941s
I20260927 10:43:19.273862 1258 rpc-test.cc:1859] Sending 1024MB via ssl-enabled unix socket: real 1.721s user 2.091s sys 0.972s
I20260927 10:43:20.974201 1258 rpc-test.cc:1859] Sending 1024MB via ssl-enabled unix socket: real 1.700s user 2.123s sys 0.906s
W20260927 10:43:20.974951 1712 connection.cc:196] Error closing socket: Network error: TlsSocket::Close: Broken pipe
[ OK ] Parameters/TestRpc.TestPerformanceBySocketType/SSL_UnixSocket (8622 ms)
[----------] 20 tests from Parameters/TestRpc (31237 ms total)
[----------] 1 test from Parameters/TestRpcSocketTxRxQueue
[ RUN ] Parameters/TestRpcSocketTxRxQueue.AcceptorRxQueueSizeMetric/0
I20260927 10:43:20.978473 1741 acceptor_pool.cc:254] collecting diagnostics on the listening RPC socket 0.0.0.0:41973 every 1 connection(s)
I20260927 10:43:20.978469 1740 acceptor_pool.cc:254] collecting diagnostics on the listening RPC socket 0.0.0.0:41973 every 1 connection(s)
W20260927 10:43:20.979211 1736 negotiation.cc:337] Failed RPC negotiation. Trace:
0927 10:43:20.978988 (+ 0us) reactor.cc:625] Submitting negotiation task for server connection from 127.0.0.1:49118 (local address 127.0.0.1:41973)
0927 10:43:20.979071 (+ 83us) server_negotiation.cc:206] Beginning negotiation
0927 10:43:20.979075 (+ 4us) server_negotiation.cc:399] Waiting for connection header
0927 10:43:20.979146 (+ 71us) negotiation.cc:327] Negotiation complete: Network error: Server connection negotiation failed: server connection from 127.0.0.1:49118: BlockingRecv error: recv got EOF from 127.0.0.1:49118 (error 108)
Metrics: {"server-negotiator.queue_time_us":22}
[ OK ] Parameters/TestRpcSocketTxRxQueue.AcceptorRxQueueSizeMetric/0 (4 ms)
[----------] 1 test from Parameters/TestRpcSocketTxRxQueue (4 ms total)
[----------] Global test environment tear-down
[==========] 21 tests from 2 test suites ran. (31242 ms total)
[ PASSED ] 20 tests.
[ FAILED ] 1 test, listed below:
[ FAILED ] Parameters/TestRpc.TestCallWithChainCertAndChainCA/SSL_UnixSocket, where GetParam() = (true, true)
1 FAILED TEST