Diagnosed failure

Parameters/TestRpc.TestCallWithChainCertAndChainCA/SSL_TCP: /data0/somelongdirectorytoavoidrpathissues/src/kudu/src/kudu/rpc/rpc-test.cc:270: Failure
Failed
Bad status: Runtime error: could not verify certificate chain (error with cert: subject=CN = localhost, ST = sadfjas, C = AS, emailAddress = sdflkdsajf, O = lskdfjlsad, OU = sldfkja, issuer=C = AS, ST = ASDfkjdhf, L = lskdjf, O = saldfja, OU = skdjf, CN = localhost, emailAddress = sadjflkadsj): : certificate has expired
Google Test trace:
/data0/somelongdirectorytoavoidrpathissues/src/kudu/src/kudu/rpc/rpc-test.cc:267: Connecting to 0.0.0.0:43933
I20260924 07:11:41.097334 22297 test_util.cc:175] -----------------------------------------------
I20260924 07:11:41.097393 22297 test_util.cc:176] Had fatal failures, leaving test files at /tmp/dist-test-tasknq2Jxz/test-tmp/rpc-test.5.Parameters_TestRpc.TestCallWithChainCertAndChainCA_SSL_TCP.1790233901045425-22297-0

Full log

Note: This is test shard 6 of 8.
[==========] Running 21 tests from 2 test suites.
[----------] Global test environment set-up.
[----------] 20 tests from Parameters/TestRpc
[ RUN      ] Parameters/TestRpc.TestMessengerCreateDestroy/SSL_TCP
WARNING: Logging before InitGoogleLogging() is written to STDERR
I20260924 07:11:41.065068 22297 rpc-test.cc:169] started messenger TestCreateDestroy
[       OK ] Parameters/TestRpc.TestMessengerCreateDestroy/SSL_TCP (18 ms)
[ RUN      ] Parameters/TestRpc.TestNegotiationDeadlock/SSL_TCP
I20260924 07:11:41.074107 22317 acceptor_pool.cc:254] collecting diagnostics on the listening RPC socket 0.0.0.0:38275 every 8 connection(s)
I20260924 07:11:41.074120 22318 acceptor_pool.cc:254] collecting diagnostics on the listening RPC socket 0.0.0.0:38275 every 8 connection(s)
[       OK ] Parameters/TestRpc.TestNegotiationDeadlock/SSL_TCP (14 ms)
[ RUN      ] Parameters/TestRpc.TestCallWithChainCertAndChainCA/SSL_TCP
I20260924 07:11:41.093616 22333 acceptor_pool.cc:254] collecting diagnostics on the listening RPC socket 0.0.0.0:43933 every 8 connection(s)
I20260924 07:11:41.093616 22334 acceptor_pool.cc:254] collecting diagnostics on the listening RPC socket 0.0.0.0:43933 every 8 connection(s)
/data0/somelongdirectorytoavoidrpathissues/src/kudu/src/kudu/rpc/rpc-test.cc:270: Failure
Failed
Bad status: Runtime error: could not verify certificate chain (error with cert: subject=CN = localhost, ST = sadfjas, C = AS, emailAddress = sdflkdsajf, O = lskdfjlsad, OU = sldfkja, issuer=C = AS, ST = ASDfkjdhf, L = lskdjf, O = saldfja, OU = skdjf, CN = localhost, emailAddress = sadjflkadsj): : certificate has expired
Google Test trace:
/data0/somelongdirectorytoavoidrpathissues/src/kudu/src/kudu/rpc/rpc-test.cc:267: Connecting to 0.0.0.0:43933
I20260924 07:11:41.097334 22297 test_util.cc:175] -----------------------------------------------
I20260924 07:11:41.097393 22297 test_util.cc:176] Had fatal failures, leaving test files at /tmp/dist-test-tasknq2Jxz/test-tmp/rpc-test.5.Parameters_TestRpc.TestCallWithChainCertAndChainCA_SSL_TCP.1790233901045425-22297-0
[  FAILED  ] Parameters/TestRpc.TestCallWithChainCertAndChainCA/SSL_TCP, where GetParam() = (true, false) (16 ms)
[ RUN      ] Parameters/TestRpc.TestCallWithPasswordProtectedKey/SSL_TCP
I20260924 07:11:41.116094 22359 acceptor_pool.cc:254] collecting diagnostics on the listening RPC socket 0.0.0.0:38327 every 8 connection(s)
I20260924 07:11:41.116094 22358 acceptor_pool.cc:254] collecting diagnostics on the listening RPC socket 0.0.0.0:38327 every 8 connection(s)
[       OK ] Parameters/TestRpc.TestCallWithPasswordProtectedKey/SSL_TCP (30 ms)
[ RUN      ] Parameters/TestRpc.TestCallToBadServer/SSL_TCP
I20260924 07:11:41.169895 22297 rpc-test.cc:394] Status: Network error: Client connection negotiation failed: client connection to 0.0.0.0:0: connect: Connection refused (error 111)
I20260924 07:11:41.170213 22297 rpc-test.cc:394] Status: Network error: Client connection negotiation failed: client connection to 0.0.0.0:0: connect: Connection refused (error 111)
I20260924 07:11:41.170454 22297 rpc-test.cc:394] Status: Network error: Client connection negotiation failed: client connection to 0.0.0.0:0: connect: Connection refused (error 111)
I20260924 07:11:41.170675 22297 rpc-test.cc:394] Status: Network error: Client connection negotiation failed: client connection to 0.0.0.0:0: connect: Connection refused (error 111)
I20260924 07:11:41.170872 22297 rpc-test.cc:394] Status: Network error: Client connection negotiation failed: client connection to 0.0.0.0:0: connect: Connection refused (error 111)
[       OK ] Parameters/TestRpc.TestCallToBadServer/SSL_TCP (43 ms)
[ RUN      ] Parameters/TestRpc.TestWrongService/SSL_TCP
I20260924 07:11:41.181327 22394 acceptor_pool.cc:254] collecting diagnostics on the listening RPC socket 0.0.0.0:41197 every 8 connection(s)
I20260924 07:11:41.181327 22393 acceptor_pool.cc:254] collecting diagnostics on the listening RPC socket 0.0.0.0:41197 every 8 connection(s)
I20260924 07:11:41.196231 22392 messenger.cc:345] service WrongServiceName not registered on TestServer
[       OK ] Parameters/TestRpc.TestWrongService/SSL_TCP (26 ms)
[ RUN      ] Parameters/TestRpc.TestConnectionKeepalive/SSL_TCP
I20260924 07:11:41.221076 22416 acceptor_pool.cc:254] collecting diagnostics on the listening RPC socket 0.0.0.0:41299 every 8 connection(s)
I20260924 07:11:41.221136 22417 acceptor_pool.cc:254] collecting diagnostics on the listening RPC socket 0.0.0.0:41299 every 8 connection(s)
I20260924 07:11:41.221235 22297 rpc-test.cc:488] Connecting to 0.0.0.0:41299
[       OK ] Parameters/TestRpc.TestConnectionKeepalive/SSL_TCP (1056 ms)
[ RUN      ] Parameters/TestRpc.TestClientConnectionMetrics/SSL_TCP
I20260924 07:11:42.265239 22441 acceptor_pool.cc:254] collecting diagnostics on the listening RPC socket 0.0.0.0:42913 every 8 connection(s)
I20260924 07:11:42.265261 22442 acceptor_pool.cc:254] collecting diagnostics on the listening RPC socket 0.0.0.0:42913 every 8 connection(s)
I20260924 07:11:42.265450 22297 rpc-test.cc:569] Connecting to 0.0.0.0:42913
[       OK ] Parameters/TestRpc.TestClientConnectionMetrics/SSL_TCP (8363 ms)
[ RUN      ] Parameters/TestRpc.TestCredentialsPolicy/SSL_TCP
I20260924 07:11:50.645645 22464 acceptor_pool.cc:254] collecting diagnostics on the listening RPC socket 0.0.0.0:39623 every 8 connection(s)
I20260924 07:11:50.645695 22465 acceptor_pool.cc:254] collecting diagnostics on the listening RPC socket 0.0.0.0:39623 every 8 connection(s)
I20260924 07:11:50.645787 22297 rpc-test.cc:700] Connecting to 0.0.0.0:39623
[       OK ] Parameters/TestRpc.TestCredentialsPolicy/SSL_TCP (60 ms)
[ RUN      ] Parameters/TestRpc.TestCallLongerThanKeepalive/SSL_TCP
I20260924 07:11:50.698084 22489 acceptor_pool.cc:254] collecting diagnostics on the listening RPC socket 0.0.0.0:40207 every 8 connection(s)
I20260924 07:11:50.698120 22490 acceptor_pool.cc:254] collecting diagnostics on the listening RPC socket 0.0.0.0:40207 every 8 connection(s)
I20260924 07:11:50.718863 22493 rpc-test-base.h:222] got call: sleep_micros: 3000000 deferred: true
I20260924 07:11:53.719528 22493 rpcz_store.cc:275] Call kudu.rpc.GenericCalculatorService.Sleep from 127.0.0.1:35986 (request call id 0) took 3000 ms. Trace:
I20260924 07:11:53.719631 22493 rpcz_store.cc:276] 0924 07:11:50.718810 (+     0us) service_pool.cc:170] Inserting onto call queue
0924 07:11:50.718838 (+    28us) service_pool.cc:227] Handling call
0924 07:11:53.719512 (+3000674us) inbound_call.cc:173] Queueing success response
Metrics: {}
[       OK ] Parameters/TestRpc.TestCallLongerThanKeepalive/SSL_TCP (3042 ms)
[ RUN      ] Parameters/TestRpc.TestRpcSidecar/SSL_TCP
I20260924 07:11:53.744402 22514 acceptor_pool.cc:254] collecting diagnostics on the listening RPC socket 0.0.0.0:33713 every 8 connection(s)
I20260924 07:11:53.744436 22515 acceptor_pool.cc:254] collecting diagnostics on the listening RPC socket 0.0.0.0:33713 every 8 connection(s)
[       OK ] Parameters/TestRpc.TestRpcSidecar/SSL_TCP (68 ms)
[ RUN      ] Parameters/TestRpc.TestRpcSidecarLimits/SSL_TCP
I20260924 07:11:55.399468 22539 acceptor_pool.cc:254] collecting diagnostics on the listening RPC socket 0.0.0.0:41799 every 8 connection(s)
I20260924 07:11:55.399511 22540 acceptor_pool.cc:254] collecting diagnostics on the listening RPC socket 0.0.0.0:41799 every 8 connection(s)
W20260924 07:11:55.411381 22297 serialization.cc:72] Serialized kudu.rpc_test.PushStringsRequestPB (2147483654 bytes) is larger than the maximum configured RPC message size (52428800 bytes). Sending anyway, but peer may reject the data.
W20260924 07:11:55.414547 22537 connection.cc:535] server connection from 127.0.0.1:42694 recv error: Network error: RPC frame had a length of 2147483714, but we only support messages up to 52428800 bytes long.
W20260924 07:11:55.414608 22537 connection.cc:158] shutting down server connection from 127.0.0.1:42694 with pending inbound data: 4/2147483714 bytes received; last active 0 ns ago: status Network error: RPC frame had a length of 2147483714, but we only support messages up to 52428800 bytes long.
W20260924 07:11:55.414803 22552 connection.cc:196] Error closing socket: Network error: TlsSocket::Close: Connection reset by peer
I20260924 07:11:55.433544 22565 acceptor_pool.cc:254] collecting diagnostics on the listening RPC socket 0.0.0.0:39923 every 8 connection(s)
I20260924 07:11:55.433617 22564 acceptor_pool.cc:254] collecting diagnostics on the listening RPC socket 0.0.0.0:39923 every 8 connection(s)
W20260924 07:11:59.010865 22563 connection.cc:577] server connection from 127.0.0.1:34852: received bad data: 'Corruption: Invalid packet: message had a length of 2147483710, but we only support messages up to 2147483647 bytes
'
[       OK ] Parameters/TestRpc.TestRpcSidecarLimits/SSL_TCP (5223 ms)
[ RUN      ] Parameters/TestRpc.TestCallTimeoutDoesntAffectNegotiation/SSL_TCP
I20260924 07:11:59.036239 22589 acceptor_pool.cc:254] collecting diagnostics on the listening RPC socket 0.0.0.0:41701 every 8 connection(s)
I20260924 07:11:59.036257 22590 acceptor_pool.cc:254] collecting diagnostics on the listening RPC socket 0.0.0.0:41701 every 8 connection(s)
W20260924 07:11:59.044014 22585 negotiation.cc:266] Injecting 500ms delay in negotiation
I20260924 07:11:59.094264 22297 rpc-test-base.h:595] status: Timed out: connection negotiation to 0.0.0.0:41701 for RPC Sleep timed out after 0.050s (ON_OUTBOUND_QUEUE), seconds elapsed: 0.0505521
[       OK ] Parameters/TestRpc.TestCallTimeoutDoesntAffectNegotiation/SSL_TCP (535 ms)
[ RUN      ] Parameters/TestRpc.TestRpcHandlerLatencyMetric/SSL_TCP
I20260924 07:11:59.580121 22615 acceptor_pool.cc:254] collecting diagnostics on the listening RPC socket 0.0.0.0:33755 every 8 connection(s)
I20260924 07:11:59.580090 22614 acceptor_pool.cc:254] collecting diagnostics on the listening RPC socket 0.0.0.0:33755 every 8 connection(s)
I20260924 07:11:59.621625 22297 rpc-test.cc:1236] Sleep() min lat: 20334
I20260924 07:11:59.621696 22297 rpc-test.cc:1237] Sleep() mean lat: 20334
I20260924 07:11:59.621719 22297 rpc-test.cc:1238] Sleep() max lat: 20334
I20260924 07:11:59.621731 22297 rpc-test.cc:1239] Sleep() #calls: 1
[       OK ] Parameters/TestRpc.TestRpcHandlerLatencyMetric/SSL_TCP (74 ms)
[ RUN      ] Parameters/TestRpc.TimedOutOnResponseMetricServiceQueue/SSL_TCP
I20260924 07:11:59.634644 22640 acceptor_pool.cc:254] collecting diagnostics on the listening RPC socket 0.0.0.0:45769 every 8 connection(s)
I20260924 07:11:59.634675 22641 acceptor_pool.cc:254] collecting diagnostics on the listening RPC socket 0.0.0.0:45769 every 8 connection(s)
W20260924 07:11:59.687553 22642 rpcz_store.cc:267] Call kudu.rpc_test.CalculatorService.Sleep from 127.0.0.1:34804 (request call id 2) took 20 ms (client timeout 20 ms). Trace:
W20260924 07:11:59.687672 22642 rpcz_store.cc:269] 0924 07:11:59.667302 (+     0us) service_pool.cc:170] Inserting onto call queue
0924 07:11:59.687526 (+ 20224us) service_pool.cc:214] Skipping call since client already timed out
0924 07:11:59.687538 (+    12us) inbound_call.cc:173] Queueing failure response
Metrics: {}
[       OK ] Parameters/TestRpc.TimedOutOnResponseMetricServiceQueue/SSL_TCP (65 ms)
[ RUN      ] Parameters/TestRpc.RpcPendingConnectionsMetric/SSL_TCP
I20260924 07:11:59.690824 22664 acceptor_pool.cc:254] collecting diagnostics on the listening RPC socket 0.0.0.0:37893 every 8 connection(s)
W20260924 07:11:59.691473 22659 negotiation.cc:337] Failed RPC negotiation. Trace:
0924 07:11:59.691288 (+     0us) reactor.cc:625] Submitting negotiation task for server connection from 127.0.0.1:39894 (local address 127.0.0.1:37893)
0924 07:11:59.691333 (+    45us) server_negotiation.cc:206] Beginning negotiation
0924 07:11:59.691335 (+     2us) server_negotiation.cc:399] Waiting for connection header
0924 07:11:59.691402 (+    67us) negotiation.cc:327] Negotiation complete: Network error: Server connection negotiation failed: server connection from 127.0.0.1:39894: BlockingRecv error: recv got EOF from 127.0.0.1:39894 (error 108)
Metrics: {"server-negotiator.queue_time_us":16}
I20260924 07:11:59.691846 22663 acceptor_pool.cc:254] collecting diagnostics on the listening RPC socket 0.0.0.0:37893 every 8 connection(s)
[       OK ] Parameters/TestRpc.RpcPendingConnectionsMetric/SSL_TCP (13 ms)
[ RUN      ] Parameters/TestRpc.TestRpcContextClientDeadline/SSL_TCP
I20260924 07:11:59.711040 22679 acceptor_pool.cc:254] collecting diagnostics on the listening RPC socket 0.0.0.0:44061 every 8 connection(s)
I20260924 07:11:59.711073 22680 acceptor_pool.cc:254] collecting diagnostics on the listening RPC socket 0.0.0.0:44061 every 8 connection(s)
[       OK ] Parameters/TestRpc.TestRpcContextClientDeadline/SSL_TCP (55 ms)
[ RUN      ] Parameters/TestRpc.TestApplicationFeatureFlagUnsupportedServer/SSL_TCP
I20260924 07:11:59.768399 22705 acceptor_pool.cc:254] collecting diagnostics on the listening RPC socket 0.0.0.0:44617 every 8 connection(s)
I20260924 07:11:59.768366 22704 acceptor_pool.cc:254] collecting diagnostics on the listening RPC socket 0.0.0.0:44617 every 8 connection(s)
[       OK ] Parameters/TestRpc.TestApplicationFeatureFlagUnsupportedServer/SSL_TCP (21 ms)
[ RUN      ] Parameters/TestRpc.TestCancellationAsync/SSL_TCP
I20260924 07:11:59.786388 22730 acceptor_pool.cc:254] collecting diagnostics on the listening RPC socket 0.0.0.0:38517 every 8 connection(s)
I20260924 07:11:59.786517 22297 rpc-test.cc:1716] Connecting to 0.0.0.0:38517
I20260924 07:11:59.786388 22729 acceptor_pool.cc:254] collecting diagnostics on the listening RPC socket 0.0.0.0:38517 every 8 connection(s)
I20260924 07:11:59.798189 22297 test_util.cc:268] Using random seed: 1356512170
I20260924 07:11:59.813422 22733 rpc-test-base.h:240] got call: sleep_micros: 500 pattern: 4294967295 num_repetitions: 2097152 sidecar_idx: 0
I20260924 07:11:59.825364 22733 rpc-test-base.h:240] got call: sleep_micros: 500 pattern: 4294967295 num_repetitions: 2097152 sidecar_idx: 0
I20260924 07:11:59.839643 22733 rpc-test-base.h:240] got call: sleep_micros: 500 pattern: 4294967295 num_repetitions: 2097152 sidecar_idx: 0
I20260924 07:11:59.853251 22733 rpc-test-base.h:240] got call: sleep_micros: 500 pattern: 4294967295 num_repetitions: 2097152 sidecar_idx: 0
I20260924 07:11:59.866801 22733 rpc-test-base.h:240] got call: sleep_micros: 500 pattern: 4294967295 num_repetitions: 2097152 sidecar_idx: 0
I20260924 07:11:59.880287 22733 rpc-test-base.h:240] got call: sleep_micros: 500 pattern: 4294967295 num_repetitions: 2097152 sidecar_idx: 0
I20260924 07:11:59.893326 22733 rpc-test-base.h:240] got call: sleep_micros: 500 pattern: 4294967295 num_repetitions: 2097152 sidecar_idx: 0
I20260924 07:11:59.906666 22733 rpc-test-base.h:240] got call: sleep_micros: 500 pattern: 4294967295 num_repetitions: 2097152 sidecar_idx: 0
W20260924 07:11:59.909889 22726 connection.cc:441] server connection from 127.0.0.1:39324 torn down before Call kudu.rpc.GenericCalculatorService.SleepWithSidecar from 127.0.0.1:39324 (request call id 9) could send its response
[       OK ] Parameters/TestRpc.TestCancellationAsync/SSL_TCP (131 ms)
[ RUN      ] Parameters/TestRpc.TestPerformanceBySocketType/SSL_TCP
I20260924 07:11:59.922855 22754 acceptor_pool.cc:254] collecting diagnostics on the listening RPC socket 0.0.0.0:39105 every 8 connection(s)
I20260924 07:11:59.922881 22755 acceptor_pool.cc:254] collecting diagnostics on the listening RPC socket 0.0.0.0:39105 every 8 connection(s)
I20260924 07:11:59.922993 22297 rpc-test.cc:1846] Connecting to 0.0.0.0:39105
I20260924 07:12:01.498598 22297 rpc-test.cc:1859] Sending 1024MB via ssl-enabled tcp socket: real 1.570s	user 1.506s	sys 1.265s
I20260924 07:12:03.086750 22297 rpc-test.cc:1859] Sending 1024MB via ssl-enabled tcp socket: real 1.588s	user 1.518s	sys 1.278s
I20260924 07:12:04.590855 22297 rpc-test.cc:1859] Sending 1024MB via ssl-enabled tcp socket: real 1.504s	user 1.502s	sys 1.163s
I20260924 07:12:06.170218 22297 rpc-test.cc:1859] Sending 1024MB via ssl-enabled tcp socket: real 1.579s	user 1.563s	sys 1.248s
I20260924 07:12:07.640120 22297 rpc-test.cc:1859] Sending 1024MB via ssl-enabled tcp socket: real 1.470s	user 1.371s	sys 1.235s
[       OK ] Parameters/TestRpc.TestPerformanceBySocketType/SSL_TCP (7730 ms)
[----------] 20 tests from Parameters/TestRpc (26593 ms total)

[----------] 1 test from Parameters/TestRpcSocketTxRxQueue
[ RUN      ] Parameters/TestRpcSocketTxRxQueue.OverCapacity/0
W20260924 07:12:07.905100 22771 negotiation.cc:337] Failed RPC negotiation. Trace:
0924 07:12:07.643018 (+     0us) reactor.cc:625] Submitting negotiation task for client connection to 0.0.0.0:41247 (local address 127.0.0.1:33718)
0924 07:12:07.643059 (+    41us) negotiation.cc:107] Waiting for socket to connect
0924 07:12:07.643069 (+    10us) client_negotiation.cc:174] Beginning negotiation
0924 07:12:07.643114 (+    45us) client_negotiation.cc:252] Sending NEGOTIATE NegotiatePB request
0924 07:12:07.904972 (+261858us) negotiation.cc:327] Negotiation complete: Network error: Client connection negotiation failed: client connection to 0.0.0.0:41247: BlockingRecv error: recv error from unknown peer: Transport endpoint is not connected (error 107)
Metrics: {"client-negotiator.queue_time_us":16}
W20260924 07:12:07.905121 22780 negotiation.cc:337] Failed RPC negotiation. Trace:
0924 07:12:07.643878 (+     0us) reactor.cc:625] Submitting negotiation task for client connection to 0.0.0.0:41247 (local address 127.0.0.1:33728)
0924 07:12:07.644125 (+   247us) negotiation.cc:107] Waiting for socket to connect
0924 07:12:07.644135 (+    10us) client_negotiation.cc:174] Beginning negotiation
0924 07:12:07.644187 (+    52us) client_negotiation.cc:252] Sending NEGOTIATE NegotiatePB request
0924 07:12:07.905023 (+260836us) negotiation.cc:327] Negotiation complete: Network error: Client connection negotiation failed: client connection to 0.0.0.0:41247: BlockingRecv error: recv error from unknown peer: Transport endpoint is not connected (error 107)
Metrics: {"client-negotiator.queue_time_us":217}
W20260924 07:12:07.905278 22807 negotiation.cc:337] Failed RPC negotiation. Trace:
0924 07:12:07.646306 (+     0us) reactor.cc:625] Submitting negotiation task for client connection to 0.0.0.0:41247 (local address 127.0.0.1:33768)
0924 07:12:07.646362 (+    56us) negotiation.cc:107] Waiting for socket to connect
0924 07:12:07.646371 (+     9us) client_negotiation.cc:174] Beginning negotiation
0924 07:12:07.646411 (+    40us) client_negotiation.cc:252] Sending NEGOTIATE NegotiatePB request
0924 07:12:07.905251 (+258840us) negotiation.cc:327] Negotiation complete: Network error: Client connection negotiation failed: client connection to 0.0.0.0:41247: BlockingRecv error: recv error from unknown peer: Transport endpoint is not connected (error 107)
Metrics: {"client-negotiator.queue_time_us":35}
W20260924 07:12:07.905349 22798 negotiation.cc:337] Failed RPC negotiation. Trace:
0924 07:12:07.645507 (+     0us) reactor.cc:625] Submitting negotiation task for client connection to 0.0.0.0:41247 (local address 127.0.0.1:33752)
0924 07:12:07.645757 (+   250us) negotiation.cc:107] Waiting for socket to connect
0924 07:12:07.645767 (+    10us) client_negotiation.cc:174] Beginning negotiation
0924 07:12:07.645814 (+    47us) client_negotiation.cc:252] Sending NEGOTIATE NegotiatePB request
0924 07:12:07.905154 (+259340us) negotiation.cc:327] Negotiation complete: Network error: Client connection negotiation failed: client connection to 0.0.0.0:41247: BlockingRecv error: recv error from unknown peer: Transport endpoint is not connected (error 107)
Metrics: {"client-negotiator.queue_time_us":224}
W20260924 07:12:07.905409 22789 negotiation.cc:337] Failed RPC negotiation. Trace:
0924 07:12:07.644681 (+     0us) reactor.cc:625] Submitting negotiation task for client connection to 0.0.0.0:41247 (local address 127.0.0.1:33736)
0924 07:12:07.644933 (+   252us) negotiation.cc:107] Waiting for socket to connect
0924 07:12:07.644944 (+    11us) client_negotiation.cc:174] Beginning negotiation
0924 07:12:07.644991 (+    47us) client_negotiation.cc:252] Sending NEGOTIATE NegotiatePB request
0924 07:12:07.905023 (+260032us) negotiation.cc:327] Negotiation complete: Network error: Client connection negotiation failed: client connection to 0.0.0.0:41247: BlockingRecv error: recv error from unknown peer: Transport endpoint is not connected (error 107)
Metrics: {"client-negotiator.queue_time_us":225}
W20260924 07:12:07.905121 22816 negotiation.cc:337] Failed RPC negotiation. Trace:
0924 07:12:07.647102 (+     0us) reactor.cc:625] Submitting negotiation task for client connection to 0.0.0.0:41247 (local address 127.0.0.1:33774)
0924 07:12:07.647135 (+    33us) negotiation.cc:107] Waiting for socket to connect
0924 07:12:07.647142 (+     7us) client_negotiation.cc:174] Beginning negotiation
0924 07:12:07.647176 (+    34us) client_negotiation.cc:252] Sending NEGOTIATE NegotiatePB request
0924 07:12:07.905066 (+257890us) negotiation.cc:327] Negotiation complete: Network error: Client connection negotiation failed: client connection to 0.0.0.0:41247: BlockingRecv error: recv error from unknown peer: Transport endpoint is not connected (error 107)
Metrics: {"client-negotiator.queue_time_us":16}
[       OK ] Parameters/TestRpcSocketTxRxQueue.OverCapacity/0 (1030 ms)
[----------] 1 test from Parameters/TestRpcSocketTxRxQueue (1030 ms total)

[----------] Global test environment tear-down
[==========] 21 tests from 2 test suites ran. (27624 ms total)
[  PASSED  ] 20 tests.
[  FAILED  ] 1 test, listed below:
[  FAILED  ] Parameters/TestRpc.TestCallWithChainCertAndChainCA/SSL_TCP, where GetParam() = (true, false)

 1 FAILED TEST