Diagnosed failure

Parameters/TestRpc.TestCallWithChainCertAndRootCA/SSL_UnixSocket: /data0/somelongdirectorytoavoidrpathissues/src/kudu/src/kudu/rpc/rpc-test.cc:303: Failure
Failed
Bad status: Runtime error: could not verify certificate chain (error with cert: subject=CN = localhost, ST = sadfjas, C = AS, emailAddress = sdflkdsajf, O = lskdfjlsad, OU = sldfkja, issuer=C = AS, ST = ASDfkjdhf, L = lskdjf, O = saldfja, OU = skdjf, CN = localhost, emailAddress = sadjflkadsj): : certificate has expired
Google Test trace:
/data0/somelongdirectorytoavoidrpathissues/src/kudu/src/kudu/rpc/rpc-test.cc:300: Connecting to unix:/tmp/dist-test-task8lCG2A/test-tmp/rpc-test-f8ef5d1393c24525a96f785600cdd6d3.sock
I20260924 14:28:08.360654 21083 test_util.cc:175] -----------------------------------------------
I20260924 14:28:08.360828 21083 test_util.cc:176] Had fatal failures, leaving test files at /tmp/dist-test-task8lCG2A/test-tmp/rpc-test.2.Parameters_TestRpc.TestCallWithChainCertAndRootCA_SSL_UnixSocket.1790260084721116-21083-0

Full log

Note: This is test shard 3 of 8.
[==========] Running 21 tests from 2 test suites.
[----------] Global test environment set-up.
[----------] 1 test from TestRpc
[ RUN      ] TestRpc.TestNegotiationTimeout
WARNING: Logging before InitGoogleLogging() is written to STDERR
I20260924 14:28:04.911976 21083 rpc-test-base.h:595] status: Timed out: connection negotiation to 0.0.0.0:33967 for RPC Sleep timed out after 0.100s (ON_OUTBOUND_QUEUE), seconds elapsed: 0.101763
W20260924 14:28:07.999519 21093 negotiation.cc:337] Failed RPC negotiation. Trace:
0924 14:28:04.811069 (+     0us) reactor.cc:625] Submitting negotiation task for client connection to 0.0.0.0:33967 (local address 127.0.0.1:41132)
0924 14:28:04.811888 (+   819us) negotiation.cc:107] Waiting for socket to connect
0924 14:28:04.811934 (+    46us) client_negotiation.cc:174] Beginning negotiation
0924 14:28:04.824197 (+ 12263us) client_negotiation.cc:252] Sending NEGOTIATE NegotiatePB request
0924 14:28:07.998394 (+3174197us) negotiation.cc:327] Negotiation complete: Timed out: Client connection negotiation failed: client connection to 0.0.0.0:33967: received 0 of 4 requested bytes
Metrics: {"client-negotiator.queue_time_us":232}
[       OK ] TestRpc.TestNegotiationTimeout (3230 ms)
[----------] 1 test from TestRpc (3230 ms total)

[----------] 20 tests from Parameters/TestRpc
[ RUN      ] Parameters/TestRpc.TestAcceptorPoolStartStop/SSL_UnixSocket
I20260924 14:28:08.032065 21109 acceptor_pool.cc:254] collecting diagnostics on the listening RPC socket unix:/tmp/dist-test-task8lCG2A/test-tmp/rpc-test-16242e97aaf64c159169ee4ea7859a41.sock every 8 connection(s)
I20260924 14:28:08.033778 21110 acceptor_pool.cc:254] collecting diagnostics on the listening RPC socket unix:/tmp/dist-test-task8lCG2A/test-tmp/rpc-test-16242e97aaf64c159169ee4ea7859a41.sock every 8 connection(s)
I20260924 14:28:08.094517 21120 acceptor_pool.cc:254] collecting diagnostics on the listening RPC socket unix:/tmp/dist-test-task8lCG2A/test-tmp/rpc-test-16242e97aaf64c159169ee4ea7859a41.sock every 8 connection(s)
I20260924 14:28:08.095996 21121 acceptor_pool.cc:254] collecting diagnostics on the listening RPC socket unix:/tmp/dist-test-task8lCG2A/test-tmp/rpc-test-16242e97aaf64c159169ee4ea7859a41.sock every 8 connection(s)
I20260924 14:28:08.112860 21131 acceptor_pool.cc:254] collecting diagnostics on the listening RPC socket unix:/tmp/dist-test-task8lCG2A/test-tmp/rpc-test-16242e97aaf64c159169ee4ea7859a41.sock every 8 connection(s)
I20260924 14:28:08.113612 21132 acceptor_pool.cc:254] collecting diagnostics on the listening RPC socket unix:/tmp/dist-test-task8lCG2A/test-tmp/rpc-test-16242e97aaf64c159169ee4ea7859a41.sock every 8 connection(s)
I20260924 14:28:08.144146 21142 acceptor_pool.cc:254] collecting diagnostics on the listening RPC socket unix:/tmp/dist-test-task8lCG2A/test-tmp/rpc-test-16242e97aaf64c159169ee4ea7859a41.sock every 8 connection(s)
I20260924 14:28:08.144903 21143 acceptor_pool.cc:254] collecting diagnostics on the listening RPC socket unix:/tmp/dist-test-task8lCG2A/test-tmp/rpc-test-16242e97aaf64c159169ee4ea7859a41.sock every 8 connection(s)
I20260924 14:28:08.179807 21153 acceptor_pool.cc:254] collecting diagnostics on the listening RPC socket unix:/tmp/dist-test-task8lCG2A/test-tmp/rpc-test-16242e97aaf64c159169ee4ea7859a41.sock every 8 connection(s)
I20260924 14:28:08.180460 21154 acceptor_pool.cc:254] collecting diagnostics on the listening RPC socket unix:/tmp/dist-test-task8lCG2A/test-tmp/rpc-test-16242e97aaf64c159169ee4ea7859a41.sock every 8 connection(s)
[       OK ] Parameters/TestRpc.TestAcceptorPoolStartStop/SSL_UnixSocket (180 ms)
[ RUN      ] Parameters/TestRpc.TestCall/SSL_UnixSocket
I20260924 14:28:08.214915 21166 acceptor_pool.cc:254] collecting diagnostics on the listening RPC socket unix:/tmp/dist-test-task8lCG2A/test-tmp/rpc-test-266f49fa1f524186ace51baf9d775365.sock every 8 connection(s)
I20260924 14:28:08.217007 21167 acceptor_pool.cc:254] collecting diagnostics on the listening RPC socket unix:/tmp/dist-test-task8lCG2A/test-tmp/rpc-test-266f49fa1f524186ace51baf9d775365.sock every 8 connection(s)
I20260924 14:28:08.221668 21083 rpc-test.cc:234] Connecting to unix:/tmp/dist-test-task8lCG2A/test-tmp/rpc-test-266f49fa1f524186ace51baf9d775365.sock
W20260924 14:28:08.292133 21163 connection.cc:196] Error closing socket: Network error: TlsSocket::Close: Broken pipe
[       OK ] Parameters/TestRpc.TestCall/SSL_UnixSocket (112 ms)
[ RUN      ] Parameters/TestRpc.TestCallWithChainCertAndRootCA/SSL_UnixSocket
I20260924 14:28:08.340406 21191 acceptor_pool.cc:254] collecting diagnostics on the listening RPC socket unix:/tmp/dist-test-task8lCG2A/test-tmp/rpc-test-f8ef5d1393c24525a96f785600cdd6d3.sock every 8 connection(s)
I20260924 14:28:08.341151 21192 acceptor_pool.cc:254] collecting diagnostics on the listening RPC socket unix:/tmp/dist-test-task8lCG2A/test-tmp/rpc-test-f8ef5d1393c24525a96f785600cdd6d3.sock every 8 connection(s)
/data0/somelongdirectorytoavoidrpathissues/src/kudu/src/kudu/rpc/rpc-test.cc:303: Failure
Failed
Bad status: Runtime error: could not verify certificate chain (error with cert: subject=CN = localhost, ST = sadfjas, C = AS, emailAddress = sdflkdsajf, O = lskdfjlsad, OU = sldfkja, issuer=C = AS, ST = ASDfkjdhf, L = lskdjf, O = saldfja, OU = skdjf, CN = localhost, emailAddress = sadjflkadsj): : certificate has expired
Google Test trace:
/data0/somelongdirectorytoavoidrpathissues/src/kudu/src/kudu/rpc/rpc-test.cc:300: Connecting to unix:/tmp/dist-test-task8lCG2A/test-tmp/rpc-test-f8ef5d1393c24525a96f785600cdd6d3.sock
I20260924 14:28:08.360654 21083 test_util.cc:175] -----------------------------------------------
I20260924 14:28:08.360828 21083 test_util.cc:176] Had fatal failures, leaving test files at /tmp/dist-test-task8lCG2A/test-tmp/rpc-test.2.Parameters_TestRpc.TestCallWithChainCertAndRootCA_SSL_UnixSocket.1790260084721116-21083-0
[  FAILED  ] Parameters/TestRpc.TestCallWithChainCertAndRootCA/SSL_UnixSocket, where GetParam() = (true, true) (63 ms)
[ RUN      ] Parameters/TestRpc.TestCallWithBadPasswordProtectedKey/SSL_UnixSocket
[       OK ] Parameters/TestRpc.TestCallWithBadPasswordProtectedKey/SSL_UnixSocket (33 ms)
[ RUN      ] Parameters/TestRpc.TestInvalidMethodCall/SSL_UnixSocket
I20260924 14:28:08.420408 21228 acceptor_pool.cc:254] collecting diagnostics on the listening RPC socket unix:/tmp/dist-test-task8lCG2A/test-tmp/rpc-test-000b9d36a6644eddafdd27493f56cd03.sock every 8 connection(s)
I20260924 14:28:08.421243 21229 acceptor_pool.cc:254] collecting diagnostics on the listening RPC socket unix:/tmp/dist-test-task8lCG2A/test-tmp/rpc-test-000b9d36a6644eddafdd27493f56cd03.sock every 8 connection(s)
I20260924 14:28:08.424628 21083 rpc-test.cc:406] Connecting to unix:/tmp/dist-test-task8lCG2A/test-tmp/rpc-test-000b9d36a6644eddafdd27493f56cd03.sock
W20260924 14:28:08.454849 21225 connection.cc:196] Error closing socket: Network error: TlsSocket::Close: Broken pipe
[       OK ] Parameters/TestRpc.TestInvalidMethodCall/SSL_UnixSocket (71 ms)
[ RUN      ] Parameters/TestRpc.TestHighFDs/SSL_UnixSocket
I20260924 14:28:08.677670 21253 acceptor_pool.cc:254] collecting diagnostics on the listening RPC socket unix:/tmp/dist-test-task8lCG2A/test-tmp/rpc-test-349234ff47664a558ba5c19261518a9d.sock every 8 connection(s)
I20260924 14:28:08.678436 21254 acceptor_pool.cc:254] collecting diagnostics on the listening RPC socket unix:/tmp/dist-test-task8lCG2A/test-tmp/rpc-test-349234ff47664a558ba5c19261518a9d.sock every 8 connection(s)
[       OK ] Parameters/TestRpc.TestHighFDs/SSL_UnixSocket (260 ms)
[ RUN      ] Parameters/TestRpc.TestConnectionAlwaysKeepalive/SSL_UnixSocket
I20260924 14:28:08.750020 21276 acceptor_pool.cc:254] collecting diagnostics on the listening RPC socket unix:/tmp/dist-test-task8lCG2A/test-tmp/rpc-test-e9f2f166d08c429295baeb15e707742a.sock every 8 connection(s)
I20260924 14:28:08.750767 21277 acceptor_pool.cc:254] collecting diagnostics on the listening RPC socket unix:/tmp/dist-test-task8lCG2A/test-tmp/rpc-test-e9f2f166d08c429295baeb15e707742a.sock every 8 connection(s)
I20260924 14:28:08.753774 21083 rpc-test.cc:532] Connecting to unix:/tmp/dist-test-task8lCG2A/test-tmp/rpc-test-e9f2f166d08c429295baeb15e707742a.sock
W20260924 14:28:11.780804 21275 connection.cc:196] Error closing socket: Network error: TlsSocket::Close: Broken pipe
[       OK ] Parameters/TestRpc.TestConnectionAlwaysKeepalive/SSL_UnixSocket (3059 ms)
[ RUN      ] Parameters/TestRpc.TestReopenOutboundConnections/SSL_UnixSocket
I20260924 14:28:11.821790 21299 acceptor_pool.cc:254] collecting diagnostics on the listening RPC socket unix:/tmp/dist-test-task8lCG2A/test-tmp/rpc-test-e4977ffa75534b6f8d9c793323685a9b.sock every 8 connection(s)
I20260924 14:28:11.822640 21300 acceptor_pool.cc:254] collecting diagnostics on the listening RPC socket unix:/tmp/dist-test-task8lCG2A/test-tmp/rpc-test-e4977ffa75534b6f8d9c793323685a9b.sock every 8 connection(s)
I20260924 14:28:11.825770 21083 rpc-test.cc:658] Connecting to unix:/tmp/dist-test-task8lCG2A/test-tmp/rpc-test-e4977ffa75534b6f8d9c793323685a9b.sock
W20260924 14:28:11.854664 21298 connection.cc:196] Error closing socket: Network error: TlsSocket::Close: Broken pipe
W20260924 14:28:11.863732 21298 connection.cc:196] Error closing socket: Network error: TlsSocket::Close: Broken pipe
W20260924 14:28:11.872960 21298 connection.cc:196] Error closing socket: Network error: TlsSocket::Close: Broken pipe
W20260924 14:28:11.882578 21298 connection.cc:196] Error closing socket: Network error: TlsSocket::Close: Broken pipe
W20260924 14:28:11.892020 21298 connection.cc:196] Error closing socket: Network error: TlsSocket::Close: Broken pipe
W20260924 14:28:11.901434 21298 connection.cc:196] Error closing socket: Network error: TlsSocket::Close: Broken pipe
W20260924 14:28:11.910881 21298 connection.cc:196] Error closing socket: Network error: TlsSocket::Close: Broken pipe
W20260924 14:28:11.920444 21298 connection.cc:196] Error closing socket: Network error: TlsSocket::Close: Broken pipe
W20260924 14:28:11.930068 21298 connection.cc:196] Error closing socket: Network error: TlsSocket::Close: Broken pipe
W20260924 14:28:11.939451 21298 connection.cc:196] Error closing socket: Network error: TlsSocket::Close: Broken pipe
W20260924 14:28:11.949345 21298 connection.cc:196] Error closing socket: Network error: TlsSocket::Close: Broken pipe
W20260924 14:28:11.958796 21298 connection.cc:196] Error closing socket: Network error: TlsSocket::Close: Broken pipe
W20260924 14:28:11.968168 21298 connection.cc:196] Error closing socket: Network error: TlsSocket::Close: Broken pipe
W20260924 14:28:11.977787 21299 acceptor_pool.cc:285] unable to collect diagnostics on RPC socket unix:/tmp/dist-test-task8lCG2A/test-tmp/rpc-test-e4977ffa75534b6f8d9c793323685a9b.sock: Not implemented: netlink diagnostics is currently supported only on IPv4 TCP sockets
W20260924 14:28:11.977738 21298 connection.cc:196] Error closing socket: Network error: TlsSocket::Close: Broken pipe
W20260924 14:28:11.988791 21298 connection.cc:196] Error closing socket: Network error: TlsSocket::Close: Broken pipe
W20260924 14:28:11.998260 21298 connection.cc:196] Error closing socket: Network error: TlsSocket::Close: Broken pipe
W20260924 14:28:12.007884 21298 connection.cc:196] Error closing socket: Network error: TlsSocket::Close: Broken pipe
W20260924 14:28:12.017591 21298 connection.cc:196] Error closing socket: Network error: TlsSocket::Close: Broken pipe
W20260924 14:28:12.027649 21298 connection.cc:196] Error closing socket: Network error: TlsSocket::Close: Broken pipe
W20260924 14:28:12.037279 21298 connection.cc:196] Error closing socket: Network error: TlsSocket::Close: Broken pipe
W20260924 14:28:12.047008 21298 connection.cc:196] Error closing socket: Network error: TlsSocket::Close: Broken pipe
W20260924 14:28:12.056658 21298 connection.cc:196] Error closing socket: Network error: TlsSocket::Close: Broken pipe
W20260924 14:28:12.066807 21298 connection.cc:196] Error closing socket: Network error: TlsSocket::Close: Broken pipe
W20260924 14:28:12.077380 21298 connection.cc:196] Error closing socket: Network error: TlsSocket::Close: Broken pipe
W20260924 14:28:12.087796 21298 connection.cc:196] Error closing socket: Network error: TlsSocket::Close: Broken pipe
W20260924 14:28:12.098299 21298 connection.cc:196] Error closing socket: Network error: TlsSocket::Close: Broken pipe
W20260924 14:28:12.108373 21298 connection.cc:196] Error closing socket: Network error: TlsSocket::Close: Broken pipe
W20260924 14:28:12.117367 21298 connection.cc:196] Error closing socket: Network error: TlsSocket::Close: Broken pipe
W20260924 14:28:12.126868 21298 connection.cc:196] Error closing socket: Network error: TlsSocket::Close: Broken pipe
W20260924 14:28:12.135674 21298 connection.cc:196] Error closing socket: Network error: TlsSocket::Close: Broken pipe
W20260924 14:28:12.144948 21298 connection.cc:196] Error closing socket: Network error: TlsSocket::Close: Broken pipe
[       OK ] Parameters/TestRpc.TestReopenOutboundConnections/SSL_UnixSocket (375 ms)
[ RUN      ] Parameters/TestRpc.TestConnectionNetworkPlane/SSL_UnixSocket
I20260924 14:28:12.182224 21322 acceptor_pool.cc:254] collecting diagnostics on the listening RPC socket unix:/tmp/dist-test-task8lCG2A/test-tmp/rpc-test-41cff7af85e945c9a6bed0f9c8b98505.sock every 8 connection(s)
I20260924 14:28:12.182981 21323 acceptor_pool.cc:254] collecting diagnostics on the listening RPC socket unix:/tmp/dist-test-task8lCG2A/test-tmp/rpc-test-41cff7af85e945c9a6bed0f9c8b98505.sock every 8 connection(s)
I20260924 14:28:12.186268 21083 rpc-test.cc:772] Connecting to unix:/tmp/dist-test-task8lCG2A/test-tmp/rpc-test-41cff7af85e945c9a6bed0f9c8b98505.sock
W20260924 14:28:12.236564 21321 connection.cc:196] Error closing socket: Network error: TlsSocket::Close: Broken pipe
W20260924 14:28:12.237568 21321 connection.cc:196] Error closing socket: Network error: TlsSocket::Close: Broken pipe
[       OK ] Parameters/TestRpc.TestConnectionNetworkPlane/SSL_UnixSocket (81 ms)
[ RUN      ] Parameters/TestRpc.TestTCPKeepalive/SSL_UnixSocket
I20260924 14:28:12.263959 21347 acceptor_pool.cc:254] collecting diagnostics on the listening RPC socket unix:/tmp/dist-test-task8lCG2A/test-tmp/rpc-test-ce4f180729a44d999a9c19f735f09e2b.sock every 8 connection(s)
I20260924 14:28:12.264717 21348 acceptor_pool.cc:254] collecting diagnostics on the listening RPC socket unix:/tmp/dist-test-task8lCG2A/test-tmp/rpc-test-ce4f180729a44d999a9c19f735f09e2b.sock every 8 connection(s)
I20260924 14:28:12.299052 21351 rpc-test-base.h:222] got call: sleep_micros: 8000000 deferred: true
I20260924 14:28:20.303146 21351 rpcz_store.cc:275] Call kudu.rpc.GenericCalculatorService.Sleep from unix:<unnamed> (request call id 0) took 8004 ms. Trace:
I20260924 14:28:20.303639 21351 rpcz_store.cc:276] 0924 14:28:12.298883 (+     0us) service_pool.cc:170] Inserting onto call queue
0924 14:28:12.298993 (+   110us) service_pool.cc:227] Handling call
0924 14:28:20.302973 (+8003980us) inbound_call.cc:173] Queueing success response
Metrics: {}
W20260924 14:28:20.310870 21344 connection.cc:196] Error closing socket: Network error: TlsSocket::Close: Broken pipe
[       OK ] Parameters/TestRpc.TestTCPKeepalive/SSL_UnixSocket (8074 ms)
[ RUN      ] Parameters/TestRpc.TestMaxSmallSidecars/SSL_UnixSocket
I20260924 14:28:20.342288 21373 acceptor_pool.cc:254] collecting diagnostics on the listening RPC socket unix:/tmp/dist-test-task8lCG2A/test-tmp/rpc-test-eeb7325c8b6840508eecfc469537933e.sock every 8 connection(s)
I20260924 14:28:20.343176 21374 acceptor_pool.cc:254] collecting diagnostics on the listening RPC socket unix:/tmp/dist-test-task8lCG2A/test-tmp/rpc-test-eeb7325c8b6840508eecfc469537933e.sock every 8 connection(s)
W20260924 14:28:20.528971 21370 connection.cc:196] Error closing socket: Network error: TlsSocket::Close: Broken pipe
[       OK ] Parameters/TestRpc.TestMaxSmallSidecars/SSL_UnixSocket (215 ms)
[ RUN      ] Parameters/TestRpc.TestCallTimeout/SSL_UnixSocket
I20260924 14:28:20.551200 21398 acceptor_pool.cc:254] collecting diagnostics on the listening RPC socket unix:/tmp/dist-test-task8lCG2A/test-tmp/rpc-test-0e378ee2afb6433dbd357c20917465d1.sock every 8 connection(s)
I20260924 14:28:20.551959 21399 acceptor_pool.cc:254] collecting diagnostics on the listening RPC socket unix:/tmp/dist-test-task8lCG2A/test-tmp/rpc-test-0e378ee2afb6433dbd357c20917465d1.sock every 8 connection(s)
I20260924 14:28:20.605175 21083 rpc-test-base.h:595] status: Timed out: connection negotiation to unix:/tmp/dist-test-task8lCG2A/test-tmp/rpc-test-0e378ee2afb6433dbd357c20917465d1.sock for RPC Sleep timed out after 0.000s (ON_OUTBOUND_QUEUE), seconds elapsed: 0.00232681
I20260924 14:28:20.612609 21402 rpc-test-base.h:222] got call: sleep_micros: 700000
I20260924 14:28:20.806511 21083 rpc-test-base.h:595] status: Timed out: Sleep RPC to unix:/tmp/dist-test-task8lCG2A/test-tmp/rpc-test-0e378ee2afb6433dbd357c20917465d1.sock timed out after 0.200s (SENT), seconds elapsed: 0.200911
I20260924 14:28:20.807965 21401 rpc-test-base.h:222] got call: sleep_micros: 2000000
W20260924 14:28:21.313284 21402 rpcz_store.cc:267] Call kudu.rpc.GenericCalculatorService.Sleep from unix:<unnamed> (request call id 1) took 700 ms (client timeout 200 ms). Trace:
W20260924 14:28:21.313659 21402 rpcz_store.cc:269] 0924 14:28:20.612446 (+     0us) service_pool.cc:170] Inserting onto call queue
0924 14:28:20.612559 (+   113us) service_pool.cc:227] Handling call
0924 14:28:21.313224 (+700665us) inbound_call.cc:173] Queueing success response
Metrics: {}
I20260924 14:28:22.308480 21083 rpc-test-base.h:595] status: Timed out: Sleep RPC to unix:/tmp/dist-test-task8lCG2A/test-tmp/rpc-test-0e378ee2afb6433dbd357c20917465d1.sock timed out after 1.500s (SENT), seconds elapsed: 1.50164
W20260924 14:28:22.808508 21401 rpcz_store.cc:267] Call kudu.rpc.GenericCalculatorService.Sleep from unix:<unnamed> (request call id 2) took 2000 ms (client timeout 1500 ms). Trace:
W20260924 14:28:22.808841 21401 rpcz_store.cc:269] 0924 14:28:20.807683 (+     0us) service_pool.cc:170] Inserting onto call queue
0924 14:28:20.807811 (+   128us) service_pool.cc:227] Handling call
0924 14:28:22.808448 (+2000637us) inbound_call.cc:173] Queueing success response
Metrics: {}
W20260924 14:28:22.809406 21395 connection.cc:441] server connection from unix:<unnamed> torn down before Call kudu.rpc.GenericCalculatorService.Sleep from unix:<unnamed> (request call id 2) could send its response
[       OK ] Parameters/TestRpc.TestCallTimeout/SSL_UnixSocket (2280 ms)
[ RUN      ] Parameters/TestRpc.TestServerShutsDown/SSL_UnixSocket
I20260924 14:28:22.816609 21083 rpc-test.cc:1125] Connecting to 0.0.0.0:39115
W20260924 14:28:22.825265 21415 negotiation.cc:337] Failed RPC negotiation. Trace:
0924 14:28:22.823834 (+     0us) reactor.cc:625] Submitting negotiation task for client connection to 0.0.0.0:39115 (local address 127.0.0.1:56968)
0924 14:28:22.824283 (+   449us) negotiation.cc:107] Waiting for socket to connect
0924 14:28:22.824314 (+    31us) client_negotiation.cc:174] Beginning negotiation
0924 14:28:22.824539 (+   225us) client_negotiation.cc:252] Sending NEGOTIATE NegotiatePB request
0924 14:28:22.824752 (+   213us) negotiation.cc:327] Negotiation complete: Network error: Client connection negotiation failed: client connection to 0.0.0.0:39115: BlockingWrite error: write error: Broken pipe (error 32)
Metrics: {"client-negotiator.queue_time_us":110}
[       OK ] Parameters/TestRpc.TestServerShutsDown/SSL_UnixSocket (12 ms)
[ RUN      ] Parameters/TestRpc.TimedOutOnResponseMetric/SSL_UnixSocket
I20260924 14:28:22.843770 21432 acceptor_pool.cc:254] collecting diagnostics on the listening RPC socket unix:/tmp/dist-test-task8lCG2A/test-tmp/rpc-test-da18e1325bd9471591bdd1e9811cb187.sock every 8 connection(s)
I20260924 14:28:22.844499 21433 acceptor_pool.cc:254] collecting diagnostics on the listening RPC socket unix:/tmp/dist-test-task8lCG2A/test-tmp/rpc-test-da18e1325bd9471591bdd1e9811cb187.sock every 8 connection(s)
W20260924 14:28:23.089548 21436 rpcz_store.cc:267] Call kudu.rpc_test.CalculatorService.Sleep from unix:<unnamed> (request call id 3) took 50 ms (client timeout 25 ms). Trace:
W20260924 14:28:23.089911 21436 rpcz_store.cc:269] 0924 14:28:23.039024 (+     0us) service_pool.cc:170] Inserting onto call queue
0924 14:28:23.039116 (+    92us) service_pool.cc:227] Handling call
0924 14:28:23.089478 (+ 50362us) inbound_call.cc:173] Queueing success response
Related trace 'test_child':
Metrics: {"test_sleep_us":50000,"child_traces":[["test_child",{"related_trace_metric":1}]]}
W20260924 14:28:23.148581 21436 rpcz_store.cc:267] Call kudu.rpc_test.CalculatorService.Sleep from unix:<unnamed> (request call id 4) took 50 ms (client timeout 50 ms). Trace:
W20260924 14:28:23.148900 21436 rpcz_store.cc:269] 0924 14:28:23.098092 (+     0us) service_pool.cc:170] Inserting onto call queue
0924 14:28:23.098198 (+   106us) service_pool.cc:227] Handling call
0924 14:28:23.148526 (+ 50328us) inbound_call.cc:173] Queueing success response
Related trace 'test_child':
Metrics: {"test_sleep_us":50000,"child_traces":[["test_child",{"related_trace_metric":1}]]}
[       OK ] Parameters/TestRpc.TimedOutOnResponseMetric/SSL_UnixSocket (329 ms)
[ RUN      ] Parameters/TestRpc.AcceptorDispatchingTimesMetric/SSL_UnixSocket
I20260924 14:28:23.169381 21457 acceptor_pool.cc:254] collecting diagnostics on the listening RPC socket 0.0.0.0:40877 every 8 connection(s)
I20260924 14:28:23.170059 21458 acceptor_pool.cc:254] collecting diagnostics on the listening RPC socket 0.0.0.0:40877 every 8 connection(s)
W20260924 14:28:23.176087 21453 negotiation.cc:337] Failed RPC negotiation. Trace:
0924 14:28:23.173671 (+     0us) reactor.cc:625] Submitting negotiation task for server connection from 127.0.0.1:49448 (local address 127.0.0.1:40877)
0924 14:28:23.174451 (+   780us) server_negotiation.cc:206] Beginning negotiation
0924 14:28:23.174470 (+    19us) server_negotiation.cc:399] Waiting for connection header
0924 14:28:23.174745 (+   275us) negotiation.cc:327] Negotiation complete: Network error: Server connection negotiation failed: server connection from 127.0.0.1:49448: BlockingRecv error: recv got EOF from 127.0.0.1:49448 (error 108)
Metrics: {"server-negotiator.queue_time_us":214}
[       OK ] Parameters/TestRpc.AcceptorDispatchingTimesMetric/SSL_UnixSocket (21 ms)
[ RUN      ] Parameters/TestRpc.TestRpcCallbackDestroysMessenger/SSL_UnixSocket
[       OK ] Parameters/TestRpc.TestRpcCallbackDestroysMessenger/SSL_UnixSocket (27 ms)
[ RUN      ] Parameters/TestRpc.TestApplicationFeatureFlag/SSL_UnixSocket
I20260924 14:28:23.245491 21482 acceptor_pool.cc:254] collecting diagnostics on the listening RPC socket unix:/tmp/dist-test-task8lCG2A/test-tmp/rpc-test-ac99085e1cff407fadbb232e89ae4fe9.sock every 8 connection(s)
I20260924 14:28:23.246266 21483 acceptor_pool.cc:254] collecting diagnostics on the listening RPC socket unix:/tmp/dist-test-task8lCG2A/test-tmp/rpc-test-ac99085e1cff407fadbb232e89ae4fe9.sock every 8 connection(s)
W20260924 14:28:23.274560 21479 messenger.cc:357] Unable to handle RPC call: Not implemented: call requires unsupported application feature flags: 99
W20260924 14:28:23.277925 21479 connection.cc:196] Error closing socket: Network error: TlsSocket::Close: Broken pipe
[       OK ] Parameters/TestRpc.TestApplicationFeatureFlag/SSL_UnixSocket (75 ms)
[ RUN      ] Parameters/TestRpc.TestCancellation/SSL_UnixSocket
I20260924 14:28:23.325583 21507 acceptor_pool.cc:254] collecting diagnostics on the listening RPC socket unix:/tmp/dist-test-task8lCG2A/test-tmp/rpc-test-73d0890df30e43e1aa660e10b1849bd3.sock every 8 connection(s)
I20260924 14:28:23.326323 21508 acceptor_pool.cc:254] collecting diagnostics on the listening RPC socket unix:/tmp/dist-test-task8lCG2A/test-tmp/rpc-test-73d0890df30e43e1aa660e10b1849bd3.sock every 8 connection(s)
I20260924 14:28:23.329412 21083 rpc-test.cc:1648] Connecting to unix:/tmp/dist-test-task8lCG2A/test-tmp/rpc-test-73d0890df30e43e1aa660e10b1849bd3.sock
I20260924 14:28:23.434033 21083 rpc-test-base.h:595] status: Aborted: Sleep RPC to unix:/tmp/dist-test-task8lCG2A/test-tmp/rpc-test-73d0890df30e43e1aa660e10b1849bd3.sock is cancelled in state READY, seconds elapsed: 0.000352792
I20260924 14:28:23.604574 21083 rpc-test-base.h:595] status: Aborted: Sleep RPC to unix:/tmp/dist-test-task8lCG2A/test-tmp/rpc-test-73d0890df30e43e1aa660e10b1849bd3.sock is cancelled in state SENT, seconds elapsed: 0.000923848
I20260924 14:28:23.604745 21510 rpc-test-base.h:222] got call: sleep_micros: 510000
I20260924 14:28:23.778673 21083 rpc-test-base.h:595] status: Aborted: Sleep RPC to unix:/tmp/dist-test-task8lCG2A/test-tmp/rpc-test-73d0890df30e43e1aa660e10b1849bd3.sock is cancelled in state SENT, seconds elapsed: 0.000944238
I20260924 14:28:23.778877 21509 rpc-test-base.h:222] got call: sleep_micros: 510000
I20260924 14:28:23.948377 21083 rpc-test-base.h:595] status: Aborted: Sleep RPC to unix:/tmp/dist-test-task8lCG2A/test-tmp/rpc-test-73d0890df30e43e1aa660e10b1849bd3.sock is cancelled in state SENT, seconds elapsed: 0.000820688
W20260924 14:28:23.959151 21511 rpcz_store.cc:267] Call kudu.rpc.GenericCalculatorService.Sleep from unix:<unnamed> (request call id 11) took 10 ms (client timeout 10 ms). Trace:
W20260924 14:28:23.959470 21511 rpcz_store.cc:269] 0924 14:28:23.948360 (+     0us) service_pool.cc:170] Inserting onto call queue
0924 14:28:23.958891 (+ 10531us) service_pool.cc:214] Skipping call since client already timed out
0924 14:28:23.958964 (+    73us) inbound_call.cc:173] Queueing failure response
Metrics: {}
I20260924 14:28:23.959990 21511 rpc-test-base.h:222] got call: sleep_micros: 1500000
W20260924 14:28:24.115360 21510 rpcz_store.cc:267] Call kudu.rpc.GenericCalculatorService.Sleep from unix:<unnamed> (request call id 3) took 510 ms (client timeout 10 ms). Trace:
W20260924 14:28:24.115694 21510 rpcz_store.cc:269] 0924 14:28:23.604573 (+     0us) service_pool.cc:170] Inserting onto call queue
0924 14:28:23.604699 (+   126us) service_pool.cc:227] Handling call
0924 14:28:24.115300 (+510601us) inbound_call.cc:173] Queueing success response
Metrics: {}
W20260924 14:28:24.289426 21509 rpcz_store.cc:267] Call kudu.rpc.GenericCalculatorService.Sleep from unix:<unnamed> (request call id 7) took 510 ms (client timeout 10 ms). Trace:
W20260924 14:28:24.289740 21509 rpcz_store.cc:269] 0924 14:28:23.778675 (+     0us) service_pool.cc:170] Inserting onto call queue
0924 14:28:23.778818 (+   143us) service_pool.cc:227] Handling call
0924 14:28:24.289374 (+510556us) inbound_call.cc:173] Queueing success response
Metrics: {}
I20260924 14:28:24.951038 21083 rpc-test-base.h:595] status: Timed out: Sleep RPC to unix:/tmp/dist-test-task8lCG2A/test-tmp/rpc-test-73d0890df30e43e1aa660e10b1849bd3.sock timed out after 1.000s (SENT), seconds elapsed: 1.00223
I20260924 14:28:24.953027 21509 rpc-test-base.h:222] got call: sleep_micros: 1500000
W20260924 14:28:25.460803 21511 rpcz_store.cc:267] Call kudu.rpc.GenericCalculatorService.Sleep from unix:<unnamed> (request call id 12) took 1511 ms (client timeout 1000 ms). Trace:
W20260924 14:28:25.461140 21511 rpcz_store.cc:269] 0924 14:28:23.949392 (+     0us) service_pool.cc:170] Inserting onto call queue
0924 14:28:23.959954 (+ 10562us) service_pool.cc:227] Handling call
0924 14:28:25.460663 (+1500709us) inbound_call.cc:173] Queueing success response
Metrics: {}
I20260924 14:28:25.952744 21083 rpc-test-base.h:595] status: Timed out: Sleep RPC to unix:/tmp/dist-test-task8lCG2A/test-tmp/rpc-test-73d0890df30e43e1aa660e10b1849bd3.sock timed out after 1.000s (SENT), seconds elapsed: 1.00117
W20260924 14:28:25.954267 21504 messenger.cc:357] Unable to handle RPC call: Not implemented: call requires unsupported application feature flags: 99, 1
W20260924 14:28:25.955698 21504 messenger.cc:357] Unable to handle RPC call: Not implemented: call requires unsupported application feature flags: 99, 1
W20260924 14:28:26.167419 21504 connection.cc:196] Error closing socket: Network error: TlsSocket::Close: Broken pipe
W20260924 14:28:26.453625 21509 rpcz_store.cc:267] Call kudu.rpc.GenericCalculatorService.Sleep from unix:<unnamed> (request call id 13) took 1501 ms (client timeout 1000 ms). Trace:
W20260924 14:28:26.454013 21509 rpcz_store.cc:269] 0924 14:28:24.952685 (+     0us) service_pool.cc:170] Inserting onto call queue
0924 14:28:24.952906 (+   221us) service_pool.cc:227] Handling call
0924 14:28:26.453567 (+1500661us) inbound_call.cc:173] Queueing success response
Metrics: {}
W20260924 14:28:26.454528 21504 connection.cc:441] server connection from unix:<unnamed> torn down before Call kudu.rpc.GenericCalculatorService.Sleep from unix:<unnamed> (request call id 13) could send its response
[       OK ] Parameters/TestRpc.TestCancellation/SSL_UnixSocket (3180 ms)
[ RUN      ] Parameters/TestRpc.TestCancellationMultiThreads/SSL_UnixSocket
I20260924 14:28:26.502691 21533 acceptor_pool.cc:254] collecting diagnostics on the listening RPC socket unix:/tmp/dist-test-task8lCG2A/test-tmp/rpc-test-2f52a4767a014eadb2f648db8566b37f.sock every 8 connection(s)
I20260924 14:28:26.503567 21534 acceptor_pool.cc:254] collecting diagnostics on the listening RPC socket unix:/tmp/dist-test-task8lCG2A/test-tmp/rpc-test-2f52a4767a014eadb2f648db8566b37f.sock every 8 connection(s)
I20260924 14:28:26.506708 21083 rpc-test.cc:1808] Connecting to unix:/tmp/dist-test-task8lCG2A/test-tmp/rpc-test-2f52a4767a014eadb2f648db8566b37f.sock
I20260924 14:28:26.646100 21547 test_util.cc:268] Using random seed: 1773556200
I20260924 14:28:26.647591 21548 test_util.cc:268] Using random seed: 1773557763
I20260924 14:28:26.649138 21549 test_util.cc:268] Using random seed: 1773559319
I20260924 14:28:26.650713 21550 test_util.cc:268] Using random seed: 1773560781
I20260924 14:28:26.652364 21551 test_util.cc:268] Using random seed: 1773562395
I20260924 14:28:26.654044 21552 test_util.cc:268] Using random seed: 1773564035
I20260924 14:28:26.655825 21553 test_util.cc:268] Using random seed: 1773565843
I20260924 14:28:26.657581 21554 test_util.cc:268] Using random seed: 1773567624
I20260924 14:28:26.659245 21555 test_util.cc:268] Using random seed: 1773569279
I20260924 14:28:26.660718 21556 test_util.cc:268] Using random seed: 1773570761
I20260924 14:28:26.662026 21557 test_util.cc:268] Using random seed: 1773572074
I20260924 14:28:26.663591 21558 test_util.cc:268] Using random seed: 1773573607
I20260924 14:28:26.665310 21559 test_util.cc:268] Using random seed: 1773575340
I20260924 14:28:26.667001 21560 test_util.cc:268] Using random seed: 1773577044
I20260924 14:28:26.668859 21561 test_util.cc:268] Using random seed: 1773578869
I20260924 14:28:26.670531 21562 test_util.cc:268] Using random seed: 1773580548
I20260924 14:28:26.672055 21563 test_util.cc:268] Using random seed: 1773582129
I20260924 14:28:26.673557 21564 test_util.cc:268] Using random seed: 1773583575
I20260924 14:28:26.674892 21565 test_util.cc:268] Using random seed: 1773584981
I20260924 14:28:26.676478 21566 test_util.cc:268] Using random seed: 1773586534
I20260924 14:28:26.677951 21567 test_util.cc:268] Using random seed: 1773587961
I20260924 14:28:26.679481 21568 test_util.cc:268] Using random seed: 1773589524
I20260924 14:28:26.681583 21569 test_util.cc:268] Using random seed: 1773591667
I20260924 14:28:26.686456 21570 test_util.cc:268] Using random seed: 1773596464
I20260924 14:28:26.687772 21571 test_util.cc:268] Using random seed: 1773597865
I20260924 14:28:26.689209 21572 test_util.cc:268] Using random seed: 1773599213
I20260924 14:28:26.690778 21573 test_util.cc:268] Using random seed: 1773600855
I20260924 14:28:26.692351 21574 test_util.cc:268] Using random seed: 1773602350
I20260924 14:28:26.693672 21575 test_util.cc:268] Using random seed: 1773603753
I20260924 14:28:26.695127 21576 test_util.cc:268] Using random seed: 1773605160
W20260924 14:28:46.461668 21530 connection.cc:196] Error closing socket: Network error: TlsSocket::Close: Broken pipe
[       OK ] Parameters/TestRpc.TestCancellationMultiThreads/SSL_UnixSocket (20016 ms)
[ RUN      ] Parameters/TestRpc.TestCallId/SSL_UnixSocket
I20260924 14:28:46.508654 21590 acceptor_pool.cc:254] collecting diagnostics on the listening RPC socket unix:/tmp/dist-test-task8lCG2A/test-tmp/rpc-test-9d65435387354580ae651bd3671c1d33.sock every 8 connection(s)
I20260924 14:28:46.509557 21591 acceptor_pool.cc:254] collecting diagnostics on the listening RPC socket unix:/tmp/dist-test-task8lCG2A/test-tmp/rpc-test-9d65435387354580ae651bd3671c1d33.sock every 8 connection(s)
[       OK ] Parameters/TestRpc.TestCallId/SSL_UnixSocket (103 ms)
[----------] 20 tests from Parameters/TestRpc (38580 ms total)

[----------] Global test environment tear-down
[==========] 21 tests from 2 test suites ran. (41812 ms total)
[  PASSED  ] 20 tests.
[  FAILED  ] 1 test, listed below:
[  FAILED  ] Parameters/TestRpc.TestCallWithChainCertAndRootCA/SSL_UnixSocket, where GetParam() = (true, true)

 1 FAILED TEST
I20260924 14:28:46.601279 21083 logging.cc:424] LogThrottler /data0/somelongdirectorytoavoidrpathissues/src/kudu/src/kudu/rpc/acceptor_pool.cc:285: suppressed but not reported on 3 messages since previous log ~34 seconds ago