Diagnosed failure
Parameters/TestRpc.TestCallWithChainCertAndChainCA/SSL_TCP: /data0/somelongdirectorytoavoidrpathissues/src/kudu/src/kudu/rpc/rpc-test.cc:270: Failure
Failed
Bad status: Runtime error: could not verify certificate chain (error with cert: subject=CN = localhost, ST = sadfjas, C = AS, emailAddress = sdflkdsajf, O = lskdfjlsad, OU = sldfkja, issuer=C = AS, ST = ASDfkjdhf, L = lskdjf, O = saldfja, OU = skdjf, CN = localhost, emailAddress = sadjflkadsj): : certificate has expired
Google Test trace:
/data0/somelongdirectorytoavoidrpathissues/src/kudu/src/kudu/rpc/rpc-test.cc:267: Connecting to 0.0.0.0:44241
I20260926 22:39:47.111398 28146 test_util.cc:175] -----------------------------------------------
I20260926 22:39:47.111450 28146 test_util.cc:176] Had fatal failures, leaving test files at /tmp/dist-test-taskZ1UOjV/test-tmp/rpc-test.5.Parameters_TestRpc.TestCallWithChainCertAndChainCA_SSL_TCP.1790462387034574-28146-0
Full log
Note: This is test shard 6 of 8.
[==========] Running 21 tests from 2 test suites.
[----------] Global test environment set-up.
[----------] 20 tests from Parameters/TestRpc
[ RUN ] Parameters/TestRpc.TestMessengerCreateDestroy/SSL_TCP
WARNING: Logging before InitGoogleLogging() is written to STDERR
I20260926 22:39:47.066829 28146 rpc-test.cc:169] started messenger TestCreateDestroy
[ OK ] Parameters/TestRpc.TestMessengerCreateDestroy/SSL_TCP (30 ms)
[ RUN ] Parameters/TestRpc.TestNegotiationDeadlock/SSL_TCP
I20260926 22:39:47.078171 28167 acceptor_pool.cc:254] collecting diagnostics on the listening RPC socket 0.0.0.0:32773 every 8 connection(s)
I20260926 22:39:47.078214 28166 acceptor_pool.cc:254] collecting diagnostics on the listening RPC socket 0.0.0.0:32773 every 8 connection(s)
[ OK ] Parameters/TestRpc.TestNegotiationDeadlock/SSL_TCP (19 ms)
[ RUN ] Parameters/TestRpc.TestCallWithChainCertAndChainCA/SSL_TCP
I20260926 22:39:47.107057 28182 acceptor_pool.cc:254] collecting diagnostics on the listening RPC socket 0.0.0.0:44241 every 8 connection(s)
I20260926 22:39:47.107069 28183 acceptor_pool.cc:254] collecting diagnostics on the listening RPC socket 0.0.0.0:44241 every 8 connection(s)
/data0/somelongdirectorytoavoidrpathissues/src/kudu/src/kudu/rpc/rpc-test.cc:270: Failure
Failed
Bad status: Runtime error: could not verify certificate chain (error with cert: subject=CN = localhost, ST = sadfjas, C = AS, emailAddress = sdflkdsajf, O = lskdfjlsad, OU = sldfkja, issuer=C = AS, ST = ASDfkjdhf, L = lskdjf, O = saldfja, OU = skdjf, CN = localhost, emailAddress = sadjflkadsj): : certificate has expired
Google Test trace:
/data0/somelongdirectorytoavoidrpathissues/src/kudu/src/kudu/rpc/rpc-test.cc:267: Connecting to 0.0.0.0:44241
I20260926 22:39:47.111398 28146 test_util.cc:175] -----------------------------------------------
I20260926 22:39:47.111450 28146 test_util.cc:176] Had fatal failures, leaving test files at /tmp/dist-test-taskZ1UOjV/test-tmp/rpc-test.5.Parameters_TestRpc.TestCallWithChainCertAndChainCA_SSL_TCP.1790462387034574-28146-0
[ FAILED ] Parameters/TestRpc.TestCallWithChainCertAndChainCA/SSL_TCP, where GetParam() = (true, false) (23 ms)
[ RUN ] Parameters/TestRpc.TestCallWithPasswordProtectedKey/SSL_TCP
I20260926 22:39:47.136204 28207 acceptor_pool.cc:254] collecting diagnostics on the listening RPC socket 0.0.0.0:37947 every 8 connection(s)
I20260926 22:39:47.136240 28208 acceptor_pool.cc:254] collecting diagnostics on the listening RPC socket 0.0.0.0:37947 every 8 connection(s)
[ OK ] Parameters/TestRpc.TestCallWithPasswordProtectedKey/SSL_TCP (38 ms)
[ RUN ] Parameters/TestRpc.TestCallToBadServer/SSL_TCP
I20260926 22:39:47.164124 28146 rpc-test.cc:394] Status: Network error: Client connection negotiation failed: client connection to 0.0.0.0:0: connect: Connection refused (error 111)
I20260926 22:39:47.164482 28146 rpc-test.cc:394] Status: Network error: Client connection negotiation failed: client connection to 0.0.0.0:0: connect: Connection refused (error 111)
I20260926 22:39:47.164708 28146 rpc-test.cc:394] Status: Network error: Client connection negotiation failed: client connection to 0.0.0.0:0: connect: Connection refused (error 111)
I20260926 22:39:47.164961 28146 rpc-test.cc:394] Status: Network error: Client connection negotiation failed: client connection to 0.0.0.0:0: connect: Connection refused (error 111)
I20260926 22:39:47.165225 28146 rpc-test.cc:394] Status: Network error: Client connection negotiation failed: client connection to 0.0.0.0:0: connect: Connection refused (error 111)
[ OK ] Parameters/TestRpc.TestCallToBadServer/SSL_TCP (16 ms)
[ RUN ] Parameters/TestRpc.TestWrongService/SSL_TCP
I20260926 22:39:47.184448 28242 acceptor_pool.cc:254] collecting diagnostics on the listening RPC socket 0.0.0.0:33979 every 8 connection(s)
I20260926 22:39:47.184489 28243 acceptor_pool.cc:254] collecting diagnostics on the listening RPC socket 0.0.0.0:33979 every 8 connection(s)
I20260926 22:39:47.200403 28239 messenger.cc:345] service WrongServiceName not registered on TestServer
[ OK ] Parameters/TestRpc.TestWrongService/SSL_TCP (39 ms)
[ RUN ] Parameters/TestRpc.TestConnectionKeepalive/SSL_TCP
I20260926 22:39:47.216892 28265 acceptor_pool.cc:254] collecting diagnostics on the listening RPC socket 0.0.0.0:38067 every 8 connection(s)
I20260926 22:39:47.216934 28266 acceptor_pool.cc:254] collecting diagnostics on the listening RPC socket 0.0.0.0:38067 every 8 connection(s)
I20260926 22:39:47.217092 28146 rpc-test.cc:488] Connecting to 0.0.0.0:38067
[ OK ] Parameters/TestRpc.TestConnectionKeepalive/SSL_TCP (1034 ms)
[ RUN ] Parameters/TestRpc.TestClientConnectionMetrics/SSL_TCP
I20260926 22:39:48.253074 28290 acceptor_pool.cc:254] collecting diagnostics on the listening RPC socket 0.0.0.0:37479 every 8 connection(s)
I20260926 22:39:48.253268 28291 acceptor_pool.cc:254] collecting diagnostics on the listening RPC socket 0.0.0.0:37479 every 8 connection(s)
I20260926 22:39:48.253376 28146 rpc-test.cc:569] Connecting to 0.0.0.0:37479
[ OK ] Parameters/TestRpc.TestClientConnectionMetrics/SSL_TCP (11241 ms)
[ RUN ] Parameters/TestRpc.TestCredentialsPolicy/SSL_TCP
I20260926 22:39:59.489306 28313 acceptor_pool.cc:254] collecting diagnostics on the listening RPC socket 0.0.0.0:36945 every 8 connection(s)
I20260926 22:39:59.489399 28314 acceptor_pool.cc:254] collecting diagnostics on the listening RPC socket 0.0.0.0:36945 every 8 connection(s)
I20260926 22:39:59.489531 28146 rpc-test.cc:700] Connecting to 0.0.0.0:36945
[ OK ] Parameters/TestRpc.TestCredentialsPolicy/SSL_TCP (29 ms)
[ RUN ] Parameters/TestRpc.TestCallLongerThanKeepalive/SSL_TCP
I20260926 22:39:59.522289 28338 acceptor_pool.cc:254] collecting diagnostics on the listening RPC socket 0.0.0.0:33655 every 8 connection(s)
I20260926 22:39:59.522348 28339 acceptor_pool.cc:254] collecting diagnostics on the listening RPC socket 0.0.0.0:33655 every 8 connection(s)
I20260926 22:39:59.546481 28342 rpc-test-base.h:222] got call: sleep_micros: 3000000 deferred: true
I20260926 22:40:02.547508 28342 rpcz_store.cc:275] Call kudu.rpc.GenericCalculatorService.Sleep from 127.0.0.1:33746 (request call id 0) took 3001 ms. Trace:
I20260926 22:40:02.547607 28342 rpcz_store.cc:276] 0926 22:39:59.546428 (+ 0us) service_pool.cc:170] Inserting onto call queue
0926 22:39:59.546463 (+ 35us) service_pool.cc:227] Handling call
0926 22:40:02.547489 (+3001026us) inbound_call.cc:173] Queueing success response
Metrics: {}
[ OK ] Parameters/TestRpc.TestCallLongerThanKeepalive/SSL_TCP (3038 ms)
[ RUN ] Parameters/TestRpc.TestRpcSidecar/SSL_TCP
I20260926 22:40:02.563551 28363 acceptor_pool.cc:254] collecting diagnostics on the listening RPC socket 0.0.0.0:33897 every 8 connection(s)
I20260926 22:40:02.563583 28364 acceptor_pool.cc:254] collecting diagnostics on the listening RPC socket 0.0.0.0:33897 every 8 connection(s)
[ OK ] Parameters/TestRpc.TestRpcSidecar/SSL_TCP (72 ms)
[ RUN ] Parameters/TestRpc.TestRpcSidecarLimits/SSL_TCP
I20260926 22:40:04.223995 28388 acceptor_pool.cc:254] collecting diagnostics on the listening RPC socket 0.0.0.0:44991 every 8 connection(s)
I20260926 22:40:04.224051 28389 acceptor_pool.cc:254] collecting diagnostics on the listening RPC socket 0.0.0.0:44991 every 8 connection(s)
W20260926 22:40:04.235232 28146 serialization.cc:72] Serialized kudu.rpc_test.PushStringsRequestPB (2147483654 bytes) is larger than the maximum configured RPC message size (52428800 bytes). Sending anyway, but peer may reject the data.
W20260926 22:40:04.239369 28385 connection.cc:535] server connection from 127.0.0.1:50998 recv error: Network error: RPC frame had a length of 2147483714, but we only support messages up to 52428800 bytes long.
W20260926 22:40:04.239423 28385 connection.cc:158] shutting down server connection from 127.0.0.1:50998 with pending inbound data: 4/2147483714 bytes received; last active 0 ns ago: status Network error: RPC frame had a length of 2147483714, but we only support messages up to 52428800 bytes long.
W20260926 22:40:04.239796 28401 connection.cc:196] Error closing socket: Network error: TlsSocket::Close: Connection reset by peer
I20260926 22:40:04.252068 28414 acceptor_pool.cc:254] collecting diagnostics on the listening RPC socket 0.0.0.0:44499 every 8 connection(s)
I20260926 22:40:04.252112 28413 acceptor_pool.cc:254] collecting diagnostics on the listening RPC socket 0.0.0.0:44499 every 8 connection(s)
W20260926 22:40:08.555733 28411 connection.cc:577] server connection from 127.0.0.1:34770: received bad data: 'Corruption: Invalid packet: message had a length of 2147483710, but we only support messages up to 2147483647 bytes
'
[ OK ] Parameters/TestRpc.TestRpcSidecarLimits/SSL_TCP (5935 ms)
[ RUN ] Parameters/TestRpc.TestCallTimeoutDoesntAffectNegotiation/SSL_TCP
I20260926 22:40:08.572624 28438 acceptor_pool.cc:254] collecting diagnostics on the listening RPC socket 0.0.0.0:35365 every 8 connection(s)
I20260926 22:40:08.572690 28439 acceptor_pool.cc:254] collecting diagnostics on the listening RPC socket 0.0.0.0:35365 every 8 connection(s)
W20260926 22:40:08.579831 28434 negotiation.cc:266] Injecting 500ms delay in negotiation
I20260926 22:40:08.630148 28146 rpc-test-base.h:595] status: Timed out: connection negotiation to 0.0.0.0:35365 for RPC Sleep timed out after 0.050s (ON_OUTBOUND_QUEUE), seconds elapsed: 0.05082
[ OK ] Parameters/TestRpc.TestCallTimeoutDoesntAffectNegotiation/SSL_TCP (526 ms)
[ RUN ] Parameters/TestRpc.TestRpcHandlerLatencyMetric/SSL_TCP
I20260926 22:40:09.091387 28463 acceptor_pool.cc:254] collecting diagnostics on the listening RPC socket 0.0.0.0:37133 every 8 connection(s)
I20260926 22:40:09.091439 28464 acceptor_pool.cc:254] collecting diagnostics on the listening RPC socket 0.0.0.0:37133 every 8 connection(s)
I20260926 22:40:09.128656 28146 rpc-test.cc:1236] Sleep() min lat: 20297
I20260926 22:40:09.128744 28146 rpc-test.cc:1237] Sleep() mean lat: 20297
I20260926 22:40:09.128775 28146 rpc-test.cc:1238] Sleep() max lat: 20297
I20260926 22:40:09.128789 28146 rpc-test.cc:1239] Sleep() #calls: 1
[ OK ] Parameters/TestRpc.TestRpcHandlerLatencyMetric/SSL_TCP (45 ms)
[ RUN ] Parameters/TestRpc.TimedOutOnResponseMetricServiceQueue/SSL_TCP
I20260926 22:40:09.157568 28489 acceptor_pool.cc:254] collecting diagnostics on the listening RPC socket 0.0.0.0:34541 every 8 connection(s)
I20260926 22:40:09.157604 28490 acceptor_pool.cc:254] collecting diagnostics on the listening RPC socket 0.0.0.0:34541 every 8 connection(s)
W20260926 22:40:09.206108 28491 rpcz_store.cc:267] Call kudu.rpc_test.CalculatorService.Sleep from 127.0.0.1:51478 (request call id 2) took 20 ms (client timeout 20 ms). Trace:
W20260926 22:40:09.206230 28491 rpcz_store.cc:269] 0926 22:40:09.185830 (+ 0us) service_pool.cc:170] Inserting onto call queue
0926 22:40:09.206084 (+ 20254us) service_pool.cc:214] Skipping call since client already timed out
0926 22:40:09.206094 (+ 10us) inbound_call.cc:173] Queueing failure response
Metrics: {}
[ OK ] Parameters/TestRpc.TimedOutOnResponseMetricServiceQueue/SSL_TCP (77 ms)
[ RUN ] Parameters/TestRpc.RpcPendingConnectionsMetric/SSL_TCP
I20260926 22:40:09.215478 28512 acceptor_pool.cc:254] collecting diagnostics on the listening RPC socket 0.0.0.0:35869 every 8 connection(s)
I20260926 22:40:09.215523 28513 acceptor_pool.cc:254] collecting diagnostics on the listening RPC socket 0.0.0.0:35869 every 8 connection(s)
W20260926 22:40:09.216300 28508 negotiation.cc:337] Failed RPC negotiation. Trace:
0926 22:40:09.216112 (+ 0us) reactor.cc:625] Submitting negotiation task for server connection from 127.0.0.1:56060 (local address 127.0.0.1:35869)
0926 22:40:09.216159 (+ 47us) server_negotiation.cc:206] Beginning negotiation
0926 22:40:09.216161 (+ 2us) server_negotiation.cc:399] Waiting for connection header
0926 22:40:09.216241 (+ 80us) negotiation.cc:327] Negotiation complete: Network error: Server connection negotiation failed: server connection from 127.0.0.1:56060: BlockingRecv error: recv got EOF from 127.0.0.1:56060 (error 108)
Metrics: {"server-negotiator.queue_time_us":17}
[ OK ] Parameters/TestRpc.RpcPendingConnectionsMetric/SSL_TCP (19 ms)
[ RUN ] Parameters/TestRpc.TestRpcContextClientDeadline/SSL_TCP
I20260926 22:40:09.247784 28528 acceptor_pool.cc:254] collecting diagnostics on the listening RPC socket 0.0.0.0:45729 every 8 connection(s)
I20260926 22:40:09.247845 28529 acceptor_pool.cc:254] collecting diagnostics on the listening RPC socket 0.0.0.0:45729 every 8 connection(s)
[ OK ] Parameters/TestRpc.TestRpcContextClientDeadline/SSL_TCP (58 ms)
[ RUN ] Parameters/TestRpc.TestApplicationFeatureFlagUnsupportedServer/SSL_TCP
I20260926 22:40:09.303143 28553 acceptor_pool.cc:254] collecting diagnostics on the listening RPC socket 0.0.0.0:44591 every 8 connection(s)
I20260926 22:40:09.303156 28554 acceptor_pool.cc:254] collecting diagnostics on the listening RPC socket 0.0.0.0:44591 every 8 connection(s)
[ OK ] Parameters/TestRpc.TestApplicationFeatureFlagUnsupportedServer/SSL_TCP (34 ms)
[ RUN ] Parameters/TestRpc.TestCancellationAsync/SSL_TCP
I20260926 22:40:09.331496 28578 acceptor_pool.cc:254] collecting diagnostics on the listening RPC socket 0.0.0.0:45925 every 8 connection(s)
I20260926 22:40:09.331539 28579 acceptor_pool.cc:254] collecting diagnostics on the listening RPC socket 0.0.0.0:45925 every 8 connection(s)
I20260926 22:40:09.331694 28146 rpc-test.cc:1716] Connecting to 0.0.0.0:45925
I20260926 22:40:09.339692 28146 test_util.cc:268] Using random seed: -2082180310
I20260926 22:40:09.355751 28582 rpc-test-base.h:240] got call: sleep_micros: 500 pattern: 4294967295 num_repetitions: 2097152 sidecar_idx: 0
I20260926 22:40:09.368223 28582 rpc-test-base.h:240] got call: sleep_micros: 500 pattern: 4294967295 num_repetitions: 2097152 sidecar_idx: 0
I20260926 22:40:09.380560 28582 rpc-test-base.h:240] got call: sleep_micros: 500 pattern: 4294967295 num_repetitions: 2097152 sidecar_idx: 0
I20260926 22:40:09.394132 28582 rpc-test-base.h:240] got call: sleep_micros: 500 pattern: 4294967295 num_repetitions: 2097152 sidecar_idx: 0
I20260926 22:40:09.408104 28582 rpc-test-base.h:240] got call: sleep_micros: 500 pattern: 4294967295 num_repetitions: 2097152 sidecar_idx: 0
I20260926 22:40:09.422361 28582 rpc-test-base.h:240] got call: sleep_micros: 500 pattern: 4294967295 num_repetitions: 2097152 sidecar_idx: 0
I20260926 22:40:09.435866 28582 rpc-test-base.h:240] got call: sleep_micros: 500 pattern: 4294967295 num_repetitions: 2097152 sidecar_idx: 0
I20260926 22:40:09.449823 28582 rpc-test-base.h:240] got call: sleep_micros: 500 pattern: 4294967295 num_repetitions: 2097152 sidecar_idx: 0
W20260926 22:40:09.453109 28577 connection.cc:441] server connection from 127.0.0.1:49860 torn down before Call kudu.rpc.GenericCalculatorService.SleepWithSidecar from 127.0.0.1:49860 (request call id 9) could send its response
[ OK ] Parameters/TestRpc.TestCancellationAsync/SSL_TCP (133 ms)
[ RUN ] Parameters/TestRpc.TestPerformanceBySocketType/SSL_TCP
I20260926 22:40:09.466303 28603 acceptor_pool.cc:254] collecting diagnostics on the listening RPC socket 0.0.0.0:38403 every 8 connection(s)
I20260926 22:40:09.466351 28604 acceptor_pool.cc:254] collecting diagnostics on the listening RPC socket 0.0.0.0:38403 every 8 connection(s)
I20260926 22:40:09.466513 28146 rpc-test.cc:1846] Connecting to 0.0.0.0:38403
I20260926 22:40:11.240633 28146 rpc-test.cc:1859] Sending 1024MB via ssl-enabled tcp socket: real 1.755s user 1.704s sys 1.404s
I20260926 22:40:12.989840 28146 rpc-test.cc:1859] Sending 1024MB via ssl-enabled tcp socket: real 1.749s user 1.567s sys 1.514s
I20260926 22:40:14.668236 28146 rpc-test.cc:1859] Sending 1024MB via ssl-enabled tcp socket: real 1.678s user 1.383s sys 1.579s
I20260926 22:40:16.363855 28146 rpc-test.cc:1859] Sending 1024MB via ssl-enabled tcp socket: real 1.695s user 1.543s sys 1.455s
I20260926 22:40:18.077570 28146 rpc-test.cc:1859] Sending 1024MB via ssl-enabled tcp socket: real 1.714s user 1.472s sys 1.538s
[ OK ] Parameters/TestRpc.TestPerformanceBySocketType/SSL_TCP (8624 ms)
[----------] 20 tests from Parameters/TestRpc (31041 ms total)
[----------] 1 test from Parameters/TestRpcSocketTxRxQueue
[ RUN ] Parameters/TestRpcSocketTxRxQueue.OverCapacity/0
W20260926 22:40:18.349622 28620 negotiation.cc:337] Failed RPC negotiation. Trace:
0926 22:40:18.086023 (+ 0us) reactor.cc:625] Submitting negotiation task for client connection to 0.0.0.0:46113 (local address 127.0.0.1:56302)
0926 22:40:18.086081 (+ 58us) negotiation.cc:107] Waiting for socket to connect
0926 22:40:18.086091 (+ 10us) client_negotiation.cc:174] Beginning negotiation
0926 22:40:18.086147 (+ 56us) client_negotiation.cc:252] Sending NEGOTIATE NegotiatePB request
0926 22:40:18.349461 (+263314us) negotiation.cc:327] Negotiation complete: Network error: Client connection negotiation failed: client connection to 0.0.0.0:46113: BlockingRecv error: recv error from unknown peer: Transport endpoint is not connected (error 107)
Metrics: {"client-negotiator.queue_time_us":35}
W20260926 22:40:18.349668 28647 negotiation.cc:337] Failed RPC negotiation. Trace:
0926 22:40:18.088907 (+ 0us) reactor.cc:625] Submitting negotiation task for client connection to 0.0.0.0:46113 (local address 127.0.0.1:56330)
0926 22:40:18.088969 (+ 62us) negotiation.cc:107] Waiting for socket to connect
0926 22:40:18.088978 (+ 9us) client_negotiation.cc:174] Beginning negotiation
0926 22:40:18.089026 (+ 48us) client_negotiation.cc:252] Sending NEGOTIATE NegotiatePB request
0926 22:40:18.349628 (+260602us) negotiation.cc:327] Negotiation complete: Network error: Client connection negotiation failed: client connection to 0.0.0.0:46113: BlockingRecv error: recv error from unknown peer: Transport endpoint is not connected (error 107)
Metrics: {"client-negotiator.queue_time_us":36}
W20260926 22:40:18.349622 28629 negotiation.cc:337] Failed RPC negotiation. Trace:
0926 22:40:18.086911 (+ 0us) reactor.cc:625] Submitting negotiation task for client connection to 0.0.0.0:46113 (local address 127.0.0.1:56304)
0926 22:40:18.086974 (+ 63us) negotiation.cc:107] Waiting for socket to connect
0926 22:40:18.086985 (+ 11us) client_negotiation.cc:174] Beginning negotiation
0926 22:40:18.087041 (+ 56us) client_negotiation.cc:252] Sending NEGOTIATE NegotiatePB request
0926 22:40:18.349461 (+262420us) negotiation.cc:327] Negotiation complete: Network error: Client connection negotiation failed: client connection to 0.0.0.0:46113: BlockingRecv error: recv error from unknown peer: Transport endpoint is not connected (error 107)
Metrics: {"client-negotiator.queue_time_us":35}
W20260926 22:40:18.349668 28638 negotiation.cc:337] Failed RPC negotiation. Trace:
0926 22:40:18.088026 (+ 0us) reactor.cc:625] Submitting negotiation task for client connection to 0.0.0.0:46113 (local address 127.0.0.1:56316)
0926 22:40:18.088065 (+ 39us) negotiation.cc:107] Waiting for socket to connect
0926 22:40:18.088072 (+ 7us) client_negotiation.cc:174] Beginning negotiation
0926 22:40:18.088135 (+ 63us) client_negotiation.cc:252] Sending NEGOTIATE NegotiatePB request
0926 22:40:18.349589 (+261454us) negotiation.cc:327] Negotiation complete: Network error: Client connection negotiation failed: client connection to 0.0.0.0:46113: BlockingRecv error: recv error from unknown peer: Transport endpoint is not connected (error 107)
Metrics: {"client-negotiator.queue_time_us":16}
W20260926 22:40:18.349802 28665 negotiation.cc:337] Failed RPC negotiation. Trace:
0926 22:40:18.090646 (+ 0us) reactor.cc:625] Submitting negotiation task for client connection to 0.0.0.0:46113 (local address 127.0.0.1:56354)
0926 22:40:18.090686 (+ 40us) negotiation.cc:107] Waiting for socket to connect
0926 22:40:18.090695 (+ 9us) client_negotiation.cc:174] Beginning negotiation
0926 22:40:18.090751 (+ 56us) client_negotiation.cc:252] Sending NEGOTIATE NegotiatePB request
0926 22:40:18.349764 (+259013us) negotiation.cc:327] Negotiation complete: Network error: Client connection negotiation failed: client connection to 0.0.0.0:46113: BlockingRecv error: recv error from unknown peer: Transport endpoint is not connected (error 107)
Metrics: {"client-negotiator.queue_time_us":16}
W20260926 22:40:18.349798 28656 negotiation.cc:337] Failed RPC negotiation. Trace:
0926 22:40:18.089822 (+ 0us) reactor.cc:625] Submitting negotiation task for client connection to 0.0.0.0:46113 (local address 127.0.0.1:56340)
0926 22:40:18.089892 (+ 70us) negotiation.cc:107] Waiting for socket to connect
0926 22:40:18.089900 (+ 8us) client_negotiation.cc:174] Beginning negotiation
0926 22:40:18.089936 (+ 36us) client_negotiation.cc:252] Sending NEGOTIATE NegotiatePB request
0926 22:40:18.349753 (+259817us) negotiation.cc:327] Negotiation complete: Network error: Client connection negotiation failed: client connection to 0.0.0.0:46113: BlockingRecv error: recv error from unknown peer: Transport endpoint is not connected (error 107)
Metrics: {"client-negotiator.queue_time_us":50}
[ OK ] Parameters/TestRpcSocketTxRxQueue.OverCapacity/0 (1026 ms)
[----------] 1 test from Parameters/TestRpcSocketTxRxQueue (1026 ms total)
[----------] Global test environment tear-down
[==========] 21 tests from 2 test suites ran. (32068 ms total)
[ PASSED ] 20 tests.
[ FAILED ] 1 test, listed below:
[ FAILED ] Parameters/TestRpc.TestCallWithChainCertAndChainCA/SSL_TCP, where GetParam() = (true, false)
1 FAILED TEST