Diagnosed failure

Parameters/TestRpc.TestCallWithChainCertAndChainCA/SSL_TCP: /data0/somelongdirectorytoavoidrpathissues/src/kudu/src/kudu/rpc/rpc-test.cc:270: Failure
Failed
Bad status: Runtime error: could not verify certificate chain (error with cert: subject=CN = localhost, ST = sadfjas, C = AS, emailAddress = sdflkdsajf, O = lskdfjlsad, OU = sldfkja, issuer=C = AS, ST = ASDfkjdhf, L = lskdjf, O = saldfja, OU = skdjf, CN = localhost, emailAddress = sadjflkadsj): : certificate has expired
Google Test trace:
/data0/somelongdirectorytoavoidrpathissues/src/kudu/src/kudu/rpc/rpc-test.cc:267: Connecting to 0.0.0.0:43941
I20260924 12:47:44.516724  9808 test_util.cc:175] -----------------------------------------------
I20260924 12:47:44.516809  9808 test_util.cc:176] Had fatal failures, leaving test files at /tmp/dist-test-taskVKxhOt/test-tmp/rpc-test.5.Parameters_TestRpc.TestCallWithChainCertAndChainCA_SSL_TCP.1790254064388882-9808-0

Full log

Note: This is test shard 6 of 8.
[==========] Running 21 tests from 2 test suites.
[----------] Global test environment set-up.
[----------] 20 tests from Parameters/TestRpc
[ RUN      ] Parameters/TestRpc.TestMessengerCreateDestroy/SSL_TCP
WARNING: Logging before InitGoogleLogging() is written to STDERR
I20260924 12:47:44.452739  9808 rpc-test.cc:169] started messenger TestCreateDestroy
[       OK ] Parameters/TestRpc.TestMessengerCreateDestroy/SSL_TCP (47 ms)
[ RUN      ] Parameters/TestRpc.TestNegotiationDeadlock/SSL_TCP
I20260924 12:47:44.477196  9828 acceptor_pool.cc:254] collecting diagnostics on the listening RPC socket 0.0.0.0:33955 every 8 connection(s)
I20260924 12:47:44.477497  9829 acceptor_pool.cc:254] collecting diagnostics on the listening RPC socket 0.0.0.0:33955 every 8 connection(s)
[       OK ] Parameters/TestRpc.TestNegotiationDeadlock/SSL_TCP (40 ms)
[ RUN      ] Parameters/TestRpc.TestCallWithChainCertAndChainCA/SSL_TCP
I20260924 12:47:44.505815  9844 acceptor_pool.cc:254] collecting diagnostics on the listening RPC socket 0.0.0.0:43941 every 8 connection(s)
I20260924 12:47:44.506160  9845 acceptor_pool.cc:254] collecting diagnostics on the listening RPC socket 0.0.0.0:43941 every 8 connection(s)
/data0/somelongdirectorytoavoidrpathissues/src/kudu/src/kudu/rpc/rpc-test.cc:270: Failure
Failed
Bad status: Runtime error: could not verify certificate chain (error with cert: subject=CN = localhost, ST = sadfjas, C = AS, emailAddress = sdflkdsajf, O = lskdfjlsad, OU = sldfkja, issuer=C = AS, ST = ASDfkjdhf, L = lskdjf, O = saldfja, OU = skdjf, CN = localhost, emailAddress = sadjflkadsj): : certificate has expired
Google Test trace:
/data0/somelongdirectorytoavoidrpathissues/src/kudu/src/kudu/rpc/rpc-test.cc:267: Connecting to 0.0.0.0:43941
I20260924 12:47:44.516724  9808 test_util.cc:175] -----------------------------------------------
I20260924 12:47:44.516809  9808 test_util.cc:176] Had fatal failures, leaving test files at /tmp/dist-test-taskVKxhOt/test-tmp/rpc-test.5.Parameters_TestRpc.TestCallWithChainCertAndChainCA_SSL_TCP.1790254064388882-9808-0
[  FAILED  ] Parameters/TestRpc.TestCallWithChainCertAndChainCA/SSL_TCP, where GetParam() = (true, false) (20 ms)
[ RUN      ] Parameters/TestRpc.TestCallWithPasswordProtectedKey/SSL_TCP
I20260924 12:47:44.529642  9869 acceptor_pool.cc:254] collecting diagnostics on the listening RPC socket 0.0.0.0:34305 every 8 connection(s)
I20260924 12:47:44.529881  9870 acceptor_pool.cc:254] collecting diagnostics on the listening RPC socket 0.0.0.0:34305 every 8 connection(s)
[       OK ] Parameters/TestRpc.TestCallWithPasswordProtectedKey/SSL_TCP (46 ms)
[ RUN      ] Parameters/TestRpc.TestCallToBadServer/SSL_TCP
I20260924 12:47:44.578378  9808 rpc-test.cc:394] Status: Network error: Client connection negotiation failed: client connection to 0.0.0.0:0: connect: Connection refused (error 111)
I20260924 12:47:44.579070  9808 rpc-test.cc:394] Status: Network error: Client connection negotiation failed: client connection to 0.0.0.0:0: connect: Connection refused (error 111)
I20260924 12:47:44.579700  9808 rpc-test.cc:394] Status: Network error: Client connection negotiation failed: client connection to 0.0.0.0:0: connect: Connection refused (error 111)
I20260924 12:47:44.580219  9808 rpc-test.cc:394] Status: Network error: Client connection negotiation failed: client connection to 0.0.0.0:0: connect: Connection refused (error 111)
I20260924 12:47:44.580726  9808 rpc-test.cc:394] Status: Network error: Client connection negotiation failed: client connection to 0.0.0.0:0: connect: Connection refused (error 111)
[       OK ] Parameters/TestRpc.TestCallToBadServer/SSL_TCP (19 ms)
[ RUN      ] Parameters/TestRpc.TestWrongService/SSL_TCP
I20260924 12:47:44.596853  9904 acceptor_pool.cc:254] collecting diagnostics on the listening RPC socket 0.0.0.0:36773 every 8 connection(s)
I20260924 12:47:44.597260  9905 acceptor_pool.cc:254] collecting diagnostics on the listening RPC socket 0.0.0.0:36773 every 8 connection(s)
I20260924 12:47:44.627429  9901 messenger.cc:345] service WrongServiceName not registered on TestServer
[       OK ] Parameters/TestRpc.TestWrongService/SSL_TCP (49 ms)
[ RUN      ] Parameters/TestRpc.TestConnectionKeepalive/SSL_TCP
I20260924 12:47:44.641911  9927 acceptor_pool.cc:254] collecting diagnostics on the listening RPC socket 0.0.0.0:45279 every 8 connection(s)
I20260924 12:47:44.642148  9928 acceptor_pool.cc:254] collecting diagnostics on the listening RPC socket 0.0.0.0:45279 every 8 connection(s)
I20260924 12:47:44.643038  9808 rpc-test.cc:488] Connecting to 0.0.0.0:45279
[       OK ] Parameters/TestRpc.TestConnectionKeepalive/SSL_TCP (1040 ms)
[ RUN      ] Parameters/TestRpc.TestClientConnectionMetrics/SSL_TCP
I20260924 12:47:45.698216  9952 acceptor_pool.cc:254] collecting diagnostics on the listening RPC socket 0.0.0.0:34571 every 8 connection(s)
I20260924 12:47:45.698508  9953 acceptor_pool.cc:254] collecting diagnostics on the listening RPC socket 0.0.0.0:34571 every 8 connection(s)
I20260924 12:47:45.699483  9808 rpc-test.cc:569] Connecting to 0.0.0.0:34571
[       OK ] Parameters/TestRpc.TestClientConnectionMetrics/SSL_TCP (19807 ms)
[ RUN      ] Parameters/TestRpc.TestCredentialsPolicy/SSL_TCP
I20260924 12:48:05.494489  9975 acceptor_pool.cc:254] collecting diagnostics on the listening RPC socket 0.0.0.0:37047 every 8 connection(s)
I20260924 12:48:05.494720  9976 acceptor_pool.cc:254] collecting diagnostics on the listening RPC socket 0.0.0.0:37047 every 8 connection(s)
I20260924 12:48:05.495589  9808 rpc-test.cc:700] Connecting to 0.0.0.0:37047
[       OK ] Parameters/TestRpc.TestCredentialsPolicy/SSL_TCP (45 ms)
[ RUN      ] Parameters/TestRpc.TestCallLongerThanKeepalive/SSL_TCP
I20260924 12:48:05.551108 10000 acceptor_pool.cc:254] collecting diagnostics on the listening RPC socket 0.0.0.0:46001 every 8 connection(s)
I20260924 12:48:05.551395 10001 acceptor_pool.cc:254] collecting diagnostics on the listening RPC socket 0.0.0.0:46001 every 8 connection(s)
I20260924 12:48:05.572461 10004 rpc-test-base.h:222] got call: sleep_micros: 3000000 deferred: true
I20260924 12:48:08.574175 10004 rpcz_store.cc:275] Call kudu.rpc.GenericCalculatorService.Sleep from 127.0.0.1:44986 (request call id 0) took 3001 ms. Trace:
I20260924 12:48:08.574343 10004 rpcz_store.cc:276] 0924 12:48:05.572350 (+     0us) service_pool.cc:170] Inserting onto call queue
0924 12:48:05.572418 (+    68us) service_pool.cc:227] Handling call
0924 12:48:08.574128 (+3001710us) inbound_call.cc:173] Queueing success response
Metrics: {}
[       OK ] Parameters/TestRpc.TestCallLongerThanKeepalive/SSL_TCP (3055 ms)
[ RUN      ] Parameters/TestRpc.TestRpcSidecar/SSL_TCP
I20260924 12:48:08.605073 10025 acceptor_pool.cc:254] collecting diagnostics on the listening RPC socket 0.0.0.0:46505 every 8 connection(s)
I20260924 12:48:08.605319 10026 acceptor_pool.cc:254] collecting diagnostics on the listening RPC socket 0.0.0.0:46505 every 8 connection(s)
[       OK ] Parameters/TestRpc.TestRpcSidecar/SSL_TCP (114 ms)
[ RUN      ] Parameters/TestRpc.TestRpcSidecarLimits/SSL_TCP
I20260924 12:48:10.665572 10050 acceptor_pool.cc:254] collecting diagnostics on the listening RPC socket 0.0.0.0:40961 every 8 connection(s)
I20260924 12:48:10.665876 10051 acceptor_pool.cc:254] collecting diagnostics on the listening RPC socket 0.0.0.0:40961 every 8 connection(s)
W20260924 12:48:10.682662  9808 serialization.cc:72] Serialized kudu.rpc_test.PushStringsRequestPB (2147483654 bytes) is larger than the maximum configured RPC message size (52428800 bytes). Sending anyway, but peer may reject the data.
W20260924 12:48:10.689303 10047 connection.cc:535] server connection from 127.0.0.1:32820 recv error: Network error: RPC frame had a length of 2147483714, but we only support messages up to 52428800 bytes long.
W20260924 12:48:10.689461 10047 connection.cc:158] shutting down server connection from 127.0.0.1:32820 with pending inbound data: 4/2147483714 bytes received; last active 0 ns ago: status Network error: RPC frame had a length of 2147483714, but we only support messages up to 52428800 bytes long.
W20260924 12:48:10.690042 10063 connection.cc:196] Error closing socket: Network error: TlsSocket::Close: Connection reset by peer
I20260924 12:48:10.704039 10075 acceptor_pool.cc:254] collecting diagnostics on the listening RPC socket 0.0.0.0:36145 every 8 connection(s)
I20260924 12:48:10.704217 10076 acceptor_pool.cc:254] collecting diagnostics on the listening RPC socket 0.0.0.0:36145 every 8 connection(s)
W20260924 12:48:15.794859 10073 connection.cc:577] server connection from 127.0.0.1:41432: received bad data: 'Corruption: Invalid packet: message had a length of 2147483710, but we only support messages up to 2147483647 bytes
'
[       OK ] Parameters/TestRpc.TestRpcSidecarLimits/SSL_TCP (7582 ms)
[ RUN      ] Parameters/TestRpc.TestCallTimeoutDoesntAffectNegotiation/SSL_TCP
I20260924 12:48:16.310182 10100 acceptor_pool.cc:254] collecting diagnostics on the listening RPC socket 0.0.0.0:40041 every 8 connection(s)
I20260924 12:48:16.310499 10101 acceptor_pool.cc:254] collecting diagnostics on the listening RPC socket 0.0.0.0:40041 every 8 connection(s)
W20260924 12:48:16.319626 10096 negotiation.cc:266] Injecting 500ms delay in negotiation
I20260924 12:48:16.370186  9808 rpc-test-base.h:595] status: Timed out: connection negotiation to 0.0.0.0:40041 for RPC Sleep timed out after 0.050s (ON_OUTBOUND_QUEUE), seconds elapsed: 0.0511579
[       OK ] Parameters/TestRpc.TestCallTimeoutDoesntAffectNegotiation/SSL_TCP (551 ms)
[ RUN      ] Parameters/TestRpc.TestRpcHandlerLatencyMetric/SSL_TCP
I20260924 12:48:16.853322 10125 acceptor_pool.cc:254] collecting diagnostics on the listening RPC socket 0.0.0.0:33459 every 8 connection(s)
I20260924 12:48:16.853557 10126 acceptor_pool.cc:254] collecting diagnostics on the listening RPC socket 0.0.0.0:33459 every 8 connection(s)
I20260924 12:48:16.905187  9808 rpc-test.cc:1236] Sleep() min lat: 20684
I20260924 12:48:16.905299  9808 rpc-test.cc:1237] Sleep() mean lat: 20684
I20260924 12:48:16.905356  9808 rpc-test.cc:1238] Sleep() max lat: 20684
I20260924 12:48:16.905395  9808 rpc-test.cc:1239] Sleep() #calls: 1
[       OK ] Parameters/TestRpc.TestRpcHandlerLatencyMetric/SSL_TCP (79 ms)
[ RUN      ] Parameters/TestRpc.TimedOutOnResponseMetricServiceQueue/SSL_TCP
I20260924 12:48:16.932574 10151 acceptor_pool.cc:254] collecting diagnostics on the listening RPC socket 0.0.0.0:45593 every 8 connection(s)
I20260924 12:48:16.932806 10152 acceptor_pool.cc:254] collecting diagnostics on the listening RPC socket 0.0.0.0:45593 every 8 connection(s)
W20260924 12:48:16.994406 10153 rpcz_store.cc:267] Call kudu.rpc_test.CalculatorService.Sleep from 127.0.0.1:57136 (request call id 2) took 20 ms (client timeout 20 ms). Trace:
W20260924 12:48:16.994618 10153 rpcz_store.cc:269] 0924 12:48:16.973902 (+     0us) service_pool.cc:170] Inserting onto call queue
0924 12:48:16.994288 (+ 20386us) service_pool.cc:214] Skipping call since client already timed out
0924 12:48:16.994369 (+    81us) inbound_call.cc:173] Queueing failure response
Metrics: {}
[       OK ] Parameters/TestRpc.TimedOutOnResponseMetricServiceQueue/SSL_TCP (88 ms)
[ RUN      ] Parameters/TestRpc.RpcPendingConnectionsMetric/SSL_TCP
I20260924 12:48:17.004010 10174 acceptor_pool.cc:254] collecting diagnostics on the listening RPC socket 0.0.0.0:43169 every 8 connection(s)
I20260924 12:48:17.004237 10175 acceptor_pool.cc:254] collecting diagnostics on the listening RPC socket 0.0.0.0:43169 every 8 connection(s)
W20260924 12:48:17.006237 10170 negotiation.cc:337] Failed RPC negotiation. Trace:
0924 12:48:17.005631 (+     0us) reactor.cc:625] Submitting negotiation task for server connection from 127.0.0.1:52792 (local address 127.0.0.1:43169)
0924 12:48:17.005804 (+   173us) server_negotiation.cc:206] Beginning negotiation
0924 12:48:17.005809 (+     5us) server_negotiation.cc:399] Waiting for connection header
0924 12:48:17.005939 (+   130us) negotiation.cc:327] Negotiation complete: Network error: Server connection negotiation failed: server connection from 127.0.0.1:52792: BlockingRecv error: recv got EOF from 127.0.0.1:52792 (error 108)
Metrics: {"server-negotiator.queue_time_us":53}
[       OK ] Parameters/TestRpc.RpcPendingConnectionsMetric/SSL_TCP (19 ms)
[ RUN      ] Parameters/TestRpc.TestRpcContextClientDeadline/SSL_TCP
I20260924 12:48:17.067802 10190 acceptor_pool.cc:254] collecting diagnostics on the listening RPC socket 0.0.0.0:42587 every 8 connection(s)
I20260924 12:48:17.068039 10191 acceptor_pool.cc:254] collecting diagnostics on the listening RPC socket 0.0.0.0:42587 every 8 connection(s)
[       OK ] Parameters/TestRpc.TestRpcContextClientDeadline/SSL_TCP (98 ms)
[ RUN      ] Parameters/TestRpc.TestApplicationFeatureFlagUnsupportedServer/SSL_TCP
I20260924 12:48:17.137547 10215 acceptor_pool.cc:254] collecting diagnostics on the listening RPC socket 0.0.0.0:39741 every 8 connection(s)
I20260924 12:48:17.137782 10216 acceptor_pool.cc:254] collecting diagnostics on the listening RPC socket 0.0.0.0:39741 every 8 connection(s)
[       OK ] Parameters/TestRpc.TestApplicationFeatureFlagUnsupportedServer/SSL_TCP (54 ms)
[ RUN      ] Parameters/TestRpc.TestCancellationAsync/SSL_TCP
I20260924 12:48:17.196581 10240 acceptor_pool.cc:254] collecting diagnostics on the listening RPC socket 0.0.0.0:35743 every 8 connection(s)
I20260924 12:48:17.196856 10241 acceptor_pool.cc:254] collecting diagnostics on the listening RPC socket 0.0.0.0:35743 every 8 connection(s)
I20260924 12:48:17.197722  9808 rpc-test.cc:1716] Connecting to 0.0.0.0:35743
I20260924 12:48:17.213006  9808 test_util.cc:268] Using random seed: 59090479
I20260924 12:48:17.250707 10244 rpc-test-base.h:240] got call: sleep_micros: 500 pattern: 4294967295 num_repetitions: 2097152 sidecar_idx: 0
I20260924 12:48:17.273087 10243 rpc-test-base.h:240] got call: sleep_micros: 500 pattern: 4294967295 num_repetitions: 2097152 sidecar_idx: 0
I20260924 12:48:17.300904 10242 rpc-test-base.h:240] got call: sleep_micros: 500 pattern: 4294967295 num_repetitions: 2097152 sidecar_idx: 0
I20260924 12:48:17.328722 10244 rpc-test-base.h:240] got call: sleep_micros: 500 pattern: 4294967295 num_repetitions: 2097152 sidecar_idx: 0
I20260924 12:48:17.360530 10243 rpc-test-base.h:240] got call: sleep_micros: 500 pattern: 4294967295 num_repetitions: 2097152 sidecar_idx: 0
W20260924 12:48:17.388331 10237 connection.cc:196] Error closing socket: Network error: TlsSocket::Close: Broken pipe
W20260924 12:48:17.390630 10237 connection.cc:441] server connection from 127.0.0.1:50352 torn down before Call kudu.rpc.GenericCalculatorService.SleepWithSidecar from 127.0.0.1:50352 (request call id 7) could send its response
W20260924 12:48:17.407461 10237 connection.cc:441] server connection from 127.0.0.1:50352 torn down before Call kudu.rpc.GenericCalculatorService.SleepWithSidecar from 127.0.0.1:50352 (request call id 8) could send its response
[       OK ] Parameters/TestRpc.TestCancellationAsync/SSL_TCP (237 ms)
[ RUN      ] Parameters/TestRpc.TestPerformanceBySocketType/SSL_TCP
I20260924 12:48:17.428660 10265 acceptor_pool.cc:254] collecting diagnostics on the listening RPC socket 0.0.0.0:36877 every 8 connection(s)
I20260924 12:48:17.428898 10266 acceptor_pool.cc:254] collecting diagnostics on the listening RPC socket 0.0.0.0:36877 every 8 connection(s)
I20260924 12:48:17.429834  9808 rpc-test.cc:1846] Connecting to 0.0.0.0:36877
I20260924 12:48:20.283111  9808 rpc-test.cc:1859] Sending 1024MB via ssl-enabled tcp socket: real 2.837s	user 2.651s	sys 2.064s
I20260924 12:48:23.203598  9808 rpc-test.cc:1859] Sending 1024MB via ssl-enabled tcp socket: real 2.920s	user 2.765s	sys 2.114s
I20260924 12:48:26.054005  9808 rpc-test.cc:1859] Sending 1024MB via ssl-enabled tcp socket: real 2.850s	user 2.675s	sys 2.038s
I20260924 12:48:28.914381  9808 rpc-test.cc:1859] Sending 1024MB via ssl-enabled tcp socket: real 2.860s	user 2.630s	sys 2.118s
I20260924 12:48:31.787756  9808 rpc-test.cc:1859] Sending 1024MB via ssl-enabled tcp socket: real 2.873s	user 2.667s	sys 2.076s
[       OK ] Parameters/TestRpc.TestPerformanceBySocketType/SSL_TCP (14383 ms)
[----------] 20 tests from Parameters/TestRpc (47386 ms total)

[----------] 1 test from Parameters/TestRpcSocketTxRxQueue
[ RUN      ] Parameters/TestRpcSocketTxRxQueue.OverCapacity/0
W20260924 12:48:32.096529 10291 negotiation.cc:337] Failed RPC negotiation. Trace:
0924 12:48:31.806710 (+     0us) reactor.cc:625] Submitting negotiation task for client connection to 0.0.0.0:42711 (local address 127.0.0.1:34250)
0924 12:48:31.806886 (+   176us) negotiation.cc:107] Waiting for socket to connect
0924 12:48:31.806901 (+    15us) client_negotiation.cc:174] Beginning negotiation
0924 12:48:31.806991 (+    90us) client_negotiation.cc:252] Sending NEGOTIATE NegotiatePB request
0924 12:48:32.096184 (+289193us) negotiation.cc:327] Negotiation complete: Network error: Client connection negotiation failed: client connection to 0.0.0.0:42711: BlockingRecv error: recv error from unknown peer: Transport endpoint is not connected (error 107)
Metrics: {"client-negotiator.queue_time_us":59}
W20260924 12:48:32.096635 10282 negotiation.cc:337] Failed RPC negotiation. Trace:
0924 12:48:31.803966 (+     0us) reactor.cc:625] Submitting negotiation task for client connection to 0.0.0.0:42711 (local address 127.0.0.1:34240)
0924 12:48:31.804145 (+   179us) negotiation.cc:107] Waiting for socket to connect
0924 12:48:31.804169 (+    24us) client_negotiation.cc:174] Beginning negotiation
0924 12:48:31.804280 (+   111us) client_negotiation.cc:252] Sending NEGOTIATE NegotiatePB request
0924 12:48:32.096171 (+291891us) negotiation.cc:327] Negotiation complete: Network error: Client connection negotiation failed: client connection to 0.0.0.0:42711: BlockingRecv error: recv error from unknown peer: Transport endpoint is not connected (error 107)
Metrics: {"client-negotiator.queue_time_us":54}
W20260924 12:48:32.096689 10300 negotiation.cc:337] Failed RPC negotiation. Trace:
0924 12:48:31.809223 (+     0us) reactor.cc:625] Submitting negotiation task for client connection to 0.0.0.0:42711 (local address 127.0.0.1:34264)
0924 12:48:31.809418 (+   195us) negotiation.cc:107] Waiting for socket to connect
0924 12:48:31.809433 (+    15us) client_negotiation.cc:174] Beginning negotiation
0924 12:48:31.809518 (+    85us) client_negotiation.cc:252] Sending NEGOTIATE NegotiatePB request
0924 12:48:32.096171 (+286653us) negotiation.cc:327] Negotiation complete: Network error: Client connection negotiation failed: client connection to 0.0.0.0:42711: BlockingRecv error: recv error from unknown peer: Transport endpoint is not connected (error 107)
Metrics: {"client-negotiator.queue_time_us":78}
W20260924 12:48:32.097683 10309 negotiation.cc:337] Failed RPC negotiation. Trace:
0924 12:48:31.811707 (+     0us) reactor.cc:625] Submitting negotiation task for client connection to 0.0.0.0:42711 (local address 127.0.0.1:34272)
0924 12:48:31.811868 (+   161us) negotiation.cc:107] Waiting for socket to connect
0924 12:48:31.811886 (+    18us) client_negotiation.cc:174] Beginning negotiation
0924 12:48:31.811987 (+   101us) client_negotiation.cc:252] Sending NEGOTIATE NegotiatePB request
0924 12:48:32.096996 (+285009us) negotiation.cc:327] Negotiation complete: Network error: Client connection negotiation failed: client connection to 0.0.0.0:42711: BlockingRecv error: recv error from unknown peer: Transport endpoint is not connected (error 107)
Metrics: {"client-negotiator.queue_time_us":34}
W20260924 12:48:32.097920 10327 negotiation.cc:337] Failed RPC negotiation. Trace:
0924 12:48:31.817134 (+     0us) reactor.cc:625] Submitting negotiation task for client connection to 0.0.0.0:42711 (local address 127.0.0.1:34288)
0924 12:48:31.817308 (+   174us) negotiation.cc:107] Waiting for socket to connect
0924 12:48:31.817324 (+    16us) client_negotiation.cc:174] Beginning negotiation
0924 12:48:31.817411 (+    87us) client_negotiation.cc:252] Sending NEGOTIATE NegotiatePB request
0924 12:48:32.096711 (+279300us) negotiation.cc:327] Negotiation complete: Network error: Client connection negotiation failed: client connection to 0.0.0.0:42711: BlockingRecv error: recv error from unknown peer: Transport endpoint is not connected (error 107)
Metrics: {"client-negotiator.queue_time_us":51}
W20260924 12:48:32.102762 10318 negotiation.cc:337] Failed RPC negotiation. Trace:
0924 12:48:31.814283 (+     0us) reactor.cc:625] Submitting negotiation task for client connection to 0.0.0.0:42711 (local address 127.0.0.1:34286)
0924 12:48:31.814555 (+   272us) negotiation.cc:107] Waiting for socket to connect
0924 12:48:31.814574 (+    19us) client_negotiation.cc:174] Beginning negotiation
0924 12:48:31.814696 (+   122us) client_negotiation.cc:252] Sending NEGOTIATE NegotiatePB request
0924 12:48:32.098121 (+283425us) negotiation.cc:327] Negotiation complete: Network error: Client connection negotiation failed: client connection to 0.0.0.0:42711: BlockingRecv error: recv error from unknown peer: Transport endpoint is not connected (error 107)
Metrics: {"client-negotiator.queue_time_us":117}
[       OK ] Parameters/TestRpcSocketTxRxQueue.OverCapacity/0 (1061 ms)
[----------] 1 test from Parameters/TestRpcSocketTxRxQueue (1061 ms total)

[----------] Global test environment tear-down
[==========] 21 tests from 2 test suites ran. (48448 ms total)
[  PASSED  ] 20 tests.
[  FAILED  ] 1 test, listed below:
[  FAILED  ] Parameters/TestRpc.TestCallWithChainCertAndChainCA/SSL_TCP, where GetParam() = (true, false)

 1 FAILED TEST