Diagnosed failure

Parameters/TestRpc.TestCallWithChainCertAndChainCA/SSL_TCP: /data0/somelongdirectorytoavoidrpathissues/src/kudu/src/kudu/rpc/rpc-test.cc:270: Failure
Failed
Bad status: Runtime error: could not verify certificate chain (error with cert: subject=CN = localhost, ST = sadfjas, C = AS, emailAddress = sdflkdsajf, O = lskdfjlsad, OU = sldfkja, issuer=C = AS, ST = ASDfkjdhf, L = lskdjf, O = saldfja, OU = skdjf, CN = localhost, emailAddress = sadjflkadsj): : certificate has expired
Google Test trace:
/data0/somelongdirectorytoavoidrpathissues/src/kudu/src/kudu/rpc/rpc-test.cc:267: Connecting to 0.0.0.0:40767
I20260923 19:29:48.499006  1894 test_util.cc:175] -----------------------------------------------
I20260923 19:29:48.499071  1894 test_util.cc:176] Had fatal failures, leaving test files at /tmp/dist-test-task96fhKI/test-tmp/rpc-test.5.Parameters_TestRpc.TestCallWithChainCertAndChainCA_SSL_TCP.1790191788403320-1894-0

Full log

Note: This is test shard 6 of 8.
[==========] Running 21 tests from 2 test suites.
[----------] Global test environment set-up.
[----------] 20 tests from Parameters/TestRpc
[ RUN      ] Parameters/TestRpc.TestMessengerCreateDestroy/SSL_TCP
WARNING: Logging before InitGoogleLogging() is written to STDERR
I20260923 19:29:48.446458  1894 rpc-test.cc:169] started messenger TestCreateDestroy
[       OK ] Parameters/TestRpc.TestMessengerCreateDestroy/SSL_TCP (27 ms)
[ RUN      ] Parameters/TestRpc.TestNegotiationDeadlock/SSL_TCP
I20260923 19:29:48.459668  1914 acceptor_pool.cc:254] collecting diagnostics on the listening RPC socket 0.0.0.0:42449 every 8 connection(s)
I20260923 19:29:48.459967  1915 acceptor_pool.cc:254] collecting diagnostics on the listening RPC socket 0.0.0.0:42449 every 8 connection(s)
[       OK ] Parameters/TestRpc.TestNegotiationDeadlock/SSL_TCP (27 ms)
[ RUN      ] Parameters/TestRpc.TestCallWithChainCertAndChainCA/SSL_TCP
I20260923 19:29:48.488454  1930 acceptor_pool.cc:254] collecting diagnostics on the listening RPC socket 0.0.0.0:40767 every 8 connection(s)
I20260923 19:29:48.488818  1931 acceptor_pool.cc:254] collecting diagnostics on the listening RPC socket 0.0.0.0:40767 every 8 connection(s)
/data0/somelongdirectorytoavoidrpathissues/src/kudu/src/kudu/rpc/rpc-test.cc:270: Failure
Failed
Bad status: Runtime error: could not verify certificate chain (error with cert: subject=CN = localhost, ST = sadfjas, C = AS, emailAddress = sdflkdsajf, O = lskdfjlsad, OU = sldfkja, issuer=C = AS, ST = ASDfkjdhf, L = lskdjf, O = saldfja, OU = skdjf, CN = localhost, emailAddress = sadjflkadsj): : certificate has expired
Google Test trace:
/data0/somelongdirectorytoavoidrpathissues/src/kudu/src/kudu/rpc/rpc-test.cc:267: Connecting to 0.0.0.0:40767
I20260923 19:29:48.499006  1894 test_util.cc:175] -----------------------------------------------
I20260923 19:29:48.499071  1894 test_util.cc:176] Had fatal failures, leaving test files at /tmp/dist-test-task96fhKI/test-tmp/rpc-test.5.Parameters_TestRpc.TestCallWithChainCertAndChainCA_SSL_TCP.1790191788403320-1894-0
[  FAILED  ] Parameters/TestRpc.TestCallWithChainCertAndChainCA/SSL_TCP, where GetParam() = (true, false) (21 ms)
[ RUN      ] Parameters/TestRpc.TestCallWithPasswordProtectedKey/SSL_TCP
I20260923 19:29:48.520411  1955 acceptor_pool.cc:254] collecting diagnostics on the listening RPC socket 0.0.0.0:44289 every 8 connection(s)
I20260923 19:29:48.520668  1956 acceptor_pool.cc:254] collecting diagnostics on the listening RPC socket 0.0.0.0:44289 every 8 connection(s)
[       OK ] Parameters/TestRpc.TestCallWithPasswordProtectedKey/SSL_TCP (55 ms)
[ RUN      ] Parameters/TestRpc.TestCallToBadServer/SSL_TCP
I20260923 19:29:48.572475  1894 rpc-test.cc:394] Status: Network error: Client connection negotiation failed: client connection to 0.0.0.0:0: connect: Connection refused (error 111)
I20260923 19:29:48.573071  1894 rpc-test.cc:394] Status: Network error: Client connection negotiation failed: client connection to 0.0.0.0:0: connect: Connection refused (error 111)
I20260923 19:29:48.573593  1894 rpc-test.cc:394] Status: Network error: Client connection negotiation failed: client connection to 0.0.0.0:0: connect: Connection refused (error 111)
I20260923 19:29:48.574136  1894 rpc-test.cc:394] Status: Network error: Client connection negotiation failed: client connection to 0.0.0.0:0: connect: Connection refused (error 111)
I20260923 19:29:48.574646  1894 rpc-test.cc:394] Status: Network error: Client connection negotiation failed: client connection to 0.0.0.0:0: connect: Connection refused (error 111)
[       OK ] Parameters/TestRpc.TestCallToBadServer/SSL_TCP (21 ms)
[ RUN      ] Parameters/TestRpc.TestWrongService/SSL_TCP
I20260923 19:29:48.588599  1990 acceptor_pool.cc:254] collecting diagnostics on the listening RPC socket 0.0.0.0:41799 every 8 connection(s)
I20260923 19:29:48.588956  1991 acceptor_pool.cc:254] collecting diagnostics on the listening RPC socket 0.0.0.0:41799 every 8 connection(s)
I20260923 19:29:48.603864  1988 messenger.cc:345] service WrongServiceName not registered on TestServer
[       OK ] Parameters/TestRpc.TestWrongService/SSL_TCP (32 ms)
[ RUN      ] Parameters/TestRpc.TestConnectionKeepalive/SSL_TCP
I20260923 19:29:48.627776  2013 acceptor_pool.cc:254] collecting diagnostics on the listening RPC socket 0.0.0.0:38675 every 8 connection(s)
I20260923 19:29:48.628037  2014 acceptor_pool.cc:254] collecting diagnostics on the listening RPC socket 0.0.0.0:38675 every 8 connection(s)
I20260923 19:29:48.628921  1894 rpc-test.cc:488] Connecting to 0.0.0.0:38675
[       OK ] Parameters/TestRpc.TestConnectionKeepalive/SSL_TCP (1044 ms)
[ RUN      ] Parameters/TestRpc.TestClientConnectionMetrics/SSL_TCP
I20260923 19:29:49.672919  2038 acceptor_pool.cc:254] collecting diagnostics on the listening RPC socket 0.0.0.0:43623 every 8 connection(s)
I20260923 19:29:49.673139  2039 acceptor_pool.cc:254] collecting diagnostics on the listening RPC socket 0.0.0.0:43623 every 8 connection(s)
I20260923 19:29:49.673920  1894 rpc-test.cc:569] Connecting to 0.0.0.0:43623
[       OK ] Parameters/TestRpc.TestClientConnectionMetrics/SSL_TCP (19020 ms)
[ RUN      ] Parameters/TestRpc.TestCredentialsPolicy/SSL_TCP
I20260923 19:30:08.689740  2061 acceptor_pool.cc:254] collecting diagnostics on the listening RPC socket 0.0.0.0:35331 every 8 connection(s)
I20260923 19:30:08.689994  2062 acceptor_pool.cc:254] collecting diagnostics on the listening RPC socket 0.0.0.0:35331 every 8 connection(s)
I20260923 19:30:08.690853  1894 rpc-test.cc:700] Connecting to 0.0.0.0:35331
[       OK ] Parameters/TestRpc.TestCredentialsPolicy/SSL_TCP (62 ms)
[ RUN      ] Parameters/TestRpc.TestCallLongerThanKeepalive/SSL_TCP
I20260923 19:30:08.746928  2086 acceptor_pool.cc:254] collecting diagnostics on the listening RPC socket 0.0.0.0:44555 every 8 connection(s)
I20260923 19:30:08.747148  2087 acceptor_pool.cc:254] collecting diagnostics on the listening RPC socket 0.0.0.0:44555 every 8 connection(s)
I20260923 19:30:08.772658  2090 rpc-test-base.h:222] got call: sleep_micros: 3000000 deferred: true
I20260923 19:30:11.774096  2090 rpcz_store.cc:275] Call kudu.rpc.GenericCalculatorService.Sleep from 127.0.0.1:45388 (request call id 0) took 3001 ms. Trace:
I20260923 19:30:11.774247  2090 rpcz_store.cc:276] 0923 19:30:08.772542 (+     0us) service_pool.cc:170] Inserting onto call queue
0923 19:30:08.772590 (+    48us) service_pool.cc:227] Handling call
0923 19:30:11.774054 (+3001464us) inbound_call.cc:173] Queueing success response
Metrics: {}
[       OK ] Parameters/TestRpc.TestCallLongerThanKeepalive/SSL_TCP (3042 ms)
[ RUN      ] Parameters/TestRpc.TestRpcSidecar/SSL_TCP
I20260923 19:30:11.790997  2111 acceptor_pool.cc:254] collecting diagnostics on the listening RPC socket 0.0.0.0:38025 every 8 connection(s)
I20260923 19:30:11.791229  2112 acceptor_pool.cc:254] collecting diagnostics on the listening RPC socket 0.0.0.0:38025 every 8 connection(s)
[       OK ] Parameters/TestRpc.TestRpcSidecar/SSL_TCP (104 ms)
[ RUN      ] Parameters/TestRpc.TestRpcSidecarLimits/SSL_TCP
I20260923 19:30:13.881873  2136 acceptor_pool.cc:254] collecting diagnostics on the listening RPC socket 0.0.0.0:37117 every 8 connection(s)
I20260923 19:30:13.882138  2137 acceptor_pool.cc:254] collecting diagnostics on the listening RPC socket 0.0.0.0:37117 every 8 connection(s)
W20260923 19:30:13.907871  1894 serialization.cc:72] Serialized kudu.rpc_test.PushStringsRequestPB (2147483654 bytes) is larger than the maximum configured RPC message size (52428800 bytes). Sending anyway, but peer may reject the data.
W20260923 19:30:13.913635  2134 connection.cc:535] server connection from 127.0.0.1:36590 recv error: Network error: RPC frame had a length of 2147483714, but we only support messages up to 52428800 bytes long.
W20260923 19:30:13.913731  2134 connection.cc:158] shutting down server connection from 127.0.0.1:36590 with pending inbound data: 4/2147483714 bytes received; last active 0 ns ago: status Network error: RPC frame had a length of 2147483714, but we only support messages up to 52428800 bytes long.
W20260923 19:30:13.914191  2149 connection.cc:196] Error closing socket: Network error: TlsSocket::Close: Connection reset by peer
I20260923 19:30:13.927138  2161 acceptor_pool.cc:254] collecting diagnostics on the listening RPC socket 0.0.0.0:36937 every 8 connection(s)
I20260923 19:30:13.927481  2162 acceptor_pool.cc:254] collecting diagnostics on the listening RPC socket 0.0.0.0:36937 every 8 connection(s)
W20260923 19:30:18.981594  2160 connection.cc:577] server connection from 127.0.0.1:35508: received bad data: 'Corruption: Invalid packet: message had a length of 2147483710, but we only support messages up to 2147483647 bytes
'
[       OK ] Parameters/TestRpc.TestRpcSidecarLimits/SSL_TCP (7547 ms)
[ RUN      ] Parameters/TestRpc.TestCallTimeoutDoesntAffectNegotiation/SSL_TCP
I20260923 19:30:19.474498  2186 acceptor_pool.cc:254] collecting diagnostics on the listening RPC socket 0.0.0.0:34419 every 8 connection(s)
I20260923 19:30:19.474720  2187 acceptor_pool.cc:254] collecting diagnostics on the listening RPC socket 0.0.0.0:34419 every 8 connection(s)
W20260923 19:30:19.490478  2182 negotiation.cc:266] Injecting 500ms delay in negotiation
I20260923 19:30:19.540755  1894 rpc-test-base.h:595] status: Timed out: connection negotiation to 0.0.0.0:34419 for RPC Sleep timed out after 0.050s (ON_OUTBOUND_QUEUE), seconds elapsed: 0.0509137
[       OK ] Parameters/TestRpc.TestCallTimeoutDoesntAffectNegotiation/SSL_TCP (567 ms)
[ RUN      ] Parameters/TestRpc.TestRpcHandlerLatencyMetric/SSL_TCP
I20260923 19:30:20.021565  2211 acceptor_pool.cc:254] collecting diagnostics on the listening RPC socket 0.0.0.0:37995 every 8 connection(s)
I20260923 19:30:20.021776  2212 acceptor_pool.cc:254] collecting diagnostics on the listening RPC socket 0.0.0.0:37995 every 8 connection(s)
I20260923 19:30:20.060303  1894 rpc-test.cc:1236] Sleep() min lat: 20588
I20260923 19:30:20.060382  1894 rpc-test.cc:1237] Sleep() mean lat: 20588
I20260923 19:30:20.060425  1894 rpc-test.cc:1238] Sleep() max lat: 20588
I20260923 19:30:20.060454  1894 rpc-test.cc:1239] Sleep() #calls: 1
[       OK ] Parameters/TestRpc.TestRpcHandlerLatencyMetric/SSL_TCP (65 ms)
[ RUN      ] Parameters/TestRpc.TimedOutOnResponseMetricServiceQueue/SSL_TCP
I20260923 19:30:20.087387  2237 acceptor_pool.cc:254] collecting diagnostics on the listening RPC socket 0.0.0.0:46021 every 8 connection(s)
I20260923 19:30:20.087628  2238 acceptor_pool.cc:254] collecting diagnostics on the listening RPC socket 0.0.0.0:46021 every 8 connection(s)
W20260923 19:30:20.145833  2239 rpcz_store.cc:267] Call kudu.rpc_test.CalculatorService.Sleep from 127.0.0.1:34512 (request call id 2) took 20 ms (client timeout 20 ms). Trace:
W20260923 19:30:20.145983  2239 rpcz_store.cc:269] 0923 19:30:20.125485 (+     0us) service_pool.cc:170] Inserting onto call queue
0923 19:30:20.145715 (+ 20230us) service_pool.cc:214] Skipping call since client already timed out
0923 19:30:20.145770 (+    55us) inbound_call.cc:173] Queueing failure response
Metrics: {}
[       OK ] Parameters/TestRpc.TimedOutOnResponseMetricServiceQueue/SSL_TCP (85 ms)
[ RUN      ] Parameters/TestRpc.RpcPendingConnectionsMetric/SSL_TCP
I20260923 19:30:20.154604  2260 acceptor_pool.cc:254] collecting diagnostics on the listening RPC socket 0.0.0.0:34679 every 8 connection(s)
I20260923 19:30:20.154814  2261 acceptor_pool.cc:254] collecting diagnostics on the listening RPC socket 0.0.0.0:34679 every 8 connection(s)
W20260923 19:30:20.164290  2256 negotiation.cc:337] Failed RPC negotiation. Trace:
0923 19:30:20.163464 (+     0us) reactor.cc:625] Submitting negotiation task for server connection from 127.0.0.1:50440 (local address 127.0.0.1:34679)
0923 19:30:20.163659 (+   195us) server_negotiation.cc:206] Beginning negotiation
0923 19:30:20.163664 (+     5us) server_negotiation.cc:399] Waiting for connection header
0923 19:30:20.163843 (+   179us) negotiation.cc:327] Negotiation complete: Network error: Server connection negotiation failed: server connection from 127.0.0.1:50440: BlockingRecv error: recv got EOF from 127.0.0.1:50440 (error 108)
Metrics: {"server-negotiator.queue_time_us":66}
[       OK ] Parameters/TestRpc.RpcPendingConnectionsMetric/SSL_TCP (26 ms)
[ RUN      ] Parameters/TestRpc.TestRpcContextClientDeadline/SSL_TCP
I20260923 19:30:20.197041  2276 acceptor_pool.cc:254] collecting diagnostics on the listening RPC socket 0.0.0.0:39247 every 8 connection(s)
I20260923 19:30:20.197249  2277 acceptor_pool.cc:254] collecting diagnostics on the listening RPC socket 0.0.0.0:39247 every 8 connection(s)
[       OK ] Parameters/TestRpc.TestRpcContextClientDeadline/SSL_TCP (62 ms)
[ RUN      ] Parameters/TestRpc.TestApplicationFeatureFlagUnsupportedServer/SSL_TCP
I20260923 19:30:20.258068  2301 acceptor_pool.cc:254] collecting diagnostics on the listening RPC socket 0.0.0.0:42129 every 8 connection(s)
I20260923 19:30:20.258296  2302 acceptor_pool.cc:254] collecting diagnostics on the listening RPC socket 0.0.0.0:42129 every 8 connection(s)
[       OK ] Parameters/TestRpc.TestApplicationFeatureFlagUnsupportedServer/SSL_TCP (72 ms)
[ RUN      ] Parameters/TestRpc.TestCancellationAsync/SSL_TCP
I20260923 19:30:20.329624  2326 acceptor_pool.cc:254] collecting diagnostics on the listening RPC socket 0.0.0.0:40911 every 8 connection(s)
I20260923 19:30:20.329864  2327 acceptor_pool.cc:254] collecting diagnostics on the listening RPC socket 0.0.0.0:40911 every 8 connection(s)
I20260923 19:30:20.330638  1894 rpc-test.cc:1716] Connecting to 0.0.0.0:40911
I20260923 19:30:20.352555  1894 test_util.cc:268] Using random seed: -2088227820
I20260923 19:30:20.395346  2330 rpc-test-base.h:240] got call: sleep_micros: 500 pattern: 4294967295 num_repetitions: 2097152 sidecar_idx: 0
I20260923 19:30:20.424639  2329 rpc-test-base.h:240] got call: sleep_micros: 500 pattern: 4294967295 num_repetitions: 2097152 sidecar_idx: 0
I20260923 19:30:20.452517  2330 rpc-test-base.h:240] got call: sleep_micros: 500 pattern: 4294967295 num_repetitions: 2097152 sidecar_idx: 0
I20260923 19:30:20.480655  2329 rpc-test-base.h:240] got call: sleep_micros: 500 pattern: 4294967295 num_repetitions: 2097152 sidecar_idx: 0
I20260923 19:30:20.509198  2330 rpc-test-base.h:240] got call: sleep_micros: 500 pattern: 4294967295 num_repetitions: 2097152 sidecar_idx: 0
I20260923 19:30:20.536422  2329 rpc-test-base.h:240] got call: sleep_micros: 500 pattern: 4294967295 num_repetitions: 2097152 sidecar_idx: 0
W20260923 19:30:20.564673  2323 connection.cc:196] Error closing socket: Network error: TlsSocket::Close: Broken pipe
W20260923 19:30:20.569861  2323 connection.cc:441] server connection from 127.0.0.1:59600 torn down before Call kudu.rpc.GenericCalculatorService.SleepWithSidecar from 127.0.0.1:59600 (request call id 8) could send its response
[       OK ] Parameters/TestRpc.TestCancellationAsync/SSL_TCP (260 ms)
[ RUN      ] Parameters/TestRpc.TestPerformanceBySocketType/SSL_TCP
I20260923 19:30:20.593592  2351 acceptor_pool.cc:254] collecting diagnostics on the listening RPC socket 0.0.0.0:39301 every 8 connection(s)
I20260923 19:30:20.593801  2352 acceptor_pool.cc:254] collecting diagnostics on the listening RPC socket 0.0.0.0:39301 every 8 connection(s)
I20260923 19:30:20.594642  1894 rpc-test.cc:1846] Connecting to 0.0.0.0:39301
I20260923 19:30:23.286392  1894 rpc-test.cc:1859] Sending 1024MB via ssl-enabled tcp socket: real 2.675s	user 2.402s	sys 2.018s
I20260923 19:30:25.867029  1894 rpc-test.cc:1859] Sending 1024MB via ssl-enabled tcp socket: real 2.581s	user 2.216s	sys 2.053s
I20260923 19:30:28.419705  1894 rpc-test.cc:1859] Sending 1024MB via ssl-enabled tcp socket: real 2.553s	user 2.325s	sys 1.930s
I20260923 19:30:31.088773  1894 rpc-test.cc:1859] Sending 1024MB via ssl-enabled tcp socket: real 2.669s	user 2.443s	sys 1.997s
I20260923 19:30:33.672127  1894 rpc-test.cc:1859] Sending 1024MB via ssl-enabled tcp socket: real 2.583s	user 2.278s	sys 2.064s
[       OK ] Parameters/TestRpc.TestPerformanceBySocketType/SSL_TCP (13108 ms)
[----------] 20 tests from Parameters/TestRpc (45259 ms total)

[----------] 1 test from Parameters/TestRpcSocketTxRxQueue
[ RUN      ] Parameters/TestRpcSocketTxRxQueue.OverCapacity/0
W20260923 19:30:33.978034  2368 negotiation.cc:337] Failed RPC negotiation. Trace:
0923 19:30:33.689656 (+     0us) reactor.cc:625] Submitting negotiation task for client connection to 0.0.0.0:40293 (local address 127.0.0.1:41082)
0923 19:30:33.689807 (+   151us) negotiation.cc:107] Waiting for socket to connect
0923 19:30:33.689826 (+    19us) client_negotiation.cc:174] Beginning negotiation
0923 19:30:33.689914 (+    88us) client_negotiation.cc:252] Sending NEGOTIATE NegotiatePB request
0923 19:30:33.977679 (+287765us) negotiation.cc:327] Negotiation complete: Network error: Client connection negotiation failed: client connection to 0.0.0.0:40293: BlockingRecv error: recv error from unknown peer: Transport endpoint is not connected (error 107)
Metrics: {"client-negotiator.queue_time_us":43}
W20260923 19:30:33.978071  2377 negotiation.cc:337] Failed RPC negotiation. Trace:
0923 19:30:33.692065 (+     0us) reactor.cc:625] Submitting negotiation task for client connection to 0.0.0.0:40293 (local address 127.0.0.1:41084)
0923 19:30:33.692203 (+   138us) negotiation.cc:107] Waiting for socket to connect
0923 19:30:33.692216 (+    13us) client_negotiation.cc:174] Beginning negotiation
0923 19:30:33.692297 (+    81us) client_negotiation.cc:252] Sending NEGOTIATE NegotiatePB request
0923 19:30:33.977773 (+285476us) negotiation.cc:327] Negotiation complete: Network error: Client connection negotiation failed: client connection to 0.0.0.0:40293: BlockingRecv error: recv error from unknown peer: Transport endpoint is not connected (error 107)
Metrics: {"client-negotiator.queue_time_us":45}
W20260923 19:30:33.978113  2386 negotiation.cc:337] Failed RPC negotiation. Trace:
0923 19:30:33.694354 (+     0us) reactor.cc:625] Submitting negotiation task for client connection to 0.0.0.0:40293 (local address 127.0.0.1:41098)
0923 19:30:33.694495 (+   141us) negotiation.cc:107] Waiting for socket to connect
0923 19:30:33.694510 (+    15us) client_negotiation.cc:174] Beginning negotiation
0923 19:30:33.694615 (+   105us) client_negotiation.cc:252] Sending NEGOTIATE NegotiatePB request
0923 19:30:33.977834 (+283219us) negotiation.cc:327] Negotiation complete: Network error: Client connection negotiation failed: client connection to 0.0.0.0:40293: BlockingRecv error: recv error from unknown peer: Transport endpoint is not connected (error 107)
Metrics: {"client-negotiator.queue_time_us":29}
W20260923 19:30:33.978585  2413 negotiation.cc:337] Failed RPC negotiation. Trace:
0923 19:30:33.701941 (+     0us) reactor.cc:625] Submitting negotiation task for client connection to 0.0.0.0:40293 (local address 127.0.0.1:41130)
0923 19:30:33.702140 (+   199us) negotiation.cc:107] Waiting for socket to connect
0923 19:30:33.702153 (+    13us) client_negotiation.cc:174] Beginning negotiation
0923 19:30:33.702229 (+    76us) client_negotiation.cc:252] Sending NEGOTIATE NegotiatePB request
0923 19:30:33.978381 (+276152us) negotiation.cc:327] Negotiation complete: Network error: Client connection negotiation failed: client connection to 0.0.0.0:40293: BlockingRecv error: recv error from unknown peer: Transport endpoint is not connected (error 107)
Metrics: {"client-negotiator.queue_time_us":67}
W20260923 19:30:33.978397  2404 negotiation.cc:337] Failed RPC negotiation. Trace:
0923 19:30:33.699255 (+     0us) reactor.cc:625] Submitting negotiation task for client connection to 0.0.0.0:40293 (local address 127.0.0.1:41118)
0923 19:30:33.699408 (+   153us) negotiation.cc:107] Waiting for socket to connect
0923 19:30:33.699424 (+    16us) client_negotiation.cc:174] Beginning negotiation
0923 19:30:33.699507 (+    83us) client_negotiation.cc:252] Sending NEGOTIATE NegotiatePB request
0923 19:30:33.977897 (+278390us) negotiation.cc:327] Negotiation complete: Network error: Client connection negotiation failed: client connection to 0.0.0.0:40293: BlockingRecv error: recv error from unknown peer: Transport endpoint is not connected (error 107)
Metrics: {"client-negotiator.queue_time_us":45}
W20260923 19:30:33.979712  2395 negotiation.cc:337] Failed RPC negotiation. Trace:
0923 19:30:33.696600 (+     0us) reactor.cc:625] Submitting negotiation task for client connection to 0.0.0.0:40293 (local address 127.0.0.1:41104)
0923 19:30:33.696817 (+   217us) negotiation.cc:107] Waiting for socket to connect
0923 19:30:33.696831 (+    14us) client_negotiation.cc:174] Beginning negotiation
0923 19:30:33.696919 (+    88us) client_negotiation.cc:252] Sending NEGOTIATE NegotiatePB request
0923 19:30:33.977679 (+280760us) negotiation.cc:327] Negotiation complete: Network error: Client connection negotiation failed: client connection to 0.0.0.0:40293: BlockingRecv error: recv error from unknown peer: Transport endpoint is not connected (error 107)
Metrics: {"client-negotiator.queue_time_us":75}
[       OK ] Parameters/TestRpcSocketTxRxQueue.OverCapacity/0 (1075 ms)
[----------] 1 test from Parameters/TestRpcSocketTxRxQueue (1075 ms total)

[----------] Global test environment tear-down
[==========] 21 tests from 2 test suites ran. (46335 ms total)
[  PASSED  ] 20 tests.
[  FAILED  ] 1 test, listed below:
[  FAILED  ] Parameters/TestRpc.TestCallWithChainCertAndChainCA/SSL_TCP, where GetParam() = (true, false)

 1 FAILED TEST