Diagnosed failure
Parameters/TestRpc.TestCallWithChainCertAndChainCA/SSL_UnixSocket: /data0/somelongdirectorytoavoidrpathissues/src/kudu/src/kudu/rpc/rpc-test.cc:270: Failure
Failed
Bad status: Runtime error: could not verify certificate chain (error with cert: subject=CN = localhost, ST = sadfjas, C = AS, emailAddress = sdflkdsajf, O = lskdfjlsad, OU = sldfkja, issuer=C = AS, ST = ASDfkjdhf, L = lskdjf, O = saldfja, OU = skdjf, CN = localhost, emailAddress = sadjflkadsj): : certificate has expired
Google Test trace:
/data0/somelongdirectorytoavoidrpathissues/src/kudu/src/kudu/rpc/rpc-test.cc:267: Connecting to unix:/tmp/dist-test-taskCOfVI3/test-tmp/rpc-test-b84d001552fe48cabb2d43bfc8320746.sock
I20260929 16:24:00.802228 383 test_util.cc:175] -----------------------------------------------
I20260929 16:24:00.802287 383 test_util.cc:176] Had fatal failures, leaving test files at /tmp/dist-test-taskCOfVI3/test-tmp/rpc-test.6.Parameters_TestRpc.TestCallWithChainCertAndChainCA_SSL_UnixSocket.1790699040722655-383-0
Full log
Note: This is test shard 7 of 8.
[==========] Running 21 tests from 2 test suites.
[----------] Global test environment set-up.
[----------] 20 tests from Parameters/TestRpc
[ RUN ] Parameters/TestRpc.TestMessengerCreateDestroy/SSL_UnixSocket
WARNING: Logging before InitGoogleLogging() is written to STDERR
I20260929 16:24:00.748945 383 rpc-test.cc:169] started messenger TestCreateDestroy
[ OK ] Parameters/TestRpc.TestMessengerCreateDestroy/SSL_UnixSocket (21 ms)
[ RUN ] Parameters/TestRpc.TestNegotiationDeadlock/SSL_UnixSocket
I20260929 16:24:00.757381 403 acceptor_pool.cc:254] collecting diagnostics on the listening RPC socket unix:/tmp/dist-test-taskCOfVI3/test-tmp/rpc-test-9a1548afa6294e58a09cf32c8068d96c.sock every 8 connection(s)
I20260929 16:24:00.757416 404 acceptor_pool.cc:254] collecting diagnostics on the listening RPC socket unix:/tmp/dist-test-taskCOfVI3/test-tmp/rpc-test-9a1548afa6294e58a09cf32c8068d96c.sock every 8 connection(s)
[ OK ] Parameters/TestRpc.TestNegotiationDeadlock/SSL_UnixSocket (17 ms)
[ RUN ] Parameters/TestRpc.TestCallWithChainCertAndChainCA/SSL_UnixSocket
I20260929 16:24:00.797546 419 acceptor_pool.cc:254] collecting diagnostics on the listening RPC socket unix:/tmp/dist-test-taskCOfVI3/test-tmp/rpc-test-b84d001552fe48cabb2d43bfc8320746.sock every 8 connection(s)
I20260929 16:24:00.797618 420 acceptor_pool.cc:254] collecting diagnostics on the listening RPC socket unix:/tmp/dist-test-taskCOfVI3/test-tmp/rpc-test-b84d001552fe48cabb2d43bfc8320746.sock every 8 connection(s)
/data0/somelongdirectorytoavoidrpathissues/src/kudu/src/kudu/rpc/rpc-test.cc:270: Failure
Failed
Bad status: Runtime error: could not verify certificate chain (error with cert: subject=CN = localhost, ST = sadfjas, C = AS, emailAddress = sdflkdsajf, O = lskdfjlsad, OU = sldfkja, issuer=C = AS, ST = ASDfkjdhf, L = lskdjf, O = saldfja, OU = skdjf, CN = localhost, emailAddress = sadjflkadsj): : certificate has expired
Google Test trace:
/data0/somelongdirectorytoavoidrpathissues/src/kudu/src/kudu/rpc/rpc-test.cc:267: Connecting to unix:/tmp/dist-test-taskCOfVI3/test-tmp/rpc-test-b84d001552fe48cabb2d43bfc8320746.sock
I20260929 16:24:00.802228 383 test_util.cc:175] -----------------------------------------------
I20260929 16:24:00.802287 383 test_util.cc:176] Had fatal failures, leaving test files at /tmp/dist-test-taskCOfVI3/test-tmp/rpc-test.6.Parameters_TestRpc.TestCallWithChainCertAndChainCA_SSL_UnixSocket.1790699040722655-383-0
[ FAILED ] Parameters/TestRpc.TestCallWithChainCertAndChainCA/SSL_UnixSocket, where GetParam() = (true, true) (34 ms)
[ RUN ] Parameters/TestRpc.TestCallWithPasswordProtectedKey/SSL_UnixSocket
I20260929 16:24:00.816332 444 acceptor_pool.cc:254] collecting diagnostics on the listening RPC socket unix:/tmp/dist-test-taskCOfVI3/test-tmp/rpc-test-e294fe548d0447aaba04f79eb626a558.sock every 8 connection(s)
I20260929 16:24:00.816349 445 acceptor_pool.cc:254] collecting diagnostics on the listening RPC socket unix:/tmp/dist-test-taskCOfVI3/test-tmp/rpc-test-e294fe548d0447aaba04f79eb626a558.sock every 8 connection(s)
W20260929 16:24:00.829222 441 connection.cc:196] Error closing socket: Network error: TlsSocket::Close: Broken pipe
[ OK ] Parameters/TestRpc.TestCallWithPasswordProtectedKey/SSL_UnixSocket (28 ms)
[ RUN ] Parameters/TestRpc.TestCallToBadServer/SSL_UnixSocket
I20260929 16:24:00.856148 383 rpc-test.cc:394] Status: Network error: Client connection negotiation failed: client connection to 0.0.0.0:0: connect: Connection refused (error 111)
I20260929 16:24:00.856665 383 rpc-test.cc:394] Status: Network error: Client connection negotiation failed: client connection to 0.0.0.0:0: connect: Connection refused (error 111)
I20260929 16:24:00.857125 383 rpc-test.cc:394] Status: Network error: Client connection negotiation failed: client connection to 0.0.0.0:0: connect: Connection refused (error 111)
I20260929 16:24:00.857509 383 rpc-test.cc:394] Status: Network error: Client connection negotiation failed: client connection to 0.0.0.0:0: connect: Connection refused (error 111)
I20260929 16:24:00.857875 383 rpc-test.cc:394] Status: Network error: Client connection negotiation failed: client connection to 0.0.0.0:0: connect: Connection refused (error 111)
[ OK ] Parameters/TestRpc.TestCallToBadServer/SSL_UnixSocket (27 ms)
[ RUN ] Parameters/TestRpc.TestWrongService/SSL_UnixSocket
I20260929 16:24:00.872768 479 acceptor_pool.cc:254] collecting diagnostics on the listening RPC socket unix:/tmp/dist-test-taskCOfVI3/test-tmp/rpc-test-f6b34283a4c64abaa908e6a3d6650995.sock every 8 connection(s)
I20260929 16:24:00.872789 480 acceptor_pool.cc:254] collecting diagnostics on the listening RPC socket unix:/tmp/dist-test-taskCOfVI3/test-tmp/rpc-test-f6b34283a4c64abaa908e6a3d6650995.sock every 8 connection(s)
I20260929 16:24:00.891528 476 messenger.cc:345] service WrongServiceName not registered on TestServer
[ OK ] Parameters/TestRpc.TestWrongService/SSL_UnixSocket (38 ms)
[ RUN ] Parameters/TestRpc.TestConnectionKeepalive/SSL_UnixSocket
I20260929 16:24:00.908052 503 acceptor_pool.cc:254] collecting diagnostics on the listening RPC socket unix:/tmp/dist-test-taskCOfVI3/test-tmp/rpc-test-a38dae0957604d629b21c03c4ca1266c.sock every 8 connection(s)
I20260929 16:24:00.908080 502 acceptor_pool.cc:254] collecting diagnostics on the listening RPC socket unix:/tmp/dist-test-taskCOfVI3/test-tmp/rpc-test-a38dae0957604d629b21c03c4ca1266c.sock every 8 connection(s)
I20260929 16:24:00.908303 383 rpc-test.cc:488] Connecting to unix:/tmp/dist-test-taskCOfVI3/test-tmp/rpc-test-a38dae0957604d629b21c03c4ca1266c.sock
W20260929 16:24:01.398600 515 connection.cc:196] Error closing socket: Network error: TlsSocket::Close: Broken pipe
[ OK ] Parameters/TestRpc.TestConnectionKeepalive/SSL_UnixSocket (1033 ms)
[ RUN ] Parameters/TestRpc.TestClientConnectionMetrics/SSL_UnixSocket
I20260929 16:24:01.961006 527 acceptor_pool.cc:254] collecting diagnostics on the listening RPC socket unix:/tmp/dist-test-taskCOfVI3/test-tmp/rpc-test-fbd51605f96e4f2aa1aaf724190bd469.sock every 8 connection(s)
I20260929 16:24:01.960988 528 acceptor_pool.cc:254] collecting diagnostics on the listening RPC socket unix:/tmp/dist-test-taskCOfVI3/test-tmp/rpc-test-fbd51605f96e4f2aa1aaf724190bd469.sock every 8 connection(s)
I20260929 16:24:01.961186 383 rpc-test.cc:569] Connecting to unix:/tmp/dist-test-taskCOfVI3/test-tmp/rpc-test-fbd51605f96e4f2aa1aaf724190bd469.sock
W20260929 16:24:12.155056 524 connection.cc:196] Error closing socket: Network error: TlsSocket::Close: Broken pipe
[ OK ] Parameters/TestRpc.TestClientConnectionMetrics/SSL_UnixSocket (10226 ms)
[ RUN ] Parameters/TestRpc.TestCredentialsPolicy/SSL_UnixSocket
I20260929 16:24:12.177894 550 acceptor_pool.cc:254] collecting diagnostics on the listening RPC socket unix:/tmp/dist-test-taskCOfVI3/test-tmp/rpc-test-505b5e0192f1408d9e93c7322fd3c894.sock every 8 connection(s)
I20260929 16:24:12.177932 551 acceptor_pool.cc:254] collecting diagnostics on the listening RPC socket unix:/tmp/dist-test-taskCOfVI3/test-tmp/rpc-test-505b5e0192f1408d9e93c7322fd3c894.sock every 8 connection(s)
I20260929 16:24:12.178151 383 rpc-test.cc:700] Connecting to unix:/tmp/dist-test-taskCOfVI3/test-tmp/rpc-test-505b5e0192f1408d9e93c7322fd3c894.sock
W20260929 16:24:12.192668 549 connection.cc:196] Error closing socket: Network error: TlsSocket::Close: Broken pipe
[ OK ] Parameters/TestRpc.TestCredentialsPolicy/SSL_UnixSocket (41 ms)
[ RUN ] Parameters/TestRpc.TestCallLongerThanKeepalive/SSL_UnixSocket
I20260929 16:24:12.206091 575 acceptor_pool.cc:254] collecting diagnostics on the listening RPC socket unix:/tmp/dist-test-taskCOfVI3/test-tmp/rpc-test-c0f7b7909e9c4edea8062c63d13f7751.sock every 8 connection(s)
I20260929 16:24:12.206142 576 acceptor_pool.cc:254] collecting diagnostics on the listening RPC socket unix:/tmp/dist-test-taskCOfVI3/test-tmp/rpc-test-c0f7b7909e9c4edea8062c63d13f7751.sock every 8 connection(s)
I20260929 16:24:12.247575 579 rpc-test-base.h:222] got call: sleep_micros: 3000000 deferred: true
I20260929 16:24:15.248445 579 rpcz_store.cc:275] Call kudu.rpc.GenericCalculatorService.Sleep from unix:<unnamed> (request call id 0) took 3000 ms. Trace:
I20260929 16:24:15.248564 579 rpcz_store.cc:276] 0929 16:24:12.247499 (+ 0us) service_pool.cc:170] Inserting onto call queue
0929 16:24:12.247552 (+ 53us) service_pool.cc:227] Handling call
0929 16:24:15.248422 (+3000870us) inbound_call.cc:173] Queueing success response
Metrics: {}
W20260929 16:24:15.250080 572 connection.cc:196] Error closing socket: Network error: TlsSocket::Close: Broken pipe
[ OK ] Parameters/TestRpc.TestCallLongerThanKeepalive/SSL_UnixSocket (3053 ms)
[ RUN ] Parameters/TestRpc.TestRpcSidecar/SSL_UnixSocket
I20260929 16:24:15.266044 600 acceptor_pool.cc:254] collecting diagnostics on the listening RPC socket unix:/tmp/dist-test-taskCOfVI3/test-tmp/rpc-test-3ac63db459994a91bbe120e7a3f4924a.sock every 8 connection(s)
I20260929 16:24:15.266088 601 acceptor_pool.cc:254] collecting diagnostics on the listening RPC socket unix:/tmp/dist-test-taskCOfVI3/test-tmp/rpc-test-3ac63db459994a91bbe120e7a3f4924a.sock every 8 connection(s)
[ OK ] Parameters/TestRpc.TestRpcSidecar/SSL_UnixSocket (70 ms)
[ RUN ] Parameters/TestRpc.TestRpcSidecarLimits/SSL_UnixSocket
I20260929 16:24:16.989081 625 acceptor_pool.cc:254] collecting diagnostics on the listening RPC socket unix:/tmp/dist-test-taskCOfVI3/test-tmp/rpc-test-e0b1565f485149428cb186b7ac82b5f3.sock every 8 connection(s)
I20260929 16:24:16.989116 626 acceptor_pool.cc:254] collecting diagnostics on the listening RPC socket unix:/tmp/dist-test-taskCOfVI3/test-tmp/rpc-test-e0b1565f485149428cb186b7ac82b5f3.sock every 8 connection(s)
W20260929 16:24:17.017656 383 serialization.cc:72] Serialized kudu.rpc_test.PushStringsRequestPB (2147483654 bytes) is larger than the maximum configured RPC message size (52428800 bytes). Sending anyway, but peer may reject the data.
W20260929 16:24:17.021404 622 connection.cc:535] server connection from unix:<unnamed> recv error: Network error: RPC frame had a length of 2147483714, but we only support messages up to 52428800 bytes long.
W20260929 16:24:17.021486 622 connection.cc:158] shutting down server connection from unix:<unnamed> with pending inbound data: 4/2147483714 bytes received; last active 0 ns ago: status Network error: RPC frame had a length of 2147483714, but we only support messages up to 52428800 bytes long.
W20260929 16:24:17.021725 638 connection.cc:196] Error closing socket: Network error: TlsSocket::Close: Broken pipe
I20260929 16:24:17.034335 650 acceptor_pool.cc:254] collecting diagnostics on the listening RPC socket unix:/tmp/dist-test-taskCOfVI3/test-tmp/rpc-test-e0b1565f485149428cb186b7ac82b5f3.sock every 8 connection(s)
I20260929 16:24:17.034435 651 acceptor_pool.cc:254] collecting diagnostics on the listening RPC socket unix:/tmp/dist-test-taskCOfVI3/test-tmp/rpc-test-e0b1565f485149428cb186b7ac82b5f3.sock every 8 connection(s)
W20260929 16:24:21.714922 647 connection.cc:577] server connection from unix:<unnamed>: received bad data: 'Corruption: Invalid packet: message had a length of 2147483710, but we only support messages up to 2147483647 bytes
'
W20260929 16:24:21.715318 663 connection.cc:196] Error closing socket: Network error: TlsSocket::Close: Broken pipe
[ OK ] Parameters/TestRpc.TestRpcSidecarLimits/SSL_UnixSocket (6395 ms)
[ RUN ] Parameters/TestRpc.TestCallTimeoutDoesntAffectNegotiation/SSL_UnixSocket
I20260929 16:24:21.750437 675 acceptor_pool.cc:254] collecting diagnostics on the listening RPC socket unix:/tmp/dist-test-taskCOfVI3/test-tmp/rpc-test-d85ba5938891483d967c4cd2f48f174d.sock every 8 connection(s)
I20260929 16:24:21.750484 676 acceptor_pool.cc:254] collecting diagnostics on the listening RPC socket unix:/tmp/dist-test-taskCOfVI3/test-tmp/rpc-test-d85ba5938891483d967c4cd2f48f174d.sock every 8 connection(s)
W20260929 16:24:21.764153 671 negotiation.cc:266] Injecting 500ms delay in negotiation
I20260929 16:24:21.814492 383 rpc-test-base.h:595] status: Timed out: connection negotiation to unix:/tmp/dist-test-taskCOfVI3/test-tmp/rpc-test-d85ba5938891483d967c4cd2f48f174d.sock for RPC Sleep timed out after 0.050s (ON_OUTBOUND_QUEUE), seconds elapsed: 0.050766
[ OK ] Parameters/TestRpc.TestCallTimeoutDoesntAffectNegotiation/SSL_UnixSocket (554 ms)
[ RUN ] Parameters/TestRpc.TestRpcHandlerLatencyMetric/SSL_UnixSocket
I20260929 16:24:22.296298 700 acceptor_pool.cc:254] collecting diagnostics on the listening RPC socket unix:/tmp/dist-test-taskCOfVI3/test-tmp/rpc-test-24406876aa144dc3a2763d5a469262fb.sock every 8 connection(s)
I20260929 16:24:22.296375 701 acceptor_pool.cc:254] collecting diagnostics on the listening RPC socket unix:/tmp/dist-test-taskCOfVI3/test-tmp/rpc-test-24406876aa144dc3a2763d5a469262fb.sock every 8 connection(s)
I20260929 16:24:22.338174 383 rpc-test.cc:1236] Sleep() min lat: 20398
I20260929 16:24:22.338258 383 rpc-test.cc:1237] Sleep() mean lat: 20398
I20260929 16:24:22.338286 383 rpc-test.cc:1238] Sleep() max lat: 20398
I20260929 16:24:22.338297 383 rpc-test.cc:1239] Sleep() #calls: 1
[ OK ] Parameters/TestRpc.TestRpcHandlerLatencyMetric/SSL_UnixSocket (68 ms)
[ RUN ] Parameters/TestRpc.TimedOutOnResponseMetricServiceQueue/SSL_UnixSocket
I20260929 16:24:22.351881 726 acceptor_pool.cc:254] collecting diagnostics on the listening RPC socket unix:/tmp/dist-test-taskCOfVI3/test-tmp/rpc-test-169d215a21b34ac78cfff062da5f7504.sock every 8 connection(s)
I20260929 16:24:22.351948 727 acceptor_pool.cc:254] collecting diagnostics on the listening RPC socket unix:/tmp/dist-test-taskCOfVI3/test-tmp/rpc-test-169d215a21b34ac78cfff062da5f7504.sock every 8 connection(s)
W20260929 16:24:22.401973 728 rpcz_store.cc:267] Call kudu.rpc_test.CalculatorService.Sleep from unix:<unnamed> (request call id 2) took 20 ms (client timeout 20 ms). Trace:
W20260929 16:24:22.402069 728 rpcz_store.cc:269] 0929 16:24:22.381637 (+ 0us) service_pool.cc:170] Inserting onto call queue
0929 16:24:22.401926 (+ 20289us) service_pool.cc:214] Skipping call since client already timed out
0929 16:24:22.401956 (+ 30us) inbound_call.cc:173] Queueing failure response
Metrics: {}
W20260929 16:24:22.402748 723 connection.cc:196] Error closing socket: Network error: TlsSocket::Close: Broken pipe
[ OK ] Parameters/TestRpc.TimedOutOnResponseMetricServiceQueue/SSL_UnixSocket (63 ms)
[ RUN ] Parameters/TestRpc.RpcPendingConnectionsMetric/SSL_UnixSocket
I20260929 16:24:22.405774 749 acceptor_pool.cc:254] collecting diagnostics on the listening RPC socket 0.0.0.0:34565 every 8 connection(s)
I20260929 16:24:22.405833 750 acceptor_pool.cc:254] collecting diagnostics on the listening RPC socket 0.0.0.0:34565 every 8 connection(s)
W20260929 16:24:22.414220 745 negotiation.cc:337] Failed RPC negotiation. Trace:
0929 16:24:22.413768 (+ 0us) reactor.cc:625] Submitting negotiation task for server connection from 127.0.0.1:33938 (local address 127.0.0.1:34565)
0929 16:24:22.413878 (+ 110us) server_negotiation.cc:206] Beginning negotiation
0929 16:24:22.413882 (+ 4us) server_negotiation.cc:399] Waiting for connection header
0929 16:24:22.413979 (+ 97us) negotiation.cc:327] Negotiation complete: Network error: Server connection negotiation failed: server connection from 127.0.0.1:33938: BlockingRecv error: recv got EOF from 127.0.0.1:33938 (error 108)
Metrics: {"server-negotiator.queue_time_us":25}
[ OK ] Parameters/TestRpc.RpcPendingConnectionsMetric/SSL_UnixSocket (21 ms)
[ RUN ] Parameters/TestRpc.TestRpcContextClientDeadline/SSL_UnixSocket
I20260929 16:24:22.440634 765 acceptor_pool.cc:254] collecting diagnostics on the listening RPC socket unix:/tmp/dist-test-taskCOfVI3/test-tmp/rpc-test-9d598a48fb074dfa88927715635701c3.sock every 8 connection(s)
I20260929 16:24:22.440676 766 acceptor_pool.cc:254] collecting diagnostics on the listening RPC socket unix:/tmp/dist-test-taskCOfVI3/test-tmp/rpc-test-9d598a48fb074dfa88927715635701c3.sock every 8 connection(s)
W20260929 16:24:22.487762 762 connection.cc:196] Error closing socket: Network error: TlsSocket::Close: Broken pipe
[ OK ] Parameters/TestRpc.TestRpcContextClientDeadline/SSL_UnixSocket (63 ms)
[ RUN ] Parameters/TestRpc.TestApplicationFeatureFlagUnsupportedServer/SSL_UnixSocket
I20260929 16:24:22.509248 790 acceptor_pool.cc:254] collecting diagnostics on the listening RPC socket unix:/tmp/dist-test-taskCOfVI3/test-tmp/rpc-test-b036518a79a14c10b562f025f3002530.sock every 8 connection(s)
I20260929 16:24:22.509249 791 acceptor_pool.cc:254] collecting diagnostics on the listening RPC socket unix:/tmp/dist-test-taskCOfVI3/test-tmp/rpc-test-b036518a79a14c10b562f025f3002530.sock every 8 connection(s)
[ OK ] Parameters/TestRpc.TestApplicationFeatureFlagUnsupportedServer/SSL_UnixSocket (35 ms)
[ RUN ] Parameters/TestRpc.TestCancellationAsync/SSL_UnixSocket
I20260929 16:24:22.529440 815 acceptor_pool.cc:254] collecting diagnostics on the listening RPC socket unix:/tmp/dist-test-taskCOfVI3/test-tmp/rpc-test-f84457947cac4a4987a8a66daa4dddbd.sock every 8 connection(s)
I20260929 16:24:22.529493 816 acceptor_pool.cc:254] collecting diagnostics on the listening RPC socket unix:/tmp/dist-test-taskCOfVI3/test-tmp/rpc-test-f84457947cac4a4987a8a66daa4dddbd.sock every 8 connection(s)
I20260929 16:24:22.529734 383 rpc-test.cc:1716] Connecting to unix:/tmp/dist-test-taskCOfVI3/test-tmp/rpc-test-f84457947cac4a4987a8a66daa4dddbd.sock
I20260929 16:24:22.550526 383 test_util.cc:268] Using random seed: -1652170756
I20260929 16:24:22.567701 819 rpc-test-base.h:240] got call: sleep_micros: 500 pattern: 4294967295 num_repetitions: 2097152 sidecar_idx: 0
I20260929 16:24:22.586687 818 rpc-test-base.h:240] got call: sleep_micros: 500 pattern: 4294967295 num_repetitions: 2097152 sidecar_idx: 0
I20260929 16:24:22.603353 819 rpc-test-base.h:240] got call: sleep_micros: 500 pattern: 4294967295 num_repetitions: 2097152 sidecar_idx: 0
I20260929 16:24:22.620920 818 rpc-test-base.h:240] got call: sleep_micros: 500 pattern: 4294967295 num_repetitions: 2097152 sidecar_idx: 0
I20260929 16:24:22.637490 819 rpc-test-base.h:240] got call: sleep_micros: 500 pattern: 4294967295 num_repetitions: 2097152 sidecar_idx: 0
I20260929 16:24:22.655027 818 rpc-test-base.h:240] got call: sleep_micros: 500 pattern: 4294967295 num_repetitions: 2097152 sidecar_idx: 0
I20260929 16:24:22.671036 819 rpc-test-base.h:240] got call: sleep_micros: 500 pattern: 4294967295 num_repetitions: 2097152 sidecar_idx: 0
W20260929 16:24:22.672875 812 connection.cc:196] Error closing socket: Network error: TlsSocket::Close: Broken pipe
W20260929 16:24:22.678921 812 connection.cc:441] server connection from unix:<unnamed> torn down before Call kudu.rpc.GenericCalculatorService.SleepWithSidecar from unix:<unnamed> (request call id 8) could send its response
W20260929 16:24:22.689072 812 connection.cc:441] server connection from unix:<unnamed> torn down before Call kudu.rpc.GenericCalculatorService.SleepWithSidecar from unix:<unnamed> (request call id 9) could send its response
[ OK ] Parameters/TestRpc.TestCancellationAsync/SSL_UnixSocket (166 ms)
[ RUN ] Parameters/TestRpc.TestPerformanceBySocketType/SSL_UnixSocket
I20260929 16:24:22.706707 840 acceptor_pool.cc:254] collecting diagnostics on the listening RPC socket unix:/tmp/dist-test-taskCOfVI3/test-tmp/rpc-test-7fd4785d46a040f38455a6a065395dfe.sock every 8 connection(s)
I20260929 16:24:22.706743 841 acceptor_pool.cc:254] collecting diagnostics on the listening RPC socket unix:/tmp/dist-test-taskCOfVI3/test-tmp/rpc-test-7fd4785d46a040f38455a6a065395dfe.sock every 8 connection(s)
I20260929 16:24:22.706976 383 rpc-test.cc:1846] Connecting to unix:/tmp/dist-test-taskCOfVI3/test-tmp/rpc-test-7fd4785d46a040f38455a6a065395dfe.sock
I20260929 16:24:24.252106 383 rpc-test.cc:1859] Sending 1024MB via ssl-enabled unix socket: real 1.540s user 1.999s sys 0.801s
I20260929 16:24:25.736347 383 rpc-test.cc:1859] Sending 1024MB via ssl-enabled unix socket: real 1.484s user 1.917s sys 0.793s
I20260929 16:24:27.250572 383 rpc-test.cc:1859] Sending 1024MB via ssl-enabled unix socket: real 1.514s user 1.900s sys 0.833s
I20260929 16:24:28.766532 383 rpc-test.cc:1859] Sending 1024MB via ssl-enabled unix socket: real 1.516s user 1.898s sys 0.851s
I20260929 16:24:30.227846 383 rpc-test.cc:1859] Sending 1024MB via ssl-enabled unix socket: real 1.461s user 1.848s sys 0.808s
W20260929 16:24:30.228678 837 connection.cc:196] Error closing socket: Network error: TlsSocket::Close: Broken pipe
[ OK ] Parameters/TestRpc.TestPerformanceBySocketType/SSL_UnixSocket (7539 ms)
[----------] 20 tests from Parameters/TestRpc (29500 ms total)
[----------] 1 test from Parameters/TestRpcSocketTxRxQueue
[ RUN ] Parameters/TestRpcSocketTxRxQueue.AcceptorRxQueueSizeMetric/0
I20260929 16:24:30.236691 865 acceptor_pool.cc:254] collecting diagnostics on the listening RPC socket 0.0.0.0:39817 every 1 connection(s)
I20260929 16:24:30.236759 866 acceptor_pool.cc:254] collecting diagnostics on the listening RPC socket 0.0.0.0:39817 every 1 connection(s)
W20260929 16:24:30.237658 861 negotiation.cc:337] Failed RPC negotiation. Trace:
0929 16:24:30.237381 (+ 0us) reactor.cc:625] Submitting negotiation task for server connection from 127.0.0.1:38408 (local address 127.0.0.1:39817)
0929 16:24:30.237484 (+ 103us) server_negotiation.cc:206] Beginning negotiation
0929 16:24:30.237487 (+ 3us) server_negotiation.cc:399] Waiting for connection header
0929 16:24:30.237587 (+ 100us) negotiation.cc:327] Negotiation complete: Network error: Server connection negotiation failed: server connection from 127.0.0.1:38408: BlockingRecv error: recv got EOF from 127.0.0.1:38408 (error 108)
Metrics: {"server-negotiator.queue_time_us":37}
[ OK ] Parameters/TestRpcSocketTxRxQueue.AcceptorRxQueueSizeMetric/0 (9 ms)
[----------] 1 test from Parameters/TestRpcSocketTxRxQueue (10 ms total)
[----------] Global test environment tear-down
[==========] 21 tests from 2 test suites ran. (29510 ms total)
[ PASSED ] 20 tests.
[ FAILED ] 1 test, listed below:
[ FAILED ] Parameters/TestRpc.TestCallWithChainCertAndChainCA/SSL_UnixSocket, where GetParam() = (true, true)
1 FAILED TEST