Diagnosed failure
Parameters/TestRpc.TestCallWithChainCertAndChainCA/SSL_UnixSocket: /data0/somelongdirectorytoavoidrpathissues/src/kudu/src/kudu/rpc/rpc-test.cc:270: Failure
Failed
Bad status: Runtime error: could not verify certificate chain (error with cert: subject=CN = localhost, ST = sadfjas, C = AS, emailAddress = sdflkdsajf, O = lskdfjlsad, OU = sldfkja, issuer=C = AS, ST = ASDfkjdhf, L = lskdjf, O = saldfja, OU = skdjf, CN = localhost, emailAddress = sadjflkadsj): : certificate has expired
Google Test trace:
/data0/somelongdirectorytoavoidrpathissues/src/kudu/src/kudu/rpc/rpc-test.cc:267: Connecting to unix:/tmp/dist-test-taskSvVu9R/test-tmp/rpc-test-63c2773845b144c6b62ba9346a4a70e8.sock
I20260928 23:59:09.079181 7321 test_util.cc:175] -----------------------------------------------
I20260928 23:59:09.079358 7321 test_util.cc:176] Had fatal failures, leaving test files at /tmp/dist-test-taskSvVu9R/test-tmp/rpc-test.6.Parameters_TestRpc.TestCallWithChainCertAndChainCA_SSL_UnixSocket.1790639947718744-7321-0
Full log
Note: This is test shard 7 of 8.
[==========] Running 21 tests from 2 test suites.
[----------] Global test environment set-up.
[----------] 20 tests from Parameters/TestRpc
[ RUN ] Parameters/TestRpc.TestMessengerCreateDestroy/SSL_UnixSocket
WARNING: Logging before InitGoogleLogging() is written to STDERR
I20260928 23:59:07.817126 7321 rpc-test.cc:169] started messenger TestCreateDestroy
[ OK ] Parameters/TestRpc.TestMessengerCreateDestroy/SSL_UnixSocket (1172 ms)
[ RUN ] Parameters/TestRpc.TestNegotiationDeadlock/SSL_UnixSocket
I20260928 23:59:08.970358 7343 acceptor_pool.cc:254] collecting diagnostics on the listening RPC socket unix:/tmp/dist-test-taskSvVu9R/test-tmp/rpc-test-bbc9b0efad094a37b77b2d5e02bfe8b2.sock every 8 connection(s)
I20260928 23:59:08.971943 7344 acceptor_pool.cc:254] collecting diagnostics on the listening RPC socket unix:/tmp/dist-test-taskSvVu9R/test-tmp/rpc-test-bbc9b0efad094a37b77b2d5e02bfe8b2.sock every 8 connection(s)
[ OK ] Parameters/TestRpc.TestNegotiationDeadlock/SSL_UnixSocket (84 ms)
[ RUN ] Parameters/TestRpc.TestCallWithChainCertAndChainCA/SSL_UnixSocket
I20260928 23:59:09.050777 7359 acceptor_pool.cc:254] collecting diagnostics on the listening RPC socket unix:/tmp/dist-test-taskSvVu9R/test-tmp/rpc-test-63c2773845b144c6b62ba9346a4a70e8.sock every 8 connection(s)
I20260928 23:59:09.052958 7360 acceptor_pool.cc:254] collecting diagnostics on the listening RPC socket unix:/tmp/dist-test-taskSvVu9R/test-tmp/rpc-test-63c2773845b144c6b62ba9346a4a70e8.sock every 8 connection(s)
/data0/somelongdirectorytoavoidrpathissues/src/kudu/src/kudu/rpc/rpc-test.cc:270: Failure
Failed
Bad status: Runtime error: could not verify certificate chain (error with cert: subject=CN = localhost, ST = sadfjas, C = AS, emailAddress = sdflkdsajf, O = lskdfjlsad, OU = sldfkja, issuer=C = AS, ST = ASDfkjdhf, L = lskdjf, O = saldfja, OU = skdjf, CN = localhost, emailAddress = sadjflkadsj): : certificate has expired
Google Test trace:
/data0/somelongdirectorytoavoidrpathissues/src/kudu/src/kudu/rpc/rpc-test.cc:267: Connecting to unix:/tmp/dist-test-taskSvVu9R/test-tmp/rpc-test-63c2773845b144c6b62ba9346a4a70e8.sock
I20260928 23:59:09.079181 7321 test_util.cc:175] -----------------------------------------------
I20260928 23:59:09.079358 7321 test_util.cc:176] Had fatal failures, leaving test files at /tmp/dist-test-taskSvVu9R/test-tmp/rpc-test.6.Parameters_TestRpc.TestCallWithChainCertAndChainCA_SSL_UnixSocket.1790639947718744-7321-0
[ FAILED ] Parameters/TestRpc.TestCallWithChainCertAndChainCA/SSL_UnixSocket, where GetParam() = (true, true) (49 ms)
[ RUN ] Parameters/TestRpc.TestCallWithPasswordProtectedKey/SSL_UnixSocket
I20260928 23:59:09.111627 7384 acceptor_pool.cc:254] collecting diagnostics on the listening RPC socket unix:/tmp/dist-test-taskSvVu9R/test-tmp/rpc-test-e2310d66ae6e4d969d239a9112705ec6.sock every 8 connection(s)
I20260928 23:59:09.112444 7386 acceptor_pool.cc:254] collecting diagnostics on the listening RPC socket unix:/tmp/dist-test-taskSvVu9R/test-tmp/rpc-test-e2310d66ae6e4d969d239a9112705ec6.sock every 8 connection(s)
W20260928 23:59:09.156605 7381 connection.cc:196] Error closing socket: Network error: TlsSocket::Close: Broken pipe
[ OK ] Parameters/TestRpc.TestCallWithPasswordProtectedKey/SSL_UnixSocket (83 ms)
[ RUN ] Parameters/TestRpc.TestCallToBadServer/SSL_UnixSocket
I20260928 23:59:09.198416 7321 rpc-test.cc:394] Status: Network error: Client connection negotiation failed: client connection to 0.0.0.0:0: connect: Connection refused (error 111)
I20260928 23:59:09.199908 7321 rpc-test.cc:394] Status: Network error: Client connection negotiation failed: client connection to 0.0.0.0:0: connect: Connection refused (error 111)
I20260928 23:59:09.201332 7321 rpc-test.cc:394] Status: Network error: Client connection negotiation failed: client connection to 0.0.0.0:0: connect: Connection refused (error 111)
I20260928 23:59:09.202885 7321 rpc-test.cc:394] Status: Network error: Client connection negotiation failed: client connection to 0.0.0.0:0: connect: Connection refused (error 111)
I20260928 23:59:09.204203 7321 rpc-test.cc:394] Status: Network error: Client connection negotiation failed: client connection to 0.0.0.0:0: connect: Connection refused (error 111)
[ OK ] Parameters/TestRpc.TestCallToBadServer/SSL_UnixSocket (43 ms)
[ RUN ] Parameters/TestRpc.TestWrongService/SSL_UnixSocket
I20260928 23:59:09.227285 7420 acceptor_pool.cc:254] collecting diagnostics on the listening RPC socket unix:/tmp/dist-test-taskSvVu9R/test-tmp/rpc-test-ec3ed49add474c9db5aa7180aca3004f.sock every 8 connection(s)
I20260928 23:59:09.228161 7421 acceptor_pool.cc:254] collecting diagnostics on the listening RPC socket unix:/tmp/dist-test-taskSvVu9R/test-tmp/rpc-test-ec3ed49add474c9db5aa7180aca3004f.sock every 8 connection(s)
I20260928 23:59:09.275578 7417 messenger.cc:345] service WrongServiceName not registered on TestServer
[ OK ] Parameters/TestRpc.TestWrongService/SSL_UnixSocket (77 ms)
[ RUN ] Parameters/TestRpc.TestConnectionKeepalive/SSL_UnixSocket
I20260928 23:59:09.318444 7443 acceptor_pool.cc:254] collecting diagnostics on the listening RPC socket unix:/tmp/dist-test-taskSvVu9R/test-tmp/rpc-test-290c930ff14c4107af31c04f546feeb2.sock every 8 connection(s)
I20260928 23:59:09.319242 7444 acceptor_pool.cc:254] collecting diagnostics on the listening RPC socket unix:/tmp/dist-test-taskSvVu9R/test-tmp/rpc-test-290c930ff14c4107af31c04f546feeb2.sock every 8 connection(s)
I20260928 23:59:09.322748 7321 rpc-test.cc:488] Connecting to unix:/tmp/dist-test-taskSvVu9R/test-tmp/rpc-test-290c930ff14c4107af31c04f546feeb2.sock
W20260928 23:59:09.788265 7456 connection.cc:196] Error closing socket: Network error: TlsSocket::Close: Broken pipe
[ OK ] Parameters/TestRpc.TestConnectionKeepalive/SSL_UnixSocket (1086 ms)
[ RUN ] Parameters/TestRpc.TestClientConnectionMetrics/SSL_UnixSocket
I20260928 23:59:10.395364 7468 acceptor_pool.cc:254] collecting diagnostics on the listening RPC socket unix:/tmp/dist-test-taskSvVu9R/test-tmp/rpc-test-a81c3f245fe84627bf1fdb402a02927f.sock every 8 connection(s)
I20260928 23:59:10.396106 7469 acceptor_pool.cc:254] collecting diagnostics on the listening RPC socket unix:/tmp/dist-test-taskSvVu9R/test-tmp/rpc-test-a81c3f245fe84627bf1fdb402a02927f.sock every 8 connection(s)
I20260928 23:59:10.399497 7321 rpc-test.cc:569] Connecting to unix:/tmp/dist-test-taskSvVu9R/test-tmp/rpc-test-a81c3f245fe84627bf1fdb402a02927f.sock
W20260929 00:01:30.945122 7465 connection.cc:196] Error closing socket: Network error: TlsSocket::Close: Broken pipe
[ OK ] Parameters/TestRpc.TestClientConnectionMetrics/SSL_UnixSocket (140585 ms)
[ RUN ] Parameters/TestRpc.TestCredentialsPolicy/SSL_UnixSocket
I20260929 00:01:30.989668 7505 acceptor_pool.cc:254] collecting diagnostics on the listening RPC socket unix:/tmp/dist-test-taskSvVu9R/test-tmp/rpc-test-11a175f26f9f428faf7bb6b5488cd2a6.sock every 8 connection(s)
I20260929 00:01:30.990599 7506 acceptor_pool.cc:254] collecting diagnostics on the listening RPC socket unix:/tmp/dist-test-taskSvVu9R/test-tmp/rpc-test-11a175f26f9f428faf7bb6b5488cd2a6.sock every 8 connection(s)
I20260929 00:01:30.993939 7321 rpc-test.cc:700] Connecting to unix:/tmp/dist-test-taskSvVu9R/test-tmp/rpc-test-11a175f26f9f428faf7bb6b5488cd2a6.sock
W20260929 00:01:31.025061 7504 connection.cc:196] Error closing socket: Network error: TlsSocket::Close: Broken pipe
[ OK ] Parameters/TestRpc.TestCredentialsPolicy/SSL_UnixSocket (90 ms)
[ RUN ] Parameters/TestRpc.TestCallLongerThanKeepalive/SSL_UnixSocket
I20260929 00:01:31.080420 7531 acceptor_pool.cc:254] collecting diagnostics on the listening RPC socket unix:/tmp/dist-test-taskSvVu9R/test-tmp/rpc-test-b207cf22cc9d44e1915a9e643cac0ba6.sock every 8 connection(s)
I20260929 00:01:31.081225 7532 acceptor_pool.cc:254] collecting diagnostics on the listening RPC socket unix:/tmp/dist-test-taskSvVu9R/test-tmp/rpc-test-b207cf22cc9d44e1915a9e643cac0ba6.sock every 8 connection(s)
I20260929 00:01:31.119742 7535 rpc-test-base.h:222] got call: sleep_micros: 3000000 deferred: true
I20260929 00:01:34.124193 7535 rpcz_store.cc:275] Call kudu.rpc.GenericCalculatorService.Sleep from unix:<unnamed> (request call id 0) took 3004 ms. Trace:
I20260929 00:01:34.124490 7535 rpcz_store.cc:276] 0929 00:01:31.119517 (+ 0us) service_pool.cc:170] Inserting onto call queue
0929 00:01:31.119683 (+ 166us) service_pool.cc:227] Handling call
0929 00:01:34.124133 (+3004450us) inbound_call.cc:173] Queueing success response
Metrics: {}
[ OK ] Parameters/TestRpc.TestCallLongerThanKeepalive/SSL_UnixSocket (3086 ms)
[ RUN ] Parameters/TestRpc.TestRpcSidecar/SSL_UnixSocket
I20260929 00:01:34.163472 7556 acceptor_pool.cc:254] collecting diagnostics on the listening RPC socket unix:/tmp/dist-test-taskSvVu9R/test-tmp/rpc-test-43b0546886fd4833b4e0e5c1b14553fb.sock every 8 connection(s)
I20260929 00:01:34.164209 7557 acceptor_pool.cc:254] collecting diagnostics on the listening RPC socket unix:/tmp/dist-test-taskSvVu9R/test-tmp/rpc-test-43b0546886fd4833b4e0e5c1b14553fb.sock every 8 connection(s)
W20260929 00:01:34.667711 7553 connection.cc:196] Error closing socket: Network error: TlsSocket::Close: Broken pipe
[ OK ] Parameters/TestRpc.TestRpcSidecar/SSL_UnixSocket (539 ms)
[ RUN ] Parameters/TestRpc.TestRpcSidecarLimits/SSL_UnixSocket
I20260929 00:01:52.433738 7583 acceptor_pool.cc:254] collecting diagnostics on the listening RPC socket unix:/tmp/dist-test-taskSvVu9R/test-tmp/rpc-test-ee47f14d74684cd7b0ea262ff65f679d.sock every 8 connection(s)
I20260929 00:01:52.434504 7584 acceptor_pool.cc:254] collecting diagnostics on the listening RPC socket unix:/tmp/dist-test-taskSvVu9R/test-tmp/rpc-test-ee47f14d74684cd7b0ea262ff65f679d.sock every 8 connection(s)
W20260929 00:01:52.454255 7321 serialization.cc:72] Serialized kudu.rpc_test.PushStringsRequestPB (2147483654 bytes) is larger than the maximum configured RPC message size (52428800 bytes). Sending anyway, but peer may reject the data.
W20260929 00:01:52.465018 7580 connection.cc:535] server connection from unix:<unnamed> recv error: Network error: RPC frame had a length of 2147483714, but we only support messages up to 52428800 bytes long.
W20260929 00:01:52.465503 7580 connection.cc:158] shutting down server connection from unix:<unnamed> with pending inbound data: 4/2147483714 bytes received; last active 0 ns ago: status Network error: RPC frame had a length of 2147483714, but we only support messages up to 52428800 bytes long.
W20260929 00:01:52.466814 7596 connection.cc:196] Error closing socket: Network error: TlsSocket::Close: Broken pipe
[ OK ] Parameters/TestRpc.TestRpcSidecarLimits/SSL_UnixSocket (18472 ms)
[ RUN ] Parameters/TestRpc.TestCallTimeoutDoesntAffectNegotiation/SSL_UnixSocket
I20260929 00:01:53.165325 7608 acceptor_pool.cc:254] collecting diagnostics on the listening RPC socket unix:/tmp/dist-test-taskSvVu9R/test-tmp/rpc-test-a74997658b81495aae46951b992a5bf1.sock every 8 connection(s)
I20260929 00:01:53.165777 7609 acceptor_pool.cc:254] collecting diagnostics on the listening RPC socket unix:/tmp/dist-test-taskSvVu9R/test-tmp/rpc-test-a74997658b81495aae46951b992a5bf1.sock every 8 connection(s)
W20260929 00:01:53.187090 7604 negotiation.cc:266] Injecting 500ms delay in negotiation
I20260929 00:01:53.237491 7321 rpc-test-base.h:595] status: Timed out: connection negotiation to unix:/tmp/dist-test-taskSvVu9R/test-tmp/rpc-test-a74997658b81495aae46951b992a5bf1.sock for RPC Sleep timed out after 0.050s (ON_OUTBOUND_QUEUE), seconds elapsed: 0.0513404
W20260929 00:01:53.701040 7605 connection.cc:196] Error closing socket: Network error: TlsSocket::Close: Broken pipe
[ OK ] Parameters/TestRpc.TestCallTimeoutDoesntAffectNegotiation/SSL_UnixSocket (559 ms)
[ RUN ] Parameters/TestRpc.TestRpcHandlerLatencyMetric/SSL_UnixSocket
I20260929 00:01:53.731726 7633 acceptor_pool.cc:254] collecting diagnostics on the listening RPC socket unix:/tmp/dist-test-taskSvVu9R/test-tmp/rpc-test-f3b780501d0a480c8508001123bab247.sock every 8 connection(s)
I20260929 00:01:53.732532 7634 acceptor_pool.cc:254] collecting diagnostics on the listening RPC socket unix:/tmp/dist-test-taskSvVu9R/test-tmp/rpc-test-f3b780501d0a480c8508001123bab247.sock every 8 connection(s)
I20260929 00:01:53.787839 7321 rpc-test.cc:1236] Sleep() min lat: 21765
I20260929 00:01:53.788045 7321 rpc-test.cc:1237] Sleep() mean lat: 21765
I20260929 00:01:53.788192 7321 rpc-test.cc:1238] Sleep() max lat: 21765
I20260929 00:01:53.788302 7321 rpc-test.cc:1239] Sleep() #calls: 1
W20260929 00:01:53.791054 7630 connection.cc:196] Error closing socket: Network error: TlsSocket::Close: Broken pipe
[ OK ] Parameters/TestRpc.TestRpcHandlerLatencyMetric/SSL_UnixSocket (90 ms)
[ RUN ] Parameters/TestRpc.TimedOutOnResponseMetricServiceQueue/SSL_UnixSocket
I20260929 00:01:53.815249 7660 acceptor_pool.cc:254] collecting diagnostics on the listening RPC socket unix:/tmp/dist-test-taskSvVu9R/test-tmp/rpc-test-3d8b7f8c94ec4aeba54191afb2198a74.sock every 8 connection(s)
I20260929 00:01:53.815954 7661 acceptor_pool.cc:254] collecting diagnostics on the listening RPC socket unix:/tmp/dist-test-taskSvVu9R/test-tmp/rpc-test-3d8b7f8c94ec4aeba54191afb2198a74.sock every 8 connection(s)
W20260929 00:01:53.907382 7662 rpcz_store.cc:267] Call kudu.rpc_test.CalculatorService.Sleep from unix:<unnamed> (request call id 2) took 20 ms (client timeout 20 ms). Trace:
W20260929 00:01:53.907828 7662 rpcz_store.cc:269] 0929 00:01:53.886949 (+ 0us) service_pool.cc:170] Inserting onto call queue
0929 00:01:53.907246 (+ 20297us) service_pool.cc:214] Skipping call since client already timed out
0929 00:01:53.907333 (+ 87us) inbound_call.cc:173] Queueing failure response
Metrics: {}
W20260929 00:01:53.910660 7657 connection.cc:196] Error closing socket: Network error: TlsSocket::Close: Broken pipe
[ OK ] Parameters/TestRpc.TimedOutOnResponseMetricServiceQueue/SSL_UnixSocket (119 ms)
[ RUN ] Parameters/TestRpc.RpcPendingConnectionsMetric/SSL_UnixSocket
I20260929 00:01:53.926457 7683 acceptor_pool.cc:254] collecting diagnostics on the listening RPC socket 0.0.0.0:42493 every 8 connection(s)
I20260929 00:01:53.927189 7684 acceptor_pool.cc:254] collecting diagnostics on the listening RPC socket 0.0.0.0:42493 every 8 connection(s)
W20260929 00:01:53.932421 7679 negotiation.cc:337] Failed RPC negotiation. Trace:
0929 00:01:53.931204 (+ 0us) reactor.cc:625] Submitting negotiation task for server connection from 127.0.0.1:49444 (local address 127.0.0.1:42493)
0929 00:01:53.931597 (+ 393us) server_negotiation.cc:206] Beginning negotiation
0929 00:01:53.931615 (+ 18us) server_negotiation.cc:399] Waiting for connection header
0929 00:01:53.931856 (+ 241us) negotiation.cc:327] Negotiation complete: Network error: Server connection negotiation failed: server connection from 127.0.0.1:49444: BlockingRecv error: recv got EOF from 127.0.0.1:49444 (error 108)
Metrics: {"server-negotiator.queue_time_us":101}
[ OK ] Parameters/TestRpc.RpcPendingConnectionsMetric/SSL_UnixSocket (31 ms)
[ RUN ] Parameters/TestRpc.TestRpcContextClientDeadline/SSL_UnixSocket
I20260929 00:01:53.976533 7699 acceptor_pool.cc:254] collecting diagnostics on the listening RPC socket unix:/tmp/dist-test-taskSvVu9R/test-tmp/rpc-test-637dbe5834504cd6aad56662ba623b48.sock every 8 connection(s)
I20260929 00:01:53.977296 7700 acceptor_pool.cc:254] collecting diagnostics on the listening RPC socket unix:/tmp/dist-test-taskSvVu9R/test-tmp/rpc-test-637dbe5834504cd6aad56662ba623b48.sock every 8 connection(s)
W20260929 00:01:54.042956 7696 connection.cc:196] Error closing socket: Network error: TlsSocket::Close: Broken pipe
[ OK ] Parameters/TestRpc.TestRpcContextClientDeadline/SSL_UnixSocket (100 ms)
[ RUN ] Parameters/TestRpc.TestApplicationFeatureFlagUnsupportedServer/SSL_UnixSocket
I20260929 00:01:54.092042 7724 acceptor_pool.cc:254] collecting diagnostics on the listening RPC socket unix:/tmp/dist-test-taskSvVu9R/test-tmp/rpc-test-aef567f035d54db49c4a4c399b853eb8.sock every 8 connection(s)
I20260929 00:01:54.093014 7725 acceptor_pool.cc:254] collecting diagnostics on the listening RPC socket unix:/tmp/dist-test-taskSvVu9R/test-tmp/rpc-test-aef567f035d54db49c4a4c399b853eb8.sock every 8 connection(s)
[ OK ] Parameters/TestRpc.TestApplicationFeatureFlagUnsupportedServer/SSL_UnixSocket (94 ms)
[ RUN ] Parameters/TestRpc.TestCancellationAsync/SSL_UnixSocket
I20260929 00:01:54.161453 7749 acceptor_pool.cc:254] collecting diagnostics on the listening RPC socket unix:/tmp/dist-test-taskSvVu9R/test-tmp/rpc-test-08afbf6fcaca4832a86054e42b76c291.sock every 8 connection(s)
I20260929 00:01:54.162206 7750 acceptor_pool.cc:254] collecting diagnostics on the listening RPC socket unix:/tmp/dist-test-taskSvVu9R/test-tmp/rpc-test-08afbf6fcaca4832a86054e42b76c291.sock every 8 connection(s)
I20260929 00:01:54.165450 7321 rpc-test.cc:1716] Connecting to unix:/tmp/dist-test-taskSvVu9R/test-tmp/rpc-test-08afbf6fcaca4832a86054e42b76c291.sock
I20260929 00:01:54.181713 7321 test_util.cc:268] Using random seed: -470997445
I20260929 00:01:54.421271 7753 rpc-test-base.h:240] got call: sleep_micros: 500 pattern: 4294967295 num_repetitions: 2097152 sidecar_idx: 0
I20260929 00:01:54.635524 7752 rpc-test-base.h:240] got call: sleep_micros: 500 pattern: 4294967295 num_repetitions: 2097152 sidecar_idx: 0
I20260929 00:01:54.870543 7752 rpc-test-base.h:240] got call: sleep_micros: 500 pattern: 4294967295 num_repetitions: 2097152 sidecar_idx: 0
I20260929 00:01:55.075068 7753 rpc-test-base.h:240] got call: sleep_micros: 500 pattern: 4294967295 num_repetitions: 2097152 sidecar_idx: 0
I20260929 00:01:55.279301 7752 rpc-test-base.h:240] got call: sleep_micros: 500 pattern: 4294967295 num_repetitions: 2097152 sidecar_idx: 0
I20260929 00:01:55.508208 7752 rpc-test-base.h:240] got call: sleep_micros: 500 pattern: 4294967295 num_repetitions: 2097152 sidecar_idx: 0
I20260929 00:01:55.742961 7752 rpc-test-base.h:240] got call: sleep_micros: 500 pattern: 4294967295 num_repetitions: 2097152 sidecar_idx: 0
I20260929 00:01:55.948032 7752 rpc-test-base.h:240] got call: sleep_micros: 500 pattern: 4294967295 num_repetitions: 2097152 sidecar_idx: 0
I20260929 00:01:56.155984 7753 rpc-test-base.h:240] got call: sleep_micros: 500 pattern: 4294967295 num_repetitions: 2097152 sidecar_idx: 0
W20260929 00:01:56.187593 7746 connection.cc:196] Error closing socket: Network error: TlsSocket::Close: Broken pipe
W20260929 00:01:56.294122 7746 connection.cc:441] server connection from unix:<unnamed> torn down before Call kudu.rpc.GenericCalculatorService.SleepWithSidecar from unix:<unnamed> (request call id 9) could send its response
[ OK ] Parameters/TestRpc.TestCancellationAsync/SSL_UnixSocket (2163 ms)
[ RUN ] Parameters/TestRpc.TestPerformanceBySocketType/SSL_UnixSocket
I20260929 00:01:56.415141 7774 acceptor_pool.cc:254] collecting diagnostics on the listening RPC socket unix:/tmp/dist-test-taskSvVu9R/test-tmp/rpc-test-01db3036ddb24e969653de91c9d7fecd.sock every 8 connection(s)
I20260929 00:01:56.415876 7775 acceptor_pool.cc:254] collecting diagnostics on the listening RPC socket unix:/tmp/dist-test-taskSvVu9R/test-tmp/rpc-test-01db3036ddb24e969653de91c9d7fecd.sock every 8 connection(s)
I20260929 00:01:56.419091 7321 rpc-test.cc:1846] Connecting to unix:/tmp/dist-test-taskSvVu9R/test-tmp/rpc-test-01db3036ddb24e969653de91c9d7fecd.sock
I20260929 00:02:18.661471 7321 rpc-test.cc:1859] Sending 1024MB via ssl-enabled unix socket: real 22.222s user 19.746s sys 13.616s
I20260929 00:02:40.704427 7321 rpc-test.cc:1859] Sending 1024MB via ssl-enabled unix socket: real 22.042s user 19.784s sys 13.366s
I20260929 00:03:02.865379 7321 rpc-test.cc:1859] Sending 1024MB via ssl-enabled unix socket: real 22.160s user 19.625s sys 13.737s
I20260929 00:03:25.165381 7321 rpc-test.cc:1859] Sending 1024MB via ssl-enabled unix socket: real 22.300s user 20.015s sys 13.770s
I20260929 00:03:47.846964 7321 rpc-test.cc:1859] Sending 1024MB via ssl-enabled unix socket: real 22.681s user 21.115s sys 13.440s
W20260929 00:03:47.856869 7771 connection.cc:196] Error closing socket: Network error: TlsSocket::Close: Broken pipe
[ OK ] Parameters/TestRpc.TestPerformanceBySocketType/SSL_UnixSocket (111561 ms)
[----------] 20 tests from Parameters/TestRpc (280095 ms total)
[----------] 1 test from Parameters/TestRpcSocketTxRxQueue
[ RUN ] Parameters/TestRpcSocketTxRxQueue.AcceptorRxQueueSizeMetric/0
I20260929 00:03:47.880012 7810 acceptor_pool.cc:254] collecting diagnostics on the listening RPC socket 0.0.0.0:36509 every 1 connection(s)
I20260929 00:03:47.880893 7811 acceptor_pool.cc:254] collecting diagnostics on the listening RPC socket 0.0.0.0:36509 every 1 connection(s)
W20260929 00:03:47.887187 7806 negotiation.cc:337] Failed RPC negotiation. Trace:
0929 00:03:47.885357 (+ 0us) reactor.cc:625] Submitting negotiation task for server connection from 127.0.0.1:49804 (local address 127.0.0.1:36509)
0929 00:03:47.885847 (+ 490us) server_negotiation.cc:206] Beginning negotiation
0929 00:03:47.885873 (+ 26us) server_negotiation.cc:399] Waiting for connection header
0929 00:03:47.886140 (+ 267us) negotiation.cc:327] Negotiation complete: Network error: Server connection negotiation failed: server connection from 127.0.0.1:49804: BlockingRecv error: recv got EOF from 127.0.0.1:49804 (error 108)
Metrics: {"server-negotiator.queue_time_us":128}
[ OK ] Parameters/TestRpcSocketTxRxQueue.AcceptorRxQueueSizeMetric/0 (27 ms)
[----------] 1 test from Parameters/TestRpcSocketTxRxQueue (27 ms total)
[----------] Global test environment tear-down
[==========] 21 tests from 2 test suites ran. (280124 ms total)
[ PASSED ] 20 tests.
[ FAILED ] 1 test, listed below:
[ FAILED ] Parameters/TestRpc.TestCallWithChainCertAndChainCA/SSL_UnixSocket, where GetParam() = (true, true)
1 FAILED TEST