Diagnosed failure

Parameters/TestRpc.TestCallWithChainCertAndChainCA/SSL_UnixSocket: /data0/somelongdirectorytoavoidrpathissues/src/kudu/src/kudu/rpc/rpc-test.cc:270: Failure
Failed
Bad status: Runtime error: could not verify certificate chain (error with cert: subject=CN = localhost, ST = sadfjas, C = AS, emailAddress = sdflkdsajf, O = lskdfjlsad, OU = sldfkja, issuer=C = AS, ST = ASDfkjdhf, L = lskdjf, O = saldfja, OU = skdjf, CN = localhost, emailAddress = sadjflkadsj): : certificate has expired
Google Test trace:
/data0/somelongdirectorytoavoidrpathissues/src/kudu/src/kudu/rpc/rpc-test.cc:267: Connecting to unix:/tmp/dist-test-taskT3OZ8y/test-tmp/rpc-test-c0905faa9cf34227b52a4e448e2beec1.sock
I20260927 03:54:40.645463 26231 test_util.cc:175] -----------------------------------------------
I20260927 03:54:40.645516 26231 test_util.cc:176] Had fatal failures, leaving test files at /tmp/dist-test-taskT3OZ8y/test-tmp/rpc-test.6.Parameters_TestRpc.TestCallWithChainCertAndChainCA_SSL_UnixSocket.1790481280573524-26231-0

Full log

Note: This is test shard 7 of 8.
[==========] Running 21 tests from 2 test suites.
[----------] Global test environment set-up.
[----------] 20 tests from Parameters/TestRpc
[ RUN      ] Parameters/TestRpc.TestMessengerCreateDestroy/SSL_UnixSocket
WARNING: Logging before InitGoogleLogging() is written to STDERR
I20260927 03:54:40.607154 26231 rpc-test.cc:169] started messenger TestCreateDestroy
[       OK ] Parameters/TestRpc.TestMessengerCreateDestroy/SSL_UnixSocket (32 ms)
[ RUN      ] Parameters/TestRpc.TestNegotiationDeadlock/SSL_UnixSocket
I20260927 03:54:40.621188 26252 acceptor_pool.cc:254] collecting diagnostics on the listening RPC socket unix:/tmp/dist-test-taskT3OZ8y/test-tmp/rpc-test-1181937530a64743860788dfe1e15329.sock every 8 connection(s)
I20260927 03:54:40.621202 26251 acceptor_pool.cc:254] collecting diagnostics on the listening RPC socket unix:/tmp/dist-test-taskT3OZ8y/test-tmp/rpc-test-1181937530a64743860788dfe1e15329.sock every 8 connection(s)
[       OK ] Parameters/TestRpc.TestNegotiationDeadlock/SSL_UnixSocket (19 ms)
[ RUN      ] Parameters/TestRpc.TestCallWithChainCertAndChainCA/SSL_UnixSocket
I20260927 03:54:40.641788 26267 acceptor_pool.cc:254] collecting diagnostics on the listening RPC socket unix:/tmp/dist-test-taskT3OZ8y/test-tmp/rpc-test-c0905faa9cf34227b52a4e448e2beec1.sock every 8 connection(s)
I20260927 03:54:40.641811 26268 acceptor_pool.cc:254] collecting diagnostics on the listening RPC socket unix:/tmp/dist-test-taskT3OZ8y/test-tmp/rpc-test-c0905faa9cf34227b52a4e448e2beec1.sock every 8 connection(s)
/data0/somelongdirectorytoavoidrpathissues/src/kudu/src/kudu/rpc/rpc-test.cc:270: Failure
Failed
Bad status: Runtime error: could not verify certificate chain (error with cert: subject=CN = localhost, ST = sadfjas, C = AS, emailAddress = sdflkdsajf, O = lskdfjlsad, OU = sldfkja, issuer=C = AS, ST = ASDfkjdhf, L = lskdjf, O = saldfja, OU = skdjf, CN = localhost, emailAddress = sadjflkadsj): : certificate has expired
Google Test trace:
/data0/somelongdirectorytoavoidrpathissues/src/kudu/src/kudu/rpc/rpc-test.cc:267: Connecting to unix:/tmp/dist-test-taskT3OZ8y/test-tmp/rpc-test-c0905faa9cf34227b52a4e448e2beec1.sock
I20260927 03:54:40.645463 26231 test_util.cc:175] -----------------------------------------------
I20260927 03:54:40.645516 26231 test_util.cc:176] Had fatal failures, leaving test files at /tmp/dist-test-taskT3OZ8y/test-tmp/rpc-test.6.Parameters_TestRpc.TestCallWithChainCertAndChainCA_SSL_UnixSocket.1790481280573524-26231-0
[  FAILED  ] Parameters/TestRpc.TestCallWithChainCertAndChainCA/SSL_UnixSocket, where GetParam() = (true, true) (17 ms)
[ RUN      ] Parameters/TestRpc.TestCallWithPasswordProtectedKey/SSL_UnixSocket
I20260927 03:54:40.658478 26292 acceptor_pool.cc:254] collecting diagnostics on the listening RPC socket unix:/tmp/dist-test-taskT3OZ8y/test-tmp/rpc-test-4b9f927d435340fb82f4ff2b4a596f81.sock every 8 connection(s)
I20260927 03:54:40.658479 26293 acceptor_pool.cc:254] collecting diagnostics on the listening RPC socket unix:/tmp/dist-test-taskT3OZ8y/test-tmp/rpc-test-4b9f927d435340fb82f4ff2b4a596f81.sock every 8 connection(s)
W20260927 03:54:40.673887 26289 connection.cc:196] Error closing socket: Network error: TlsSocket::Close: Broken pipe
[       OK ] Parameters/TestRpc.TestCallWithPasswordProtectedKey/SSL_UnixSocket (29 ms)
[ RUN      ] Parameters/TestRpc.TestCallToBadServer/SSL_UnixSocket
I20260927 03:54:40.698506 26231 rpc-test.cc:394] Status: Network error: Client connection negotiation failed: client connection to 0.0.0.0:0: connect: Connection refused (error 111)
I20260927 03:54:40.698904 26231 rpc-test.cc:394] Status: Network error: Client connection negotiation failed: client connection to 0.0.0.0:0: connect: Connection refused (error 111)
I20260927 03:54:40.699117 26231 rpc-test.cc:394] Status: Network error: Client connection negotiation failed: client connection to 0.0.0.0:0: connect: Connection refused (error 111)
I20260927 03:54:40.699321 26231 rpc-test.cc:394] Status: Network error: Client connection negotiation failed: client connection to 0.0.0.0:0: connect: Connection refused (error 111)
I20260927 03:54:40.699491 26231 rpc-test.cc:394] Status: Network error: Client connection negotiation failed: client connection to 0.0.0.0:0: connect: Connection refused (error 111)
[       OK ] Parameters/TestRpc.TestCallToBadServer/SSL_UnixSocket (24 ms)
[ RUN      ] Parameters/TestRpc.TestWrongService/SSL_UnixSocket
I20260927 03:54:40.710608 26327 acceptor_pool.cc:254] collecting diagnostics on the listening RPC socket unix:/tmp/dist-test-taskT3OZ8y/test-tmp/rpc-test-ea6537b27c8146fd858dd877e923e11f.sock every 8 connection(s)
I20260927 03:54:40.710633 26328 acceptor_pool.cc:254] collecting diagnostics on the listening RPC socket unix:/tmp/dist-test-taskT3OZ8y/test-tmp/rpc-test-ea6537b27c8146fd858dd877e923e11f.sock every 8 connection(s)
I20260927 03:54:40.726716 26324 messenger.cc:345] service WrongServiceName not registered on TestServer
[       OK ] Parameters/TestRpc.TestWrongService/SSL_UnixSocket (28 ms)
[ RUN      ] Parameters/TestRpc.TestConnectionKeepalive/SSL_UnixSocket
I20260927 03:54:40.747365 26350 acceptor_pool.cc:254] collecting diagnostics on the listening RPC socket unix:/tmp/dist-test-taskT3OZ8y/test-tmp/rpc-test-162bf05ef81f4abeac1804b3c9188273.sock every 8 connection(s)
I20260927 03:54:40.747413 26351 acceptor_pool.cc:254] collecting diagnostics on the listening RPC socket unix:/tmp/dist-test-taskT3OZ8y/test-tmp/rpc-test-162bf05ef81f4abeac1804b3c9188273.sock every 8 connection(s)
I20260927 03:54:40.747645 26231 rpc-test.cc:488] Connecting to unix:/tmp/dist-test-taskT3OZ8y/test-tmp/rpc-test-162bf05ef81f4abeac1804b3c9188273.sock
W20260927 03:54:41.229893 26363 connection.cc:196] Error closing socket: Network error: TlsSocket::Close: Broken pipe
[       OK ] Parameters/TestRpc.TestConnectionKeepalive/SSL_UnixSocket (1037 ms)
[ RUN      ] Parameters/TestRpc.TestClientConnectionMetrics/SSL_UnixSocket
I20260927 03:54:41.791256 26375 acceptor_pool.cc:254] collecting diagnostics on the listening RPC socket unix:/tmp/dist-test-taskT3OZ8y/test-tmp/rpc-test-15c610ed516e464085be966a8b5f139a.sock every 8 connection(s)
I20260927 03:54:41.791280 26376 acceptor_pool.cc:254] collecting diagnostics on the listening RPC socket unix:/tmp/dist-test-taskT3OZ8y/test-tmp/rpc-test-15c610ed516e464085be966a8b5f139a.sock every 8 connection(s)
I20260927 03:54:41.791409 26231 rpc-test.cc:569] Connecting to unix:/tmp/dist-test-taskT3OZ8y/test-tmp/rpc-test-15c610ed516e464085be966a8b5f139a.sock
W20260927 03:54:49.651304 26372 connection.cc:196] Error closing socket: Network error: TlsSocket::Close: Broken pipe
[       OK ] Parameters/TestRpc.TestClientConnectionMetrics/SSL_UnixSocket (7885 ms)
[ RUN      ] Parameters/TestRpc.TestCredentialsPolicy/SSL_UnixSocket
I20260927 03:54:49.674381 26398 acceptor_pool.cc:254] collecting diagnostics on the listening RPC socket unix:/tmp/dist-test-taskT3OZ8y/test-tmp/rpc-test-929e8b187048455cb81a8bb5ecf64e1e.sock every 8 connection(s)
I20260927 03:54:49.674404 26399 acceptor_pool.cc:254] collecting diagnostics on the listening RPC socket unix:/tmp/dist-test-taskT3OZ8y/test-tmp/rpc-test-929e8b187048455cb81a8bb5ecf64e1e.sock every 8 connection(s)
I20260927 03:54:49.674561 26231 rpc-test.cc:700] Connecting to unix:/tmp/dist-test-taskT3OZ8y/test-tmp/rpc-test-929e8b187048455cb81a8bb5ecf64e1e.sock
W20260927 03:54:49.707875 26397 connection.cc:196] Error closing socket: Network error: TlsSocket::Close: Broken pipe
[       OK ] Parameters/TestRpc.TestCredentialsPolicy/SSL_UnixSocket (59 ms)
[ RUN      ] Parameters/TestRpc.TestCallLongerThanKeepalive/SSL_UnixSocket
I20260927 03:54:49.729130 26423 acceptor_pool.cc:254] collecting diagnostics on the listening RPC socket unix:/tmp/dist-test-taskT3OZ8y/test-tmp/rpc-test-98f353e19acd403bbfac1e53266094e2.sock every 8 connection(s)
I20260927 03:54:49.729146 26424 acceptor_pool.cc:254] collecting diagnostics on the listening RPC socket unix:/tmp/dist-test-taskT3OZ8y/test-tmp/rpc-test-98f353e19acd403bbfac1e53266094e2.sock every 8 connection(s)
I20260927 03:54:49.747824 26426 rpc-test-base.h:222] got call: sleep_micros: 3000000 deferred: true
I20260927 03:54:52.748535 26426 rpcz_store.cc:275] Call kudu.rpc.GenericCalculatorService.Sleep from unix:<unnamed> (request call id 0) took 3000 ms. Trace:
I20260927 03:54:52.748646 26426 rpcz_store.cc:276] 0927 03:54:49.747769 (+     0us) service_pool.cc:170] Inserting onto call queue
0927 03:54:49.747799 (+    30us) service_pool.cc:227] Handling call
0927 03:54:52.748520 (+3000721us) inbound_call.cc:173] Queueing success response
Metrics: {}
[       OK ] Parameters/TestRpc.TestCallLongerThanKeepalive/SSL_UnixSocket (3038 ms)
[ RUN      ] Parameters/TestRpc.TestRpcSidecar/SSL_UnixSocket
I20260927 03:54:52.764074 26448 acceptor_pool.cc:254] collecting diagnostics on the listening RPC socket unix:/tmp/dist-test-taskT3OZ8y/test-tmp/rpc-test-8172cf5683844a48a7e0bbb22a3d4bd8.sock every 8 connection(s)
I20260927 03:54:52.764119 26449 acceptor_pool.cc:254] collecting diagnostics on the listening RPC socket unix:/tmp/dist-test-taskT3OZ8y/test-tmp/rpc-test-8172cf5683844a48a7e0bbb22a3d4bd8.sock every 8 connection(s)
W20260927 03:54:52.805065 26445 connection.cc:196] Error closing socket: Network error: TlsSocket::Close: Broken pipe
[       OK ] Parameters/TestRpc.TestRpcSidecar/SSL_UnixSocket (55 ms)
[ RUN      ] Parameters/TestRpc.TestRpcSidecarLimits/SSL_UnixSocket
I20260927 03:54:57.226368 26473 acceptor_pool.cc:254] collecting diagnostics on the listening RPC socket unix:/tmp/dist-test-taskT3OZ8y/test-tmp/rpc-test-100b396c6e764819b765907b54c7b2aa.sock every 8 connection(s)
I20260927 03:54:57.226429 26474 acceptor_pool.cc:254] collecting diagnostics on the listening RPC socket unix:/tmp/dist-test-taskT3OZ8y/test-tmp/rpc-test-100b396c6e764819b765907b54c7b2aa.sock every 8 connection(s)
W20260927 03:54:57.236214 26231 serialization.cc:72] Serialized kudu.rpc_test.PushStringsRequestPB (2147483654 bytes) is larger than the maximum configured RPC message size (52428800 bytes). Sending anyway, but peer may reject the data.
W20260927 03:54:57.239379 26470 connection.cc:535] server connection from unix:<unnamed> recv error: Network error: RPC frame had a length of 2147483714, but we only support messages up to 52428800 bytes long.
W20260927 03:54:57.239434 26470 connection.cc:158] shutting down server connection from unix:<unnamed> with pending inbound data: 4/2147483714 bytes received; last active 0 ns ago: status Network error: RPC frame had a length of 2147483714, but we only support messages up to 52428800 bytes long.
W20260927 03:54:57.239568 26486 connection.cc:698] client connection to unix:/tmp/dist-test-taskT3OZ8y/test-tmp/rpc-test-100b396c6e764819b765907b54c7b2aa.sock send error: Network error: failed to write to TLS socket: Broken pipe
W20260927 03:54:57.239708 26486 connection.cc:196] Error closing socket: Network error: TlsSocket::Close: Success
I20260927 03:54:57.259814 26498 acceptor_pool.cc:254] collecting diagnostics on the listening RPC socket unix:/tmp/dist-test-taskT3OZ8y/test-tmp/rpc-test-100b396c6e764819b765907b54c7b2aa.sock every 8 connection(s)
I20260927 03:54:57.259892 26499 acceptor_pool.cc:254] collecting diagnostics on the listening RPC socket unix:/tmp/dist-test-taskT3OZ8y/test-tmp/rpc-test-100b396c6e764819b765907b54c7b2aa.sock every 8 connection(s)
W20260927 03:55:08.138371 26495 connection.cc:577] server connection from unix:<unnamed>: received bad data: 'Corruption: Invalid packet: message had a length of 2147483710, but we only support messages up to 2147483647 bytes
'
W20260927 03:55:08.138695 26511 connection.cc:196] Error closing socket: Network error: TlsSocket::Close: Broken pipe
[       OK ] Parameters/TestRpc.TestRpcSidecarLimits/SSL_UnixSocket (15334 ms)
[ RUN      ] Parameters/TestRpc.TestCallTimeoutDoesntAffectNegotiation/SSL_UnixSocket
I20260927 03:55:08.157135 26523 acceptor_pool.cc:254] collecting diagnostics on the listening RPC socket unix:/tmp/dist-test-taskT3OZ8y/test-tmp/rpc-test-dc96a01fd7d54070acd04856f6ae65fe.sock every 8 connection(s)
I20260927 03:55:08.157167 26524 acceptor_pool.cc:254] collecting diagnostics on the listening RPC socket unix:/tmp/dist-test-taskT3OZ8y/test-tmp/rpc-test-dc96a01fd7d54070acd04856f6ae65fe.sock every 8 connection(s)
W20260927 03:55:08.164474 26519 negotiation.cc:266] Injecting 500ms delay in negotiation
I20260927 03:55:08.214748 26231 rpc-test-base.h:595] status: Timed out: connection negotiation to unix:/tmp/dist-test-taskT3OZ8y/test-tmp/rpc-test-dc96a01fd7d54070acd04856f6ae65fe.sock for RPC Sleep timed out after 0.050s (ON_OUTBOUND_QUEUE), seconds elapsed: 0.0505297
[       OK ] Parameters/TestRpc.TestCallTimeoutDoesntAffectNegotiation/SSL_UnixSocket (529 ms)
[ RUN      ] Parameters/TestRpc.TestRpcHandlerLatencyMetric/SSL_UnixSocket
I20260927 03:55:08.693849 26548 acceptor_pool.cc:254] collecting diagnostics on the listening RPC socket unix:/tmp/dist-test-taskT3OZ8y/test-tmp/rpc-test-033f8a8f444c44f0b8656a6cf3a20d68.sock every 8 connection(s)
I20260927 03:55:08.693887 26549 acceptor_pool.cc:254] collecting diagnostics on the listening RPC socket unix:/tmp/dist-test-taskT3OZ8y/test-tmp/rpc-test-033f8a8f444c44f0b8656a6cf3a20d68.sock every 8 connection(s)
I20260927 03:55:08.742115 26231 rpc-test.cc:1236] Sleep() min lat: 20345
I20260927 03:55:08.742194 26231 rpc-test.cc:1237] Sleep() mean lat: 20345
I20260927 03:55:08.742226 26231 rpc-test.cc:1238] Sleep() max lat: 20345
I20260927 03:55:08.742238 26231 rpc-test.cc:1239] Sleep() #calls: 1
[       OK ] Parameters/TestRpc.TestRpcHandlerLatencyMetric/SSL_UnixSocket (74 ms)
[ RUN      ] Parameters/TestRpc.TimedOutOnResponseMetricServiceQueue/SSL_UnixSocket
I20260927 03:55:08.763022 26574 acceptor_pool.cc:254] collecting diagnostics on the listening RPC socket unix:/tmp/dist-test-taskT3OZ8y/test-tmp/rpc-test-69ef44c892fb493a8ee29d8e949eea65.sock every 8 connection(s)
I20260927 03:55:08.763084 26575 acceptor_pool.cc:254] collecting diagnostics on the listening RPC socket unix:/tmp/dist-test-taskT3OZ8y/test-tmp/rpc-test-69ef44c892fb493a8ee29d8e949eea65.sock every 8 connection(s)
W20260927 03:55:08.815945 26576 rpcz_store.cc:267] Call kudu.rpc_test.CalculatorService.Sleep from unix:<unnamed> (request call id 2) took 20 ms (client timeout 20 ms). Trace:
W20260927 03:55:08.816046 26576 rpcz_store.cc:269] 0927 03:55:08.795675 (+     0us) service_pool.cc:170] Inserting onto call queue
0927 03:55:08.815921 (+ 20246us) service_pool.cc:214] Skipping call since client already timed out
0927 03:55:08.815930 (+     9us) inbound_call.cc:173] Queueing failure response
Metrics: {}
[       OK ] Parameters/TestRpc.TimedOutOnResponseMetricServiceQueue/SSL_UnixSocket (73 ms)
[ RUN      ] Parameters/TestRpc.RpcPendingConnectionsMetric/SSL_UnixSocket
I20260927 03:55:08.819280 26597 acceptor_pool.cc:254] collecting diagnostics on the listening RPC socket 0.0.0.0:33283 every 8 connection(s)
I20260927 03:55:08.819348 26598 acceptor_pool.cc:254] collecting diagnostics on the listening RPC socket 0.0.0.0:33283 every 8 connection(s)
W20260927 03:55:08.819947 26593 negotiation.cc:337] Failed RPC negotiation. Trace:
0927 03:55:08.819779 (+     0us) reactor.cc:625] Submitting negotiation task for server connection from 127.0.0.1:58486 (local address 127.0.0.1:33283)
0927 03:55:08.819819 (+    40us) server_negotiation.cc:206] Beginning negotiation
0927 03:55:08.819821 (+     2us) server_negotiation.cc:399] Waiting for connection header
0927 03:55:08.819894 (+    73us) negotiation.cc:327] Negotiation complete: Network error: Server connection negotiation failed: server connection from 127.0.0.1:58486: BlockingRecv error: recv got EOF from 127.0.0.1:58486 (error 108)
Metrics: {"server-negotiator.queue_time_us":15}
[       OK ] Parameters/TestRpc.RpcPendingConnectionsMetric/SSL_UnixSocket (13 ms)
[ RUN      ] Parameters/TestRpc.TestRpcContextClientDeadline/SSL_UnixSocket
I20260927 03:55:08.843360 26613 acceptor_pool.cc:254] collecting diagnostics on the listening RPC socket unix:/tmp/dist-test-taskT3OZ8y/test-tmp/rpc-test-f21e4c078df44aa4a4971e17717684cf.sock every 8 connection(s)
I20260927 03:55:08.843389 26614 acceptor_pool.cc:254] collecting diagnostics on the listening RPC socket unix:/tmp/dist-test-taskT3OZ8y/test-tmp/rpc-test-f21e4c078df44aa4a4971e17717684cf.sock every 8 connection(s)
[       OK ] Parameters/TestRpc.TestRpcContextClientDeadline/SSL_UnixSocket (62 ms)
[ RUN      ] Parameters/TestRpc.TestApplicationFeatureFlagUnsupportedServer/SSL_UnixSocket
I20260927 03:55:08.905102 26638 acceptor_pool.cc:254] collecting diagnostics on the listening RPC socket unix:/tmp/dist-test-taskT3OZ8y/test-tmp/rpc-test-dae7e858a565475f98d4e9e93f9904f7.sock every 8 connection(s)
I20260927 03:55:08.905151 26639 acceptor_pool.cc:254] collecting diagnostics on the listening RPC socket unix:/tmp/dist-test-taskT3OZ8y/test-tmp/rpc-test-dae7e858a565475f98d4e9e93f9904f7.sock every 8 connection(s)
[       OK ] Parameters/TestRpc.TestApplicationFeatureFlagUnsupportedServer/SSL_UnixSocket (28 ms)
[ RUN      ] Parameters/TestRpc.TestCancellationAsync/SSL_UnixSocket
I20260927 03:55:08.944628 26664 acceptor_pool.cc:254] collecting diagnostics on the listening RPC socket unix:/tmp/dist-test-taskT3OZ8y/test-tmp/rpc-test-19b218859d4c49ce8a28b884244cba1d.sock every 8 connection(s)
I20260927 03:55:08.944610 26663 acceptor_pool.cc:254] collecting diagnostics on the listening RPC socket unix:/tmp/dist-test-taskT3OZ8y/test-tmp/rpc-test-19b218859d4c49ce8a28b884244cba1d.sock every 8 connection(s)
I20260927 03:55:08.944765 26231 rpc-test.cc:1716] Connecting to unix:/tmp/dist-test-taskT3OZ8y/test-tmp/rpc-test-19b218859d4c49ce8a28b884244cba1d.sock
I20260927 03:55:08.951905 26231 test_util.cc:268] Using random seed: -362437282
I20260927 03:55:08.968163 26667 rpc-test-base.h:240] got call: sleep_micros: 500 pattern: 4294967295 num_repetitions: 2097152 sidecar_idx: 0
I20260927 03:55:08.980667 26667 rpc-test-base.h:240] got call: sleep_micros: 500 pattern: 4294967295 num_repetitions: 2097152 sidecar_idx: 0
I20260927 03:55:08.993078 26667 rpc-test-base.h:240] got call: sleep_micros: 500 pattern: 4294967295 num_repetitions: 2097152 sidecar_idx: 0
I20260927 03:55:09.005522 26667 rpc-test-base.h:240] got call: sleep_micros: 500 pattern: 4294967295 num_repetitions: 2097152 sidecar_idx: 0
I20260927 03:55:09.017361 26667 rpc-test-base.h:240] got call: sleep_micros: 500 pattern: 4294967295 num_repetitions: 2097152 sidecar_idx: 0
I20260927 03:55:09.028064 26667 rpc-test-base.h:240] got call: sleep_micros: 500 pattern: 4294967295 num_repetitions: 2097152 sidecar_idx: 0
I20260927 03:55:09.038297 26667 rpc-test-base.h:240] got call: sleep_micros: 500 pattern: 4294967295 num_repetitions: 2097152 sidecar_idx: 0
I20260927 03:55:09.048750 26667 rpc-test-base.h:240] got call: sleep_micros: 500 pattern: 4294967295 num_repetitions: 2097152 sidecar_idx: 0
W20260927 03:55:09.050683 26660 connection.cc:196] Error closing socket: Network error: TlsSocket::Close: Broken pipe
W20260927 03:55:09.051771 26660 connection.cc:441] server connection from unix:<unnamed> torn down before Call kudu.rpc.GenericCalculatorService.SleepWithSidecar from unix:<unnamed> (request call id 9) could send its response
[       OK ] Parameters/TestRpc.TestCancellationAsync/SSL_UnixSocket (130 ms)
[ RUN      ] Parameters/TestRpc.TestPerformanceBySocketType/SSL_UnixSocket
I20260927 03:55:09.068553 26688 acceptor_pool.cc:254] collecting diagnostics on the listening RPC socket unix:/tmp/dist-test-taskT3OZ8y/test-tmp/rpc-test-e5183667837b4a50bd277f8643db4b9a.sock every 8 connection(s)
I20260927 03:55:09.068590 26689 acceptor_pool.cc:254] collecting diagnostics on the listening RPC socket unix:/tmp/dist-test-taskT3OZ8y/test-tmp/rpc-test-e5183667837b4a50bd277f8643db4b9a.sock every 8 connection(s)
I20260927 03:55:09.068725 26231 rpc-test.cc:1846] Connecting to unix:/tmp/dist-test-taskT3OZ8y/test-tmp/rpc-test-e5183667837b4a50bd277f8643db4b9a.sock
I20260927 03:55:10.335675 26231 rpc-test.cc:1859] Sending 1024MB via ssl-enabled unix socket: real 1.256s	user 1.514s	sys 0.726s
I20260927 03:55:11.492913 26231 rpc-test.cc:1859] Sending 1024MB via ssl-enabled unix socket: real 1.157s	user 1.366s	sys 0.703s
I20260927 03:55:12.711884 26231 rpc-test.cc:1859] Sending 1024MB via ssl-enabled unix socket: real 1.219s	user 1.347s	sys 0.826s
I20260927 03:55:13.943598 26231 rpc-test.cc:1859] Sending 1024MB via ssl-enabled unix socket: real 1.232s	user 1.475s	sys 0.727s
I20260927 03:55:15.153884 26231 rpc-test.cc:1859] Sending 1024MB via ssl-enabled unix socket: real 1.210s	user 1.413s	sys 0.743s
W20260927 03:55:15.154492 26685 connection.cc:196] Error closing socket: Network error: TlsSocket::Close: Broken pipe
[       OK ] Parameters/TestRpc.TestPerformanceBySocketType/SSL_UnixSocket (6102 ms)
[----------] 20 tests from Parameters/TestRpc (34579 ms total)

[----------] 1 test from Parameters/TestRpcSocketTxRxQueue
[ RUN      ] Parameters/TestRpcSocketTxRxQueue.AcceptorRxQueueSizeMetric/0
I20260927 03:55:15.160344 26713 acceptor_pool.cc:254] collecting diagnostics on the listening RPC socket 0.0.0.0:44149 every 1 connection(s)
I20260927 03:55:15.160419 26714 acceptor_pool.cc:254] collecting diagnostics on the listening RPC socket 0.0.0.0:44149 every 1 connection(s)
W20260927 03:55:15.160929 26709 negotiation.cc:337] Failed RPC negotiation. Trace:
0927 03:55:15.160797 (+     0us) reactor.cc:625] Submitting negotiation task for server connection from 127.0.0.1:39920 (local address 127.0.0.1:44149)
0927 03:55:15.160839 (+    42us) server_negotiation.cc:206] Beginning negotiation
0927 03:55:15.160840 (+     1us) server_negotiation.cc:399] Waiting for connection header
0927 03:55:15.160901 (+    61us) negotiation.cc:327] Negotiation complete: Network error: Server connection negotiation failed: server connection from 127.0.0.1:39920: BlockingRecv error: recv got EOF from 127.0.0.1:39920 (error 108)
Metrics: {"server-negotiator.queue_time_us":16}
[       OK ] Parameters/TestRpcSocketTxRxQueue.AcceptorRxQueueSizeMetric/0 (7 ms)
[----------] 1 test from Parameters/TestRpcSocketTxRxQueue (7 ms total)

[----------] Global test environment tear-down
[==========] 21 tests from 2 test suites ran. (34587 ms total)
[  PASSED  ] 20 tests.
[  FAILED  ] 1 test, listed below:
[  FAILED  ] Parameters/TestRpc.TestCallWithChainCertAndChainCA/SSL_UnixSocket, where GetParam() = (true, true)

 1 FAILED TEST