Diagnosed failure
Parameters/TestRpc.TestCallWithChainCertAndChainCA/SSL_UnixSocket: /data0/somelongdirectorytoavoidrpathissues/src/kudu/src/kudu/rpc/rpc-test.cc:270: Failure
Failed
Bad status: Runtime error: could not verify certificate chain (error with cert: subject=CN = localhost, ST = sadfjas, C = AS, emailAddress = sdflkdsajf, O = lskdfjlsad, OU = sldfkja, issuer=C = AS, ST = ASDfkjdhf, L = lskdjf, O = saldfja, OU = skdjf, CN = localhost, emailAddress = sadjflkadsj): : certificate has expired
Google Test trace:
/data0/somelongdirectorytoavoidrpathissues/src/kudu/src/kudu/rpc/rpc-test.cc:267: Connecting to unix:/tmp/dist-test-taskXIRP1E/test-tmp/rpc-test-614b05c950b6430d957d82a8e1131388.sock
I20260925 16:46:18.084896 5874 test_util.cc:175] -----------------------------------------------
I20260925 16:46:18.085088 5874 test_util.cc:176] Had fatal failures, leaving test files at /tmp/dist-test-taskXIRP1E/test-tmp/rpc-test.6.Parameters_TestRpc.TestCallWithChainCertAndChainCA_SSL_UnixSocket.1790354776732117-5874-0
Full log
Note: This is test shard 7 of 8.
[==========] Running 21 tests from 2 test suites.
[----------] Global test environment set-up.
[----------] 20 tests from Parameters/TestRpc
[ RUN ] Parameters/TestRpc.TestMessengerCreateDestroy/SSL_UnixSocket
WARNING: Logging before InitGoogleLogging() is written to STDERR
I20260925 16:46:16.845744 5874 rpc-test.cc:169] started messenger TestCreateDestroy
[ OK ] Parameters/TestRpc.TestMessengerCreateDestroy/SSL_UnixSocket (1162 ms)
[ RUN ] Parameters/TestRpc.TestNegotiationDeadlock/SSL_UnixSocket
I20260925 16:46:17.968573 5896 acceptor_pool.cc:254] collecting diagnostics on the listening RPC socket unix:/tmp/dist-test-taskXIRP1E/test-tmp/rpc-test-2b1f9722996542a0a05eef116ed90137.sock every 8 connection(s)
I20260925 16:46:17.969633 5897 acceptor_pool.cc:254] collecting diagnostics on the listening RPC socket unix:/tmp/dist-test-taskXIRP1E/test-tmp/rpc-test-2b1f9722996542a0a05eef116ed90137.sock every 8 connection(s)
[ OK ] Parameters/TestRpc.TestNegotiationDeadlock/SSL_UnixSocket (79 ms)
[ RUN ] Parameters/TestRpc.TestCallWithChainCertAndChainCA/SSL_UnixSocket
I20260925 16:46:18.056095 5912 acceptor_pool.cc:254] collecting diagnostics on the listening RPC socket unix:/tmp/dist-test-taskXIRP1E/test-tmp/rpc-test-614b05c950b6430d957d82a8e1131388.sock every 8 connection(s)
I20260925 16:46:18.058418 5913 acceptor_pool.cc:254] collecting diagnostics on the listening RPC socket unix:/tmp/dist-test-taskXIRP1E/test-tmp/rpc-test-614b05c950b6430d957d82a8e1131388.sock every 8 connection(s)
/data0/somelongdirectorytoavoidrpathissues/src/kudu/src/kudu/rpc/rpc-test.cc:270: Failure
Failed
Bad status: Runtime error: could not verify certificate chain (error with cert: subject=CN = localhost, ST = sadfjas, C = AS, emailAddress = sdflkdsajf, O = lskdfjlsad, OU = sldfkja, issuer=C = AS, ST = ASDfkjdhf, L = lskdjf, O = saldfja, OU = skdjf, CN = localhost, emailAddress = sadjflkadsj): : certificate has expired
Google Test trace:
/data0/somelongdirectorytoavoidrpathissues/src/kudu/src/kudu/rpc/rpc-test.cc:267: Connecting to unix:/tmp/dist-test-taskXIRP1E/test-tmp/rpc-test-614b05c950b6430d957d82a8e1131388.sock
I20260925 16:46:18.084896 5874 test_util.cc:175] -----------------------------------------------
I20260925 16:46:18.085088 5874 test_util.cc:176] Had fatal failures, leaving test files at /tmp/dist-test-taskXIRP1E/test-tmp/rpc-test.6.Parameters_TestRpc.TestCallWithChainCertAndChainCA_SSL_UnixSocket.1790354776732117-5874-0
[ FAILED ] Parameters/TestRpc.TestCallWithChainCertAndChainCA/SSL_UnixSocket, where GetParam() = (true, true) (58 ms)
[ RUN ] Parameters/TestRpc.TestCallWithPasswordProtectedKey/SSL_UnixSocket
I20260925 16:46:18.103645 5937 acceptor_pool.cc:254] collecting diagnostics on the listening RPC socket unix:/tmp/dist-test-taskXIRP1E/test-tmp/rpc-test-60c32038a3a144dd88e5ad5a940373c4.sock every 8 connection(s)
I20260925 16:46:18.104390 5938 acceptor_pool.cc:254] collecting diagnostics on the listening RPC socket unix:/tmp/dist-test-taskXIRP1E/test-tmp/rpc-test-60c32038a3a144dd88e5ad5a940373c4.sock every 8 connection(s)
W20260925 16:46:18.145582 5934 connection.cc:196] Error closing socket: Network error: TlsSocket::Close: Broken pipe
[ OK ] Parameters/TestRpc.TestCallWithPasswordProtectedKey/SSL_UnixSocket (66 ms)
[ RUN ] Parameters/TestRpc.TestCallToBadServer/SSL_UnixSocket
I20260925 16:46:18.169624 5874 rpc-test.cc:394] Status: Network error: Client connection negotiation failed: client connection to 0.0.0.0:0: connect: Connection refused (error 111)
I20260925 16:46:18.170909 5874 rpc-test.cc:394] Status: Network error: Client connection negotiation failed: client connection to 0.0.0.0:0: connect: Connection refused (error 111)
I20260925 16:46:18.172173 5874 rpc-test.cc:394] Status: Network error: Client connection negotiation failed: client connection to 0.0.0.0:0: connect: Connection refused (error 111)
I20260925 16:46:18.173333 5874 rpc-test.cc:394] Status: Network error: Client connection negotiation failed: client connection to 0.0.0.0:0: connect: Connection refused (error 111)
I20260925 16:46:18.174438 5874 rpc-test.cc:394] Status: Network error: Client connection negotiation failed: client connection to 0.0.0.0:0: connect: Connection refused (error 111)
[ OK ] Parameters/TestRpc.TestCallToBadServer/SSL_UnixSocket (25 ms)
[ RUN ] Parameters/TestRpc.TestWrongService/SSL_UnixSocket
I20260925 16:46:18.199081 5972 acceptor_pool.cc:254] collecting diagnostics on the listening RPC socket unix:/tmp/dist-test-taskXIRP1E/test-tmp/rpc-test-34c8ae9ea90b489db430053f50b8b3b3.sock every 8 connection(s)
I20260925 16:46:18.199901 5973 acceptor_pool.cc:254] collecting diagnostics on the listening RPC socket unix:/tmp/dist-test-taskXIRP1E/test-tmp/rpc-test-34c8ae9ea90b489db430053f50b8b3b3.sock every 8 connection(s)
I20260925 16:46:18.263103 5969 messenger.cc:345] service WrongServiceName not registered on TestServer
[ OK ] Parameters/TestRpc.TestWrongService/SSL_UnixSocket (95 ms)
[ RUN ] Parameters/TestRpc.TestConnectionKeepalive/SSL_UnixSocket
I20260925 16:46:18.296262 5995 acceptor_pool.cc:254] collecting diagnostics on the listening RPC socket unix:/tmp/dist-test-taskXIRP1E/test-tmp/rpc-test-c973619130064df3b9d956775c647556.sock every 8 connection(s)
I20260925 16:46:18.296981 5996 acceptor_pool.cc:254] collecting diagnostics on the listening RPC socket unix:/tmp/dist-test-taskXIRP1E/test-tmp/rpc-test-c973619130064df3b9d956775c647556.sock every 8 connection(s)
I20260925 16:46:18.300155 5874 rpc-test.cc:488] Connecting to unix:/tmp/dist-test-taskXIRP1E/test-tmp/rpc-test-c973619130064df3b9d956775c647556.sock
W20260925 16:46:18.775465 6008 connection.cc:196] Error closing socket: Network error: TlsSocket::Close: Broken pipe
[ OK ] Parameters/TestRpc.TestConnectionKeepalive/SSL_UnixSocket (1077 ms)
[ RUN ] Parameters/TestRpc.TestClientConnectionMetrics/SSL_UnixSocket
I20260925 16:46:19.375000 6020 acceptor_pool.cc:254] collecting diagnostics on the listening RPC socket unix:/tmp/dist-test-taskXIRP1E/test-tmp/rpc-test-90ff71186d2b4a90a6a2abb181732d85.sock every 8 connection(s)
I20260925 16:46:19.375725 6021 acceptor_pool.cc:254] collecting diagnostics on the listening RPC socket unix:/tmp/dist-test-taskXIRP1E/test-tmp/rpc-test-90ff71186d2b4a90a6a2abb181732d85.sock every 8 connection(s)
I20260925 16:46:19.378907 5874 rpc-test.cc:569] Connecting to unix:/tmp/dist-test-taskXIRP1E/test-tmp/rpc-test-90ff71186d2b4a90a6a2abb181732d85.sock
W20260925 16:48:32.633276 6017 connection.cc:196] Error closing socket: Network error: TlsSocket::Close: Broken pipe
[ OK ] Parameters/TestRpc.TestClientConnectionMetrics/SSL_UnixSocket (133291 ms)
[ RUN ] Parameters/TestRpc.TestCredentialsPolicy/SSL_UnixSocket
I20260925 16:48:32.684234 6056 acceptor_pool.cc:254] collecting diagnostics on the listening RPC socket unix:/tmp/dist-test-taskXIRP1E/test-tmp/rpc-test-b7ed9acdda224c2ab47a68e86c52157b.sock every 8 connection(s)
I20260925 16:48:32.685043 6057 acceptor_pool.cc:254] collecting diagnostics on the listening RPC socket unix:/tmp/dist-test-taskXIRP1E/test-tmp/rpc-test-b7ed9acdda224c2ab47a68e86c52157b.sock every 8 connection(s)
I20260925 16:48:32.688277 5874 rpc-test.cc:700] Connecting to unix:/tmp/dist-test-taskXIRP1E/test-tmp/rpc-test-b7ed9acdda224c2ab47a68e86c52157b.sock
W20260925 16:48:32.749688 6055 connection.cc:196] Error closing socket: Network error: TlsSocket::Close: Broken pipe
W20260925 16:48:32.763763 6055 connection.cc:196] Error closing socket: Network error: TlsSocket::Close: Broken pipe
[ OK ] Parameters/TestRpc.TestCredentialsPolicy/SSL_UnixSocket (128 ms)
[ RUN ] Parameters/TestRpc.TestCallLongerThanKeepalive/SSL_UnixSocket
I20260925 16:48:32.791085 6081 acceptor_pool.cc:254] collecting diagnostics on the listening RPC socket unix:/tmp/dist-test-taskXIRP1E/test-tmp/rpc-test-f6fbb9ff1e9e4ddd8ed66376beae9139.sock every 8 connection(s)
I20260925 16:48:32.791810 6082 acceptor_pool.cc:254] collecting diagnostics on the listening RPC socket unix:/tmp/dist-test-taskXIRP1E/test-tmp/rpc-test-f6fbb9ff1e9e4ddd8ed66376beae9139.sock every 8 connection(s)
I20260925 16:48:32.823294 6085 rpc-test-base.h:222] got call: sleep_micros: 3000000 deferred: true
I20260925 16:48:35.827349 6085 rpcz_store.cc:275] Call kudu.rpc.GenericCalculatorService.Sleep from unix:<unnamed> (request call id 0) took 3004 ms. Trace:
I20260925 16:48:35.827649 6085 rpcz_store.cc:276] 0925 16:48:32.823146 (+ 0us) service_pool.cc:170] Inserting onto call queue
0925 16:48:32.823239 (+ 93us) service_pool.cc:227] Handling call
0925 16:48:35.827284 (+3004045us) inbound_call.cc:173] Queueing success response
Metrics: {}
W20260925 16:48:35.831447 6078 connection.cc:196] Error closing socket: Network error: TlsSocket::Close: Broken pipe
[ OK ] Parameters/TestRpc.TestCallLongerThanKeepalive/SSL_UnixSocket (3066 ms)
[ RUN ] Parameters/TestRpc.TestRpcSidecar/SSL_UnixSocket
I20260925 16:48:35.865585 6106 acceptor_pool.cc:254] collecting diagnostics on the listening RPC socket unix:/tmp/dist-test-taskXIRP1E/test-tmp/rpc-test-e6ebf3b8581a4e08895c43653e283bf5.sock every 8 connection(s)
I20260925 16:48:35.866290 6107 acceptor_pool.cc:254] collecting diagnostics on the listening RPC socket unix:/tmp/dist-test-taskXIRP1E/test-tmp/rpc-test-e6ebf3b8581a4e08895c43653e283bf5.sock every 8 connection(s)
W20260925 16:48:36.418309 6103 connection.cc:196] Error closing socket: Network error: TlsSocket::Close: Broken pipe
[ OK ] Parameters/TestRpc.TestRpcSidecar/SSL_UnixSocket (586 ms)
[ RUN ] Parameters/TestRpc.TestRpcSidecarLimits/SSL_UnixSocket
I20260925 16:48:52.428454 6133 acceptor_pool.cc:254] collecting diagnostics on the listening RPC socket unix:/tmp/dist-test-taskXIRP1E/test-tmp/rpc-test-8a757253ee4947a5950ee589430ecee2.sock every 8 connection(s)
I20260925 16:48:52.429178 6134 acceptor_pool.cc:254] collecting diagnostics on the listening RPC socket unix:/tmp/dist-test-taskXIRP1E/test-tmp/rpc-test-8a757253ee4947a5950ee589430ecee2.sock every 8 connection(s)
W20260925 16:48:52.447710 5874 serialization.cc:72] Serialized kudu.rpc_test.PushStringsRequestPB (2147483654 bytes) is larger than the maximum configured RPC message size (52428800 bytes). Sending anyway, but peer may reject the data.
W20260925 16:48:52.457336 6130 connection.cc:535] server connection from unix:<unnamed> recv error: Network error: RPC frame had a length of 2147483714, but we only support messages up to 52428800 bytes long.
W20260925 16:48:52.457698 6130 connection.cc:158] shutting down server connection from unix:<unnamed> with pending inbound data: 4/2147483714 bytes received; last active 0 ns ago: status Network error: RPC frame had a length of 2147483714, but we only support messages up to 52428800 bytes long.
W20260925 16:48:52.458328 6146 connection.cc:698] client connection to unix:/tmp/dist-test-taskXIRP1E/test-tmp/rpc-test-8a757253ee4947a5950ee589430ecee2.sock send error: Network error: failed to write to TLS socket: Broken pipe
W20260925 16:48:52.458804 6146 connection.cc:196] Error closing socket: Network error: TlsSocket::Close: Success
[ OK ] Parameters/TestRpc.TestRpcSidecarLimits/SSL_UnixSocket (16725 ms)
[ RUN ] Parameters/TestRpc.TestCallTimeoutDoesntAffectNegotiation/SSL_UnixSocket
I20260925 16:48:53.170962 6158 acceptor_pool.cc:254] collecting diagnostics on the listening RPC socket unix:/tmp/dist-test-taskXIRP1E/test-tmp/rpc-test-68623ae5fb1b49638ba6740b9e086e09.sock every 8 connection(s)
I20260925 16:48:53.171661 6159 acceptor_pool.cc:254] collecting diagnostics on the listening RPC socket unix:/tmp/dist-test-taskXIRP1E/test-tmp/rpc-test-68623ae5fb1b49638ba6740b9e086e09.sock every 8 connection(s)
W20260925 16:48:53.187193 6154 negotiation.cc:266] Injecting 500ms delay in negotiation
I20260925 16:48:53.237722 5874 rpc-test-base.h:595] status: Timed out: connection negotiation to unix:/tmp/dist-test-taskXIRP1E/test-tmp/rpc-test-68623ae5fb1b49638ba6740b9e086e09.sock for RPC Sleep timed out after 0.050s (ON_OUTBOUND_QUEUE), seconds elapsed: 0.0515557
W20260925 16:48:53.700341 6155 connection.cc:196] Error closing socket: Network error: TlsSocket::Close: Broken pipe
[ OK ] Parameters/TestRpc.TestCallTimeoutDoesntAffectNegotiation/SSL_UnixSocket (556 ms)
[ RUN ] Parameters/TestRpc.TestRpcHandlerLatencyMetric/SSL_UnixSocket
I20260925 16:48:53.731474 6183 acceptor_pool.cc:254] collecting diagnostics on the listening RPC socket unix:/tmp/dist-test-taskXIRP1E/test-tmp/rpc-test-50848f7061224e0693eff04b12c1a5ac.sock every 8 connection(s)
I20260925 16:48:53.732169 6184 acceptor_pool.cc:254] collecting diagnostics on the listening RPC socket unix:/tmp/dist-test-taskXIRP1E/test-tmp/rpc-test-50848f7061224e0693eff04b12c1a5ac.sock every 8 connection(s)
I20260925 16:48:53.804728 5874 rpc-test.cc:1236] Sleep() min lat: 21550
I20260925 16:48:53.804937 5874 rpc-test.cc:1237] Sleep() mean lat: 21550
I20260925 16:48:53.805056 5874 rpc-test.cc:1238] Sleep() max lat: 21550
I20260925 16:48:53.805166 5874 rpc-test.cc:1239] Sleep() #calls: 1
[ OK ] Parameters/TestRpc.TestRpcHandlerLatencyMetric/SSL_UnixSocket (106 ms)
[ RUN ] Parameters/TestRpc.TimedOutOnResponseMetricServiceQueue/SSL_UnixSocket
I20260925 16:48:53.837363 6209 acceptor_pool.cc:254] collecting diagnostics on the listening RPC socket unix:/tmp/dist-test-taskXIRP1E/test-tmp/rpc-test-e2a4e162d4ad44d191391b3b301bb635.sock every 8 connection(s)
I20260925 16:48:53.838027 6210 acceptor_pool.cc:254] collecting diagnostics on the listening RPC socket unix:/tmp/dist-test-taskXIRP1E/test-tmp/rpc-test-e2a4e162d4ad44d191391b3b301bb635.sock every 8 connection(s)
W20260925 16:48:53.919440 6211 rpcz_store.cc:267] Call kudu.rpc_test.CalculatorService.Sleep from unix:<unnamed> (request call id 2) took 20 ms (client timeout 20 ms). Trace:
W20260925 16:48:53.919775 6211 rpcz_store.cc:269] 0925 16:48:53.899085 (+ 0us) service_pool.cc:170] Inserting onto call queue
0925 16:48:53.919329 (+ 20244us) service_pool.cc:214] Skipping call since client already timed out
0925 16:48:53.919398 (+ 69us) inbound_call.cc:173] Queueing failure response
Metrics: {}
W20260925 16:48:53.922421 6206 connection.cc:196] Error closing socket: Network error: TlsSocket::Close: Broken pipe
[ OK ] Parameters/TestRpc.TimedOutOnResponseMetricServiceQueue/SSL_UnixSocket (114 ms)
[ RUN ] Parameters/TestRpc.RpcPendingConnectionsMetric/SSL_UnixSocket
I20260925 16:48:53.935905 6232 acceptor_pool.cc:254] collecting diagnostics on the listening RPC socket 0.0.0.0:34921 every 8 connection(s)
I20260925 16:48:53.936664 6233 acceptor_pool.cc:254] collecting diagnostics on the listening RPC socket 0.0.0.0:34921 every 8 connection(s)
W20260925 16:48:53.941720 6228 negotiation.cc:337] Failed RPC negotiation. Trace:
0925 16:48:53.940366 (+ 0us) reactor.cc:625] Submitting negotiation task for server connection from 127.0.0.1:54478 (local address 127.0.0.1:34921)
0925 16:48:53.940760 (+ 394us) server_negotiation.cc:206] Beginning negotiation
0925 16:48:53.940778 (+ 18us) server_negotiation.cc:399] Waiting for connection header
0925 16:48:53.941086 (+ 308us) negotiation.cc:327] Negotiation complete: Network error: Server connection negotiation failed: server connection from 127.0.0.1:54478: BlockingRecv error: recv got EOF from 127.0.0.1:54478 (error 108)
Metrics: {"server-negotiator.queue_time_us":94}
[ OK ] Parameters/TestRpc.RpcPendingConnectionsMetric/SSL_UnixSocket (28 ms)
[ RUN ] Parameters/TestRpc.TestRpcContextClientDeadline/SSL_UnixSocket
I20260925 16:48:53.979954 6248 acceptor_pool.cc:254] collecting diagnostics on the listening RPC socket unix:/tmp/dist-test-taskXIRP1E/test-tmp/rpc-test-c7dacb101fa44ed3b06a6a385f5e462f.sock every 8 connection(s)
I20260925 16:48:53.980677 6249 acceptor_pool.cc:254] collecting diagnostics on the listening RPC socket unix:/tmp/dist-test-taskXIRP1E/test-tmp/rpc-test-c7dacb101fa44ed3b06a6a385f5e462f.sock every 8 connection(s)
[ OK ] Parameters/TestRpc.TestRpcContextClientDeadline/SSL_UnixSocket (105 ms)
[ RUN ] Parameters/TestRpc.TestApplicationFeatureFlagUnsupportedServer/SSL_UnixSocket
I20260925 16:48:54.082023 6273 acceptor_pool.cc:254] collecting diagnostics on the listening RPC socket unix:/tmp/dist-test-taskXIRP1E/test-tmp/rpc-test-feaa169c4cdb4410a5651c007d4c4d95.sock every 8 connection(s)
I20260925 16:48:54.082733 6274 acceptor_pool.cc:254] collecting diagnostics on the listening RPC socket unix:/tmp/dist-test-taskXIRP1E/test-tmp/rpc-test-feaa169c4cdb4410a5651c007d4c4d95.sock every 8 connection(s)
[ OK ] Parameters/TestRpc.TestApplicationFeatureFlagUnsupportedServer/SSL_UnixSocket (62 ms)
[ RUN ] Parameters/TestRpc.TestCancellationAsync/SSL_UnixSocket
I20260925 16:48:54.149520 6298 acceptor_pool.cc:254] collecting diagnostics on the listening RPC socket unix:/tmp/dist-test-taskXIRP1E/test-tmp/rpc-test-858795e0efef46f4a4642aa1c0124dd2.sock every 8 connection(s)
I20260925 16:48:54.150245 6299 acceptor_pool.cc:254] collecting diagnostics on the listening RPC socket unix:/tmp/dist-test-taskXIRP1E/test-tmp/rpc-test-858795e0efef46f4a4642aa1c0124dd2.sock every 8 connection(s)
I20260925 16:48:54.153177 5874 rpc-test.cc:1716] Connecting to unix:/tmp/dist-test-taskXIRP1E/test-tmp/rpc-test-858795e0efef46f4a4642aa1c0124dd2.sock
I20260925 16:48:54.194929 5874 test_util.cc:268] Using random seed: 2111824603
I20260925 16:48:54.422143 6302 rpc-test-base.h:240] got call: sleep_micros: 500 pattern: 4294967295 num_repetitions: 2097152 sidecar_idx: 0
I20260925 16:48:54.625378 6302 rpc-test-base.h:240] got call: sleep_micros: 500 pattern: 4294967295 num_repetitions: 2097152 sidecar_idx: 0
I20260925 16:48:54.813663 6301 rpc-test-base.h:240] got call: sleep_micros: 500 pattern: 4294967295 num_repetitions: 2097152 sidecar_idx: 0
I20260925 16:48:55.017978 6302 rpc-test-base.h:240] got call: sleep_micros: 500 pattern: 4294967295 num_repetitions: 2097152 sidecar_idx: 0
I20260925 16:48:55.246909 6302 rpc-test-base.h:240] got call: sleep_micros: 500 pattern: 4294967295 num_repetitions: 2097152 sidecar_idx: 0
I20260925 16:48:55.455413 6301 rpc-test-base.h:240] got call: sleep_micros: 500 pattern: 4294967295 num_repetitions: 2097152 sidecar_idx: 0
I20260925 16:48:55.655377 6301 rpc-test-base.h:240] got call: sleep_micros: 500 pattern: 4294967295 num_repetitions: 2097152 sidecar_idx: 0
I20260925 16:48:55.860195 6302 rpc-test-base.h:240] got call: sleep_micros: 500 pattern: 4294967295 num_repetitions: 2097152 sidecar_idx: 0
I20260925 16:48:56.042354 6301 rpc-test-base.h:240] got call: sleep_micros: 500 pattern: 4294967295 num_repetitions: 2097152 sidecar_idx: 0
W20260925 16:48:56.070438 6295 connection.cc:196] Error closing socket: Network error: TlsSocket::Close: Broken pipe
W20260925 16:48:56.099852 6295 connection.cc:441] server connection from unix:<unnamed> torn down before Call kudu.rpc.GenericCalculatorService.SleepWithSidecar from unix:<unnamed> (request call id 8) could send its response
W20260925 16:48:56.173434 6295 connection.cc:441] server connection from unix:<unnamed> torn down before Call kudu.rpc.GenericCalculatorService.SleepWithSidecar from unix:<unnamed> (request call id 9) could send its response
[ OK ] Parameters/TestRpc.TestCancellationAsync/SSL_UnixSocket (2060 ms)
[ RUN ] Parameters/TestRpc.TestPerformanceBySocketType/SSL_UnixSocket
I20260925 16:48:56.284111 6323 acceptor_pool.cc:254] collecting diagnostics on the listening RPC socket unix:/tmp/dist-test-taskXIRP1E/test-tmp/rpc-test-e772e32184574554816ff79304b9d683.sock every 8 connection(s)
I20260925 16:48:56.284812 6324 acceptor_pool.cc:254] collecting diagnostics on the listening RPC socket unix:/tmp/dist-test-taskXIRP1E/test-tmp/rpc-test-e772e32184574554816ff79304b9d683.sock every 8 connection(s)
I20260925 16:48:56.287714 5874 rpc-test.cc:1846] Connecting to unix:/tmp/dist-test-taskXIRP1E/test-tmp/rpc-test-e772e32184574554816ff79304b9d683.sock
I20260925 16:49:16.855253 5874 rpc-test.cc:1859] Sending 1024MB via ssl-enabled unix socket: real 20.548s user 18.240s sys 12.434s
I20260925 16:49:37.315729 5874 rpc-test.cc:1859] Sending 1024MB via ssl-enabled unix socket: real 20.460s user 17.973s sys 12.346s
I20260925 16:49:58.056489 5874 rpc-test.cc:1859] Sending 1024MB via ssl-enabled unix socket: real 20.740s user 18.260s sys 12.620s
I20260925 16:50:18.893949 5874 rpc-test.cc:1859] Sending 1024MB via ssl-enabled unix socket: real 20.837s user 18.330s sys 12.797s
I20260925 16:50:39.800890 5874 rpc-test.cc:1859] Sending 1024MB via ssl-enabled unix socket: real 20.907s user 18.727s sys 12.577s
W20260925 16:50:39.809106 6320 connection.cc:196] Error closing socket: Network error: TlsSocket::Close: Broken pipe
[ OK ] Parameters/TestRpc.TestPerformanceBySocketType/SSL_UnixSocket (103634 ms)
[----------] 20 tests from Parameters/TestRpc (263034 ms total)
[----------] 1 test from Parameters/TestRpcSocketTxRxQueue
[ RUN ] Parameters/TestRpcSocketTxRxQueue.AcceptorRxQueueSizeMetric/0
I20260925 16:50:39.828474 6359 acceptor_pool.cc:254] collecting diagnostics on the listening RPC socket 0.0.0.0:36857 every 1 connection(s)
I20260925 16:50:39.829380 6360 acceptor_pool.cc:254] collecting diagnostics on the listening RPC socket 0.0.0.0:36857 every 1 connection(s)
W20260925 16:50:39.834537 6355 negotiation.cc:337] Failed RPC negotiation. Trace:
0925 16:50:39.833201 (+ 0us) reactor.cc:625] Submitting negotiation task for server connection from 127.0.0.1:37544 (local address 127.0.0.1:36857)
0925 16:50:39.833643 (+ 442us) server_negotiation.cc:206] Beginning negotiation
0925 16:50:39.833666 (+ 23us) server_negotiation.cc:399] Waiting for connection header
0925 16:50:39.833882 (+ 216us) negotiation.cc:327] Negotiation complete: Network error: Server connection negotiation failed: server connection from 127.0.0.1:37544: BlockingRecv error: recv got EOF from 127.0.0.1:37544 (error 108)
Metrics: {"server-negotiator.queue_time_us":117}
[ OK ] Parameters/TestRpcSocketTxRxQueue.AcceptorRxQueueSizeMetric/0 (23 ms)
[----------] 1 test from Parameters/TestRpcSocketTxRxQueue (23 ms total)
[----------] Global test environment tear-down
[==========] 21 tests from 2 test suites ran. (263059 ms total)
[ PASSED ] 20 tests.
[ FAILED ] 1 test, listed below:
[ FAILED ] Parameters/TestRpc.TestCallWithChainCertAndChainCA/SSL_UnixSocket, where GetParam() = (true, true)
1 FAILED TEST