Diagnosed failure

Parameters/TestRpc.TestCallWithChainCertAndRootCA/SSL_UnixSocket: /data0/somelongdirectorytoavoidrpathissues/src/kudu/src/kudu/rpc/rpc-test.cc:303: Failure
Failed
Bad status: Runtime error: could not verify certificate chain (error with cert: subject=CN = localhost, ST = sadfjas, C = AS, emailAddress = sdflkdsajf, O = lskdfjlsad, OU = sldfkja, issuer=C = AS, ST = ASDfkjdhf, L = lskdjf, O = saldfja, OU = skdjf, CN = localhost, emailAddress = sadjflkadsj): : certificate has expired
Google Test trace:
/data0/somelongdirectorytoavoidrpathissues/src/kudu/src/kudu/rpc/rpc-test.cc:300: Connecting to unix:/tmp/dist-test-task8GuteR/test-tmp/rpc-test-880f1dfadf11468cb65ea3a2add8b952.sock
I20260925 16:42:51.844738  1941 test_util.cc:175] -----------------------------------------------
I20260925 16:42:51.844935  1941 test_util.cc:176] Had fatal failures, leaving test files at /tmp/dist-test-task8GuteR/test-tmp/rpc-test.2.Parameters_TestRpc.TestCallWithChainCertAndRootCA_SSL_UnixSocket.1790354568245376-1941-0

Full log

Note: This is test shard 3 of 8.
[==========] Running 21 tests from 2 test suites.
[----------] Global test environment set-up.
[----------] 1 test from TestRpc
[ RUN      ] TestRpc.TestNegotiationTimeout
WARNING: Logging before InitGoogleLogging() is written to STDERR
I20260925 16:42:48.433305  1941 rpc-test-base.h:595] status: Timed out: connection negotiation to 0.0.0.0:42899 for RPC Sleep timed out after 0.100s (ON_OUTBOUND_QUEUE), seconds elapsed: 0.101963
W20260925 16:42:51.550725  1951 negotiation.cc:337] Failed RPC negotiation. Trace:
0925 16:42:48.332201 (+     0us) reactor.cc:625] Submitting negotiation task for client connection to 0.0.0.0:42899 (local address 127.0.0.1:37618)
0925 16:42:48.333001 (+   800us) negotiation.cc:107] Waiting for socket to connect
0925 16:42:48.333110 (+   109us) client_negotiation.cc:174] Beginning negotiation
0925 16:42:48.345311 (+ 12201us) client_negotiation.cc:252] Sending NEGOTIATE NegotiatePB request
0925 16:42:51.549641 (+3204330us) negotiation.cc:327] Negotiation complete: Timed out: Client connection negotiation failed: client connection to 0.0.0.0:42899: received 0 of 4 requested bytes
Metrics: {"client-negotiator.queue_time_us":245}
[       OK ] TestRpc.TestNegotiationTimeout (3257 ms)
[----------] 1 test from TestRpc (3257 ms total)

[----------] 20 tests from Parameters/TestRpc
[ RUN      ] Parameters/TestRpc.TestAcceptorPoolStartStop/SSL_UnixSocket
I20260925 16:42:51.590528  1967 acceptor_pool.cc:254] collecting diagnostics on the listening RPC socket unix:/tmp/dist-test-task8GuteR/test-tmp/rpc-test-6c22d9c4d98c4b7ab06c5ae67c1cc4fb.sock every 8 connection(s)
I20260925 16:42:51.592250  1968 acceptor_pool.cc:254] collecting diagnostics on the listening RPC socket unix:/tmp/dist-test-task8GuteR/test-tmp/rpc-test-6c22d9c4d98c4b7ab06c5ae67c1cc4fb.sock every 8 connection(s)
I20260925 16:42:51.623621  1978 acceptor_pool.cc:254] collecting diagnostics on the listening RPC socket unix:/tmp/dist-test-task8GuteR/test-tmp/rpc-test-6c22d9c4d98c4b7ab06c5ae67c1cc4fb.sock every 8 connection(s)
I20260925 16:42:51.625161  1979 acceptor_pool.cc:254] collecting diagnostics on the listening RPC socket unix:/tmp/dist-test-task8GuteR/test-tmp/rpc-test-6c22d9c4d98c4b7ab06c5ae67c1cc4fb.sock every 8 connection(s)
I20260925 16:42:51.647702  1989 acceptor_pool.cc:254] collecting diagnostics on the listening RPC socket unix:/tmp/dist-test-task8GuteR/test-tmp/rpc-test-6c22d9c4d98c4b7ab06c5ae67c1cc4fb.sock every 8 connection(s)
I20260925 16:42:51.648425  1990 acceptor_pool.cc:254] collecting diagnostics on the listening RPC socket unix:/tmp/dist-test-task8GuteR/test-tmp/rpc-test-6c22d9c4d98c4b7ab06c5ae67c1cc4fb.sock every 8 connection(s)
I20260925 16:42:51.672396  2000 acceptor_pool.cc:254] collecting diagnostics on the listening RPC socket unix:/tmp/dist-test-task8GuteR/test-tmp/rpc-test-6c22d9c4d98c4b7ab06c5ae67c1cc4fb.sock every 8 connection(s)
I20260925 16:42:51.673192  2001 acceptor_pool.cc:254] collecting diagnostics on the listening RPC socket unix:/tmp/dist-test-task8GuteR/test-tmp/rpc-test-6c22d9c4d98c4b7ab06c5ae67c1cc4fb.sock every 8 connection(s)
I20260925 16:42:51.700039  2011 acceptor_pool.cc:254] collecting diagnostics on the listening RPC socket unix:/tmp/dist-test-task8GuteR/test-tmp/rpc-test-6c22d9c4d98c4b7ab06c5ae67c1cc4fb.sock every 8 connection(s)
I20260925 16:42:51.700690  2012 acceptor_pool.cc:254] collecting diagnostics on the listening RPC socket unix:/tmp/dist-test-task8GuteR/test-tmp/rpc-test-6c22d9c4d98c4b7ab06c5ae67c1cc4fb.sock every 8 connection(s)
[       OK ] Parameters/TestRpc.TestAcceptorPoolStartStop/SSL_UnixSocket (149 ms)
[ RUN      ] Parameters/TestRpc.TestCall/SSL_UnixSocket
I20260925 16:42:51.720903  2024 acceptor_pool.cc:254] collecting diagnostics on the listening RPC socket unix:/tmp/dist-test-task8GuteR/test-tmp/rpc-test-f03cf1fda73743bca8c7137609086485.sock every 8 connection(s)
I20260925 16:42:51.723012  2025 acceptor_pool.cc:254] collecting diagnostics on the listening RPC socket unix:/tmp/dist-test-task8GuteR/test-tmp/rpc-test-f03cf1fda73743bca8c7137609086485.sock every 8 connection(s)
I20260925 16:42:51.727797  1941 rpc-test.cc:234] Connecting to unix:/tmp/dist-test-task8GuteR/test-tmp/rpc-test-f03cf1fda73743bca8c7137609086485.sock
W20260925 16:42:51.783030  2021 connection.cc:196] Error closing socket: Network error: TlsSocket::Close: Broken pipe
[       OK ] Parameters/TestRpc.TestCall/SSL_UnixSocket (83 ms)
[ RUN      ] Parameters/TestRpc.TestCallWithChainCertAndRootCA/SSL_UnixSocket
I20260925 16:42:51.824407  2049 acceptor_pool.cc:254] collecting diagnostics on the listening RPC socket unix:/tmp/dist-test-task8GuteR/test-tmp/rpc-test-880f1dfadf11468cb65ea3a2add8b952.sock every 8 connection(s)
I20260925 16:42:51.825191  2050 acceptor_pool.cc:254] collecting diagnostics on the listening RPC socket unix:/tmp/dist-test-task8GuteR/test-tmp/rpc-test-880f1dfadf11468cb65ea3a2add8b952.sock every 8 connection(s)
/data0/somelongdirectorytoavoidrpathissues/src/kudu/src/kudu/rpc/rpc-test.cc:303: Failure
Failed
Bad status: Runtime error: could not verify certificate chain (error with cert: subject=CN = localhost, ST = sadfjas, C = AS, emailAddress = sdflkdsajf, O = lskdfjlsad, OU = sldfkja, issuer=C = AS, ST = ASDfkjdhf, L = lskdjf, O = saldfja, OU = skdjf, CN = localhost, emailAddress = sadjflkadsj): : certificate has expired
Google Test trace:
/data0/somelongdirectorytoavoidrpathissues/src/kudu/src/kudu/rpc/rpc-test.cc:300: Connecting to unix:/tmp/dist-test-task8GuteR/test-tmp/rpc-test-880f1dfadf11468cb65ea3a2add8b952.sock
I20260925 16:42:51.844738  1941 test_util.cc:175] -----------------------------------------------
I20260925 16:42:51.844935  1941 test_util.cc:176] Had fatal failures, leaving test files at /tmp/dist-test-task8GuteR/test-tmp/rpc-test.2.Parameters_TestRpc.TestCallWithChainCertAndRootCA_SSL_UnixSocket.1790354568245376-1941-0
[  FAILED  ] Parameters/TestRpc.TestCallWithChainCertAndRootCA/SSL_UnixSocket, where GetParam() = (true, true) (57 ms)
[ RUN      ] Parameters/TestRpc.TestCallWithBadPasswordProtectedKey/SSL_UnixSocket
[       OK ] Parameters/TestRpc.TestCallWithBadPasswordProtectedKey/SSL_UnixSocket (30 ms)
[ RUN      ] Parameters/TestRpc.TestInvalidMethodCall/SSL_UnixSocket
I20260925 16:42:51.899564  2086 acceptor_pool.cc:254] collecting diagnostics on the listening RPC socket unix:/tmp/dist-test-task8GuteR/test-tmp/rpc-test-d1016dfc44bd4512b31797eb0be4203d.sock every 8 connection(s)
I20260925 16:42:51.900410  2087 acceptor_pool.cc:254] collecting diagnostics on the listening RPC socket unix:/tmp/dist-test-task8GuteR/test-tmp/rpc-test-d1016dfc44bd4512b31797eb0be4203d.sock every 8 connection(s)
I20260925 16:42:51.903777  1941 rpc-test.cc:406] Connecting to unix:/tmp/dist-test-task8GuteR/test-tmp/rpc-test-d1016dfc44bd4512b31797eb0be4203d.sock
W20260925 16:42:51.939954  2083 connection.cc:196] Error closing socket: Network error: TlsSocket::Close: Broken pipe
[       OK ] Parameters/TestRpc.TestInvalidMethodCall/SSL_UnixSocket (69 ms)
[ RUN      ] Parameters/TestRpc.TestHighFDs/SSL_UnixSocket
I20260925 16:42:52.195597  2111 acceptor_pool.cc:254] collecting diagnostics on the listening RPC socket unix:/tmp/dist-test-task8GuteR/test-tmp/rpc-test-80fdcdab8ec0456cb0d05bf2bac07c1b.sock every 8 connection(s)
I20260925 16:42:52.196260  2112 acceptor_pool.cc:254] collecting diagnostics on the listening RPC socket unix:/tmp/dist-test-task8GuteR/test-tmp/rpc-test-80fdcdab8ec0456cb0d05bf2bac07c1b.sock every 8 connection(s)
[       OK ] Parameters/TestRpc.TestHighFDs/SSL_UnixSocket (321 ms)
[ RUN      ] Parameters/TestRpc.TestConnectionAlwaysKeepalive/SSL_UnixSocket
I20260925 16:42:52.296712  2134 acceptor_pool.cc:254] collecting diagnostics on the listening RPC socket unix:/tmp/dist-test-task8GuteR/test-tmp/rpc-test-fa870b30f6bf408c96aa8a3835e3b31b.sock every 8 connection(s)
I20260925 16:42:52.297457  2135 acceptor_pool.cc:254] collecting diagnostics on the listening RPC socket unix:/tmp/dist-test-task8GuteR/test-tmp/rpc-test-fa870b30f6bf408c96aa8a3835e3b31b.sock every 8 connection(s)
I20260925 16:42:52.300460  1941 rpc-test.cc:532] Connecting to unix:/tmp/dist-test-task8GuteR/test-tmp/rpc-test-fa870b30f6bf408c96aa8a3835e3b31b.sock
W20260925 16:42:55.339097  2133 connection.cc:196] Error closing socket: Network error: TlsSocket::Close: Broken pipe
[       OK ] Parameters/TestRpc.TestConnectionAlwaysKeepalive/SSL_UnixSocket (3078 ms)
[ RUN      ] Parameters/TestRpc.TestReopenOutboundConnections/SSL_UnixSocket
I20260925 16:42:55.363811  2157 acceptor_pool.cc:254] collecting diagnostics on the listening RPC socket unix:/tmp/dist-test-task8GuteR/test-tmp/rpc-test-25a833c4a5a64316915385548b288da4.sock every 8 connection(s)
I20260925 16:42:55.364552  2158 acceptor_pool.cc:254] collecting diagnostics on the listening RPC socket unix:/tmp/dist-test-task8GuteR/test-tmp/rpc-test-25a833c4a5a64316915385548b288da4.sock every 8 connection(s)
I20260925 16:42:55.367633  1941 rpc-test.cc:658] Connecting to unix:/tmp/dist-test-task8GuteR/test-tmp/rpc-test-25a833c4a5a64316915385548b288da4.sock
W20260925 16:42:55.390009  2156 connection.cc:196] Error closing socket: Network error: TlsSocket::Close: Broken pipe
W20260925 16:42:55.400401  2156 connection.cc:196] Error closing socket: Network error: TlsSocket::Close: Broken pipe
W20260925 16:42:55.410584  2156 connection.cc:196] Error closing socket: Network error: TlsSocket::Close: Broken pipe
W20260925 16:42:55.420907  2156 connection.cc:196] Error closing socket: Network error: TlsSocket::Close: Broken pipe
W20260925 16:42:55.431068  2156 connection.cc:196] Error closing socket: Network error: TlsSocket::Close: Broken pipe
W20260925 16:42:55.441329  2156 connection.cc:196] Error closing socket: Network error: TlsSocket::Close: Broken pipe
W20260925 16:42:55.452653  2156 connection.cc:196] Error closing socket: Network error: TlsSocket::Close: Broken pipe
W20260925 16:42:55.462844  2156 connection.cc:196] Error closing socket: Network error: TlsSocket::Close: Broken pipe
W20260925 16:42:55.472892  2156 connection.cc:196] Error closing socket: Network error: TlsSocket::Close: Broken pipe
W20260925 16:42:55.483261  2156 connection.cc:196] Error closing socket: Network error: TlsSocket::Close: Broken pipe
W20260925 16:42:55.493086  2156 connection.cc:196] Error closing socket: Network error: TlsSocket::Close: Broken pipe
W20260925 16:42:55.502876  2156 connection.cc:196] Error closing socket: Network error: TlsSocket::Close: Broken pipe
W20260925 16:42:55.512753  2156 connection.cc:196] Error closing socket: Network error: TlsSocket::Close: Broken pipe
W20260925 16:42:55.522595  2156 connection.cc:196] Error closing socket: Network error: TlsSocket::Close: Broken pipe
W20260925 16:42:55.522635  2157 acceptor_pool.cc:285] unable to collect diagnostics on RPC socket unix:/tmp/dist-test-task8GuteR/test-tmp/rpc-test-25a833c4a5a64316915385548b288da4.sock: Not implemented: netlink diagnostics is currently supported only on IPv4 TCP sockets
W20260925 16:42:55.532594  2156 connection.cc:196] Error closing socket: Network error: TlsSocket::Close: Broken pipe
W20260925 16:42:55.542577  2156 connection.cc:196] Error closing socket: Network error: TlsSocket::Close: Broken pipe
W20260925 16:42:55.552747  2156 connection.cc:196] Error closing socket: Network error: TlsSocket::Close: Broken pipe
W20260925 16:42:55.562837  2156 connection.cc:196] Error closing socket: Network error: TlsSocket::Close: Broken pipe
W20260925 16:42:55.572992  2156 connection.cc:196] Error closing socket: Network error: TlsSocket::Close: Broken pipe
W20260925 16:42:55.583118  2156 connection.cc:196] Error closing socket: Network error: TlsSocket::Close: Broken pipe
W20260925 16:42:55.593217  2156 connection.cc:196] Error closing socket: Network error: TlsSocket::Close: Broken pipe
W20260925 16:42:55.603163  2156 connection.cc:196] Error closing socket: Network error: TlsSocket::Close: Broken pipe
W20260925 16:42:55.613379  2156 connection.cc:196] Error closing socket: Network error: TlsSocket::Close: Broken pipe
W20260925 16:42:55.623569  2156 connection.cc:196] Error closing socket: Network error: TlsSocket::Close: Broken pipe
W20260925 16:42:55.633399  2156 connection.cc:196] Error closing socket: Network error: TlsSocket::Close: Broken pipe
W20260925 16:42:55.643056  2156 connection.cc:196] Error closing socket: Network error: TlsSocket::Close: Broken pipe
W20260925 16:42:55.652391  2156 connection.cc:196] Error closing socket: Network error: TlsSocket::Close: Broken pipe
W20260925 16:42:55.662295  2156 connection.cc:196] Error closing socket: Network error: TlsSocket::Close: Broken pipe
W20260925 16:42:55.671730  2156 connection.cc:196] Error closing socket: Network error: TlsSocket::Close: Broken pipe
W20260925 16:42:55.680945  2156 connection.cc:196] Error closing socket: Network error: TlsSocket::Close: Broken pipe
W20260925 16:42:55.690289  2156 connection.cc:196] Error closing socket: Network error: TlsSocket::Close: Broken pipe
W20260925 16:42:55.700779  2156 connection.cc:196] Error closing socket: Network error: TlsSocket::Close: Broken pipe
[       OK ] Parameters/TestRpc.TestReopenOutboundConnections/SSL_UnixSocket (361 ms)
[ RUN      ] Parameters/TestRpc.TestConnectionNetworkPlane/SSL_UnixSocket
I20260925 16:42:55.726794  2180 acceptor_pool.cc:254] collecting diagnostics on the listening RPC socket unix:/tmp/dist-test-task8GuteR/test-tmp/rpc-test-5b2bb1c9f68442428a0cd13f118dbc54.sock every 8 connection(s)
I20260925 16:42:55.727536  2181 acceptor_pool.cc:254] collecting diagnostics on the listening RPC socket unix:/tmp/dist-test-task8GuteR/test-tmp/rpc-test-5b2bb1c9f68442428a0cd13f118dbc54.sock every 8 connection(s)
I20260925 16:42:55.730598  1941 rpc-test.cc:772] Connecting to unix:/tmp/dist-test-task8GuteR/test-tmp/rpc-test-5b2bb1c9f68442428a0cd13f118dbc54.sock
W20260925 16:42:55.765503  2179 connection.cc:196] Error closing socket: Network error: TlsSocket::Close: Broken pipe
W20260925 16:42:55.766347  2179 connection.cc:196] Error closing socket: Network error: TlsSocket::Close: Broken pipe
[       OK ] Parameters/TestRpc.TestConnectionNetworkPlane/SSL_UnixSocket (65 ms)
[ RUN      ] Parameters/TestRpc.TestTCPKeepalive/SSL_UnixSocket
I20260925 16:42:55.788146  2205 acceptor_pool.cc:254] collecting diagnostics on the listening RPC socket unix:/tmp/dist-test-task8GuteR/test-tmp/rpc-test-045fed3c7c2f4470ae89a812e54af61d.sock every 8 connection(s)
I20260925 16:42:55.788866  2206 acceptor_pool.cc:254] collecting diagnostics on the listening RPC socket unix:/tmp/dist-test-task8GuteR/test-tmp/rpc-test-045fed3c7c2f4470ae89a812e54af61d.sock every 8 connection(s)
I20260925 16:42:55.819427  2209 rpc-test-base.h:222] got call: sleep_micros: 8000000 deferred: true
I20260925 16:43:03.823283  2209 rpcz_store.cc:275] Call kudu.rpc.GenericCalculatorService.Sleep from unix:<unnamed> (request call id 0) took 8003 ms. Trace:
I20260925 16:43:03.823807  2209 rpcz_store.cc:276] 0925 16:42:55.819283 (+     0us) service_pool.cc:170] Inserting onto call queue
0925 16:42:55.819378 (+    95us) service_pool.cc:227] Handling call
0925 16:43:03.823105 (+8003727us) inbound_call.cc:173] Queueing success response
Metrics: {}
W20260925 16:43:03.829994  2202 connection.cc:196] Error closing socket: Network error: TlsSocket::Close: Broken pipe
[       OK ] Parameters/TestRpc.TestTCPKeepalive/SSL_UnixSocket (8066 ms)
[ RUN      ] Parameters/TestRpc.TestMaxSmallSidecars/SSL_UnixSocket
I20260925 16:43:03.864006  2231 acceptor_pool.cc:254] collecting diagnostics on the listening RPC socket unix:/tmp/dist-test-task8GuteR/test-tmp/rpc-test-03eb1648b63c4e2cba4428903febba00.sock every 8 connection(s)
I20260925 16:43:03.864918  2232 acceptor_pool.cc:254] collecting diagnostics on the listening RPC socket unix:/tmp/dist-test-task8GuteR/test-tmp/rpc-test-03eb1648b63c4e2cba4428903febba00.sock every 8 connection(s)
W20260925 16:43:04.025677  2228 connection.cc:196] Error closing socket: Network error: TlsSocket::Close: Broken pipe
[       OK ] Parameters/TestRpc.TestMaxSmallSidecars/SSL_UnixSocket (192 ms)
[ RUN      ] Parameters/TestRpc.TestCallTimeout/SSL_UnixSocket
I20260925 16:43:04.047837  2256 acceptor_pool.cc:254] collecting diagnostics on the listening RPC socket unix:/tmp/dist-test-task8GuteR/test-tmp/rpc-test-7f8a97c00b1d415cbd082557f0102aba.sock every 8 connection(s)
I20260925 16:43:04.048588  2257 acceptor_pool.cc:254] collecting diagnostics on the listening RPC socket unix:/tmp/dist-test-task8GuteR/test-tmp/rpc-test-7f8a97c00b1d415cbd082557f0102aba.sock every 8 connection(s)
I20260925 16:43:04.089129  1941 rpc-test-base.h:595] status: Timed out: connection negotiation to unix:/tmp/dist-test-task8GuteR/test-tmp/rpc-test-7f8a97c00b1d415cbd082557f0102aba.sock for RPC Sleep timed out after 0.000s (ON_OUTBOUND_QUEUE), seconds elapsed: 0.00219491
I20260925 16:43:04.095966  2260 rpc-test-base.h:222] got call: sleep_micros: 700000
I20260925 16:43:04.290748  1941 rpc-test-base.h:595] status: Timed out: Sleep RPC to unix:/tmp/dist-test-task8GuteR/test-tmp/rpc-test-7f8a97c00b1d415cbd082557f0102aba.sock timed out after 0.200s (SENT), seconds elapsed: 0.201248
I20260925 16:43:04.292269  2259 rpc-test-base.h:222] got call: sleep_micros: 2000000
W20260925 16:43:04.796550  2260 rpcz_store.cc:267] Call kudu.rpc.GenericCalculatorService.Sleep from unix:<unnamed> (request call id 1) took 700 ms (client timeout 200 ms). Trace:
W20260925 16:43:04.796895  2260 rpcz_store.cc:269] 0925 16:43:04.095801 (+     0us) service_pool.cc:170] Inserting onto call queue
0925 16:43:04.095919 (+   118us) service_pool.cc:227] Handling call
0925 16:43:04.796501 (+700582us) inbound_call.cc:173] Queueing success response
Metrics: {}
I20260925 16:43:05.792505  1941 rpc-test-base.h:595] status: Timed out: Sleep RPC to unix:/tmp/dist-test-task8GuteR/test-tmp/rpc-test-7f8a97c00b1d415cbd082557f0102aba.sock timed out after 1.500s (SENT), seconds elapsed: 1.50139
W20260925 16:43:06.292814  2259 rpcz_store.cc:267] Call kudu.rpc.GenericCalculatorService.Sleep from unix:<unnamed> (request call id 2) took 2000 ms (client timeout 1500 ms). Trace:
W20260925 16:43:06.293198  2259 rpcz_store.cc:269] 0925 16:43:04.291977 (+     0us) service_pool.cc:170] Inserting onto call queue
0925 16:43:04.292103 (+   126us) service_pool.cc:227] Handling call
0925 16:43:06.292760 (+2000657us) inbound_call.cc:173] Queueing success response
Metrics: {}
W20260925 16:43:06.293841  2253 connection.cc:441] server connection from unix:<unnamed> torn down before Call kudu.rpc.GenericCalculatorService.Sleep from unix:<unnamed> (request call id 2) could send its response
[       OK ] Parameters/TestRpc.TestCallTimeout/SSL_UnixSocket (2268 ms)
[ RUN      ] Parameters/TestRpc.TestServerShutsDown/SSL_UnixSocket
I20260925 16:43:06.300872  1941 rpc-test.cc:1125] Connecting to 0.0.0.0:36799
W20260925 16:43:06.309887  2273 negotiation.cc:337] Failed RPC negotiation. Trace:
0925 16:43:06.308443 (+     0us) reactor.cc:625] Submitting negotiation task for client connection to 0.0.0.0:36799 (local address 127.0.0.1:41894)
0925 16:43:06.308876 (+   433us) negotiation.cc:107] Waiting for socket to connect
0925 16:43:06.308907 (+    31us) client_negotiation.cc:174] Beginning negotiation
0925 16:43:06.309203 (+   296us) client_negotiation.cc:252] Sending NEGOTIATE NegotiatePB request
0925 16:43:06.309405 (+   202us) negotiation.cc:327] Negotiation complete: Network error: Client connection negotiation failed: client connection to 0.0.0.0:36799: BlockingWrite error: write error: Broken pipe (error 32)
Metrics: {"client-negotiator.queue_time_us":109}
[       OK ] Parameters/TestRpc.TestServerShutsDown/SSL_UnixSocket (13 ms)
[ RUN      ] Parameters/TestRpc.TimedOutOnResponseMetric/SSL_UnixSocket
I20260925 16:43:06.336984  2290 acceptor_pool.cc:254] collecting diagnostics on the listening RPC socket unix:/tmp/dist-test-task8GuteR/test-tmp/rpc-test-6b55d2dec9434f99a447bfa3576e3bf5.sock every 8 connection(s)
I20260925 16:43:06.337766  2291 acceptor_pool.cc:254] collecting diagnostics on the listening RPC socket unix:/tmp/dist-test-task8GuteR/test-tmp/rpc-test-6b55d2dec9434f99a447bfa3576e3bf5.sock every 8 connection(s)
W20260925 16:43:06.579128  2294 rpcz_store.cc:267] Call kudu.rpc_test.CalculatorService.Sleep from unix:<unnamed> (request call id 3) took 50 ms (client timeout 25 ms). Trace:
W20260925 16:43:06.579468  2294 rpcz_store.cc:269] 0925 16:43:06.528586 (+     0us) service_pool.cc:170] Inserting onto call queue
0925 16:43:06.528696 (+   110us) service_pool.cc:227] Handling call
0925 16:43:06.579060 (+ 50364us) inbound_call.cc:173] Queueing success response
Related trace 'test_child':
Metrics: {"test_sleep_us":50000,"child_traces":[["test_child",{"related_trace_metric":1}]]}
W20260925 16:43:06.638556  2294 rpcz_store.cc:267] Call kudu.rpc_test.CalculatorService.Sleep from unix:<unnamed> (request call id 4) took 50 ms (client timeout 50 ms). Trace:
W20260925 16:43:06.638906  2294 rpcz_store.cc:269] 0925 16:43:06.588016 (+     0us) service_pool.cc:170] Inserting onto call queue
0925 16:43:06.588134 (+   118us) service_pool.cc:227] Handling call
0925 16:43:06.638496 (+ 50362us) inbound_call.cc:173] Queueing success response
Related trace 'test_child':
Metrics: {"test_sleep_us":50000,"child_traces":[["test_child",{"related_trace_metric":1}]]}
[       OK ] Parameters/TestRpc.TimedOutOnResponseMetric/SSL_UnixSocket (334 ms)
[ RUN      ] Parameters/TestRpc.AcceptorDispatchingTimesMetric/SSL_UnixSocket
I20260925 16:43:06.657559  2315 acceptor_pool.cc:254] collecting diagnostics on the listening RPC socket 0.0.0.0:42655 every 8 connection(s)
I20260925 16:43:06.658201  2316 acceptor_pool.cc:254] collecting diagnostics on the listening RPC socket 0.0.0.0:42655 every 8 connection(s)
W20260925 16:43:06.664426  2311 negotiation.cc:337] Failed RPC negotiation. Trace:
0925 16:43:06.662477 (+     0us) reactor.cc:625] Submitting negotiation task for server connection from 127.0.0.1:40654 (local address 127.0.0.1:42655)
0925 16:43:06.663056 (+   579us) server_negotiation.cc:206] Beginning negotiation
0925 16:43:06.663099 (+    43us) server_negotiation.cc:399] Waiting for connection header
0925 16:43:06.663399 (+   300us) negotiation.cc:327] Negotiation complete: Network error: Server connection negotiation failed: server connection from 127.0.0.1:40654: BlockingRecv error: recv got EOF from 127.0.0.1:40654 (error 108)
Metrics: {"server-negotiator.queue_time_us":185}
[       OK ] Parameters/TestRpc.AcceptorDispatchingTimesMetric/SSL_UnixSocket (20 ms)
[ RUN      ] Parameters/TestRpc.TestRpcCallbackDestroysMessenger/SSL_UnixSocket
[       OK ] Parameters/TestRpc.TestRpcCallbackDestroysMessenger/SSL_UnixSocket (28 ms)
[ RUN      ] Parameters/TestRpc.TestApplicationFeatureFlag/SSL_UnixSocket
I20260925 16:43:06.712349  2340 acceptor_pool.cc:254] collecting diagnostics on the listening RPC socket unix:/tmp/dist-test-task8GuteR/test-tmp/rpc-test-beecca40da36429f9b1da87078ef4b00.sock every 8 connection(s)
I20260925 16:43:06.713097  2341 acceptor_pool.cc:254] collecting diagnostics on the listening RPC socket unix:/tmp/dist-test-task8GuteR/test-tmp/rpc-test-beecca40da36429f9b1da87078ef4b00.sock every 8 connection(s)
W20260925 16:43:06.746644  2337 messenger.cc:357] Unable to handle RPC call: Not implemented: call requires unsupported application feature flags: 99
[       OK ] Parameters/TestRpc.TestApplicationFeatureFlag/SSL_UnixSocket (57 ms)
[ RUN      ] Parameters/TestRpc.TestCancellation/SSL_UnixSocket
I20260925 16:43:06.776479  2365 acceptor_pool.cc:254] collecting diagnostics on the listening RPC socket unix:/tmp/dist-test-task8GuteR/test-tmp/rpc-test-9448deb9e4a64f5b88b289aa85f2d612.sock every 8 connection(s)
I20260925 16:43:06.777218  2366 acceptor_pool.cc:254] collecting diagnostics on the listening RPC socket unix:/tmp/dist-test-task8GuteR/test-tmp/rpc-test-9448deb9e4a64f5b88b289aa85f2d612.sock every 8 connection(s)
I20260925 16:43:06.780247  1941 rpc-test.cc:1648] Connecting to unix:/tmp/dist-test-task8GuteR/test-tmp/rpc-test-9448deb9e4a64f5b88b289aa85f2d612.sock
I20260925 16:43:06.878710  1941 rpc-test-base.h:595] status: Aborted: Sleep RPC to unix:/tmp/dist-test-task8GuteR/test-tmp/rpc-test-9448deb9e4a64f5b88b289aa85f2d612.sock is cancelled in state READY, seconds elapsed: 0.000334941
I20260925 16:43:07.048537  1941 rpc-test-base.h:595] status: Aborted: Sleep RPC to unix:/tmp/dist-test-task8GuteR/test-tmp/rpc-test-9448deb9e4a64f5b88b289aa85f2d612.sock is cancelled in state SENT, seconds elapsed: 0.000778286
I20260925 16:43:07.048733  2368 rpc-test-base.h:222] got call: sleep_micros: 510000
I20260925 16:43:07.235083  1941 rpc-test-base.h:595] status: Aborted: Sleep RPC to unix:/tmp/dist-test-task8GuteR/test-tmp/rpc-test-9448deb9e4a64f5b88b289aa85f2d612.sock is cancelled in state SENT, seconds elapsed: 0.000832531
I20260925 16:43:07.235263  2367 rpc-test-base.h:222] got call: sleep_micros: 510000
I20260925 16:43:07.400697  1941 rpc-test-base.h:595] status: Aborted: Sleep RPC to unix:/tmp/dist-test-task8GuteR/test-tmp/rpc-test-9448deb9e4a64f5b88b289aa85f2d612.sock is cancelled in state SENT, seconds elapsed: 0.000781508
W20260925 16:43:07.411903  2369 rpcz_store.cc:267] Call kudu.rpc.GenericCalculatorService.Sleep from unix:<unnamed> (request call id 11) took 11 ms (client timeout 10 ms). Trace:
W20260925 16:43:07.412200  2369 rpcz_store.cc:269] 0925 16:43:07.400662 (+     0us) service_pool.cc:170] Inserting onto call queue
0925 16:43:07.411644 (+ 10982us) service_pool.cc:214] Skipping call since client already timed out
0925 16:43:07.411722 (+    78us) inbound_call.cc:173] Queueing failure response
Metrics: {}
I20260925 16:43:07.412745  2369 rpc-test-base.h:222] got call: sleep_micros: 1500000
W20260925 16:43:07.559217  2368 rpcz_store.cc:267] Call kudu.rpc.GenericCalculatorService.Sleep from unix:<unnamed> (request call id 3) took 510 ms (client timeout 10 ms). Trace:
W20260925 16:43:07.559535  2368 rpcz_store.cc:269] 0925 16:43:07.048570 (+     0us) service_pool.cc:170] Inserting onto call queue
0925 16:43:07.048680 (+   110us) service_pool.cc:227] Handling call
0925 16:43:07.559164 (+510484us) inbound_call.cc:173] Queueing success response
Metrics: {}
W20260925 16:43:07.745859  2367 rpcz_store.cc:267] Call kudu.rpc.GenericCalculatorService.Sleep from unix:<unnamed> (request call id 7) took 510 ms (client timeout 10 ms). Trace:
W20260925 16:43:07.746223  2367 rpcz_store.cc:269] 0925 16:43:07.235097 (+     0us) service_pool.cc:170] Inserting onto call queue
0925 16:43:07.235222 (+   125us) service_pool.cc:227] Handling call
0925 16:43:07.745807 (+510585us) inbound_call.cc:173] Queueing success response
Metrics: {}
I20260925 16:43:08.402599  1941 rpc-test-base.h:595] status: Timed out: Sleep RPC to unix:/tmp/dist-test-task8GuteR/test-tmp/rpc-test-9448deb9e4a64f5b88b289aa85f2d612.sock timed out after 1.000s (SENT), seconds elapsed: 1.0015
I20260925 16:43:08.404408  2367 rpc-test-base.h:222] got call: sleep_micros: 1500000
W20260925 16:43:08.913381  2369 rpcz_store.cc:267] Call kudu.rpc.GenericCalculatorService.Sleep from unix:<unnamed> (request call id 12) took 1511 ms (client timeout 1000 ms). Trace:
W20260925 16:43:08.913739  2369 rpcz_store.cc:269] 0925 16:43:07.401676 (+     0us) service_pool.cc:170] Inserting onto call queue
0925 16:43:07.412704 (+ 11028us) service_pool.cc:227] Handling call
0925 16:43:08.913251 (+1500547us) inbound_call.cc:173] Queueing success response
Metrics: {}
I20260925 16:43:09.405130  1941 rpc-test-base.h:595] status: Timed out: Sleep RPC to unix:/tmp/dist-test-task8GuteR/test-tmp/rpc-test-9448deb9e4a64f5b88b289aa85f2d612.sock timed out after 1.000s (SENT), seconds elapsed: 1.00204
W20260925 16:43:09.406656  2362 messenger.cc:357] Unable to handle RPC call: Not implemented: call requires unsupported application feature flags: 99, 1
W20260925 16:43:09.408078  2362 messenger.cc:357] Unable to handle RPC call: Not implemented: call requires unsupported application feature flags: 99, 1
W20260925 16:43:09.644299  2362 connection.cc:196] Error closing socket: Network error: TlsSocket::Close: Broken pipe
W20260925 16:43:09.905079  2367 rpcz_store.cc:267] Call kudu.rpc.GenericCalculatorService.Sleep from unix:<unnamed> (request call id 13) took 1501 ms (client timeout 1000 ms). Trace:
W20260925 16:43:09.905426  2367 rpcz_store.cc:269] 0925 16:43:08.404111 (+     0us) service_pool.cc:170] Inserting onto call queue
0925 16:43:08.404290 (+   179us) service_pool.cc:227] Handling call
0925 16:43:09.904990 (+1500700us) inbound_call.cc:173] Queueing success response
Metrics: {}
W20260925 16:43:09.905980  2362 connection.cc:441] server connection from unix:<unnamed> torn down before Call kudu.rpc.GenericCalculatorService.Sleep from unix:<unnamed> (request call id 13) could send its response
[       OK ] Parameters/TestRpc.TestCancellation/SSL_UnixSocket (3159 ms)
[ RUN      ] Parameters/TestRpc.TestCancellationMultiThreads/SSL_UnixSocket
I20260925 16:43:09.939567  2391 acceptor_pool.cc:254] collecting diagnostics on the listening RPC socket unix:/tmp/dist-test-task8GuteR/test-tmp/rpc-test-8cc6ba3f022347d2a64069a9909cde63.sock every 8 connection(s)
I20260925 16:43:09.940459  2392 acceptor_pool.cc:254] collecting diagnostics on the listening RPC socket unix:/tmp/dist-test-task8GuteR/test-tmp/rpc-test-8cc6ba3f022347d2a64069a9909cde63.sock every 8 connection(s)
I20260925 16:43:09.943513  1941 rpc-test.cc:1808] Connecting to unix:/tmp/dist-test-task8GuteR/test-tmp/rpc-test-8cc6ba3f022347d2a64069a9909cde63.sock
I20260925 16:43:10.091307  2405 test_util.cc:268] Using random seed: 1767720899
I20260925 16:43:10.092350  2406 test_util.cc:268] Using random seed: 1767722023
I20260925 16:43:10.093892  2407 test_util.cc:268] Using random seed: 1767723459
I20260925 16:43:10.095255  2408 test_util.cc:268] Using random seed: 1767724907
I20260925 16:43:10.096961  2409 test_util.cc:268] Using random seed: 1767726477
I20260925 16:43:10.098336  2410 test_util.cc:268] Using random seed: 1767727872
I20260925 16:43:10.100042  2411 test_util.cc:268] Using random seed: 1767729557
I20260925 16:43:10.101493  2412 test_util.cc:268] Using random seed: 1767731043
I20260925 16:43:10.103085  2413 test_util.cc:268] Using random seed: 1767732603
I20260925 16:43:10.104434  2414 test_util.cc:268] Using random seed: 1767733987
I20260925 16:43:10.105767  2415 test_util.cc:268] Using random seed: 1767735344
I20260925 16:43:10.107144  2416 test_util.cc:268] Using random seed: 1767736689
I20260925 16:43:10.108912  2417 test_util.cc:268] Using random seed: 1767738390
I20260925 16:43:10.110499  2418 test_util.cc:268] Using random seed: 1767740029
I20260925 16:43:10.112737  2419 test_util.cc:268] Using random seed: 1767742183
I20260925 16:43:10.114275  2420 test_util.cc:268] Using random seed: 1767743772
I20260925 16:43:10.116220  2421 test_util.cc:268] Using random seed: 1767745695
I20260925 16:43:10.118546  2422 test_util.cc:268] Using random seed: 1767748041
I20260925 16:43:10.120800  2423 test_util.cc:268] Using random seed: 1767750354
I20260925 16:43:10.122678  2424 test_util.cc:268] Using random seed: 1767752213
I20260925 16:43:10.124836  2425 test_util.cc:268] Using random seed: 1767754358
I20260925 16:43:10.126760  2426 test_util.cc:268] Using random seed: 1767756310
I20260925 16:43:10.128682  2427 test_util.cc:268] Using random seed: 1767758209
I20260925 16:43:10.129932  2428 test_util.cc:268] Using random seed: 1767759521
I20260925 16:43:10.131559  2429 test_util.cc:268] Using random seed: 1767761115
I20260925 16:43:10.133529  2430 test_util.cc:268] Using random seed: 1767763072
I20260925 16:43:10.135193  2431 test_util.cc:268] Using random seed: 1767764347
I20260925 16:43:10.136989  2432 test_util.cc:268] Using random seed: 1767766137
I20260925 16:43:10.138473  2433 test_util.cc:268] Using random seed: 1767767994
I20260925 16:43:10.140446  2434 test_util.cc:268] Using random seed: 1767769954
[       OK ] Parameters/TestRpc.TestCancellationMultiThreads/SSL_UnixSocket (19999 ms)
[ RUN      ] Parameters/TestRpc.TestCallId/SSL_UnixSocket
I20260925 16:43:29.932365  2448 acceptor_pool.cc:254] collecting diagnostics on the listening RPC socket unix:/tmp/dist-test-task8GuteR/test-tmp/rpc-test-572710b02bb24ebb88c20d237dfe280c.sock every 8 connection(s)
I20260925 16:43:29.933146  2449 acceptor_pool.cc:254] collecting diagnostics on the listening RPC socket unix:/tmp/dist-test-task8GuteR/test-tmp/rpc-test-572710b02bb24ebb88c20d237dfe280c.sock every 8 connection(s)
[       OK ] Parameters/TestRpc.TestCallId/SSL_UnixSocket (94 ms)
[----------] 20 tests from Parameters/TestRpc (38454 ms total)

[----------] Global test environment tear-down
[==========] 21 tests from 2 test suites ran. (41712 ms total)
[  PASSED  ] 20 tests.
[  FAILED  ] 1 test, listed below:
[  FAILED  ] Parameters/TestRpc.TestCallWithChainCertAndRootCA/SSL_UnixSocket, where GetParam() = (true, true)

 1 FAILED TEST
I20260925 16:43:30.025740  1941 logging.cc:424] LogThrottler /data0/somelongdirectorytoavoidrpathissues/src/kudu/src/kudu/rpc/acceptor_pool.cc:285: suppressed but not reported on 3 messages since previous log ~34 seconds ago