Diagnosed failure

Parameters/TestRpc.TestCallWithChainCertAndChainCA/SSL_TCP: /data0/somelongdirectorytoavoidrpathissues/src/kudu/src/kudu/rpc/rpc-test.cc:270: Failure
Failed
Bad status: Runtime error: could not verify certificate chain (error with cert: subject=CN = localhost, ST = sadfjas, C = AS, emailAddress = sdflkdsajf, O = lskdfjlsad, OU = sldfkja, issuer=C = AS, ST = ASDfkjdhf, L = lskdjf, O = saldfja, OU = skdjf, CN = localhost, emailAddress = sadjflkadsj): : certificate has expired
Google Test trace:
/data0/somelongdirectorytoavoidrpathissues/src/kudu/src/kudu/rpc/rpc-test.cc:267: Connecting to 0.0.0.0:44665
I20260925 19:38:38.610172   881 test_util.cc:175] -----------------------------------------------
I20260925 19:38:38.610385   881 test_util.cc:176] Had fatal failures, leaving test files at /tmp/dist-test-taskQJXxsH/test-tmp/rpc-test.5.Parameters_TestRpc.TestCallWithChainCertAndChainCA_SSL_TCP.1790365117313138-881-0

Full log

Note: This is test shard 6 of 8.
[==========] Running 21 tests from 2 test suites.
[----------] Global test environment set-up.
[----------] 20 tests from Parameters/TestRpc
[ RUN      ] Parameters/TestRpc.TestMessengerCreateDestroy/SSL_TCP
WARNING: Logging before InitGoogleLogging() is written to STDERR
I20260925 19:38:37.422890   881 rpc-test.cc:169] started messenger TestCreateDestroy
[       OK ] Parameters/TestRpc.TestMessengerCreateDestroy/SSL_TCP (1100 ms)
[ RUN      ] Parameters/TestRpc.TestNegotiationDeadlock/SSL_TCP
I20260925 19:38:38.487912   903 acceptor_pool.cc:254] collecting diagnostics on the listening RPC socket 0.0.0.0:43037 every 8 connection(s)
I20260925 19:38:38.489230   904 acceptor_pool.cc:254] collecting diagnostics on the listening RPC socket 0.0.0.0:43037 every 8 connection(s)
[       OK ] Parameters/TestRpc.TestNegotiationDeadlock/SSL_TCP (74 ms)
[ RUN      ] Parameters/TestRpc.TestCallWithChainCertAndChainCA/SSL_TCP
I20260925 19:38:38.583026   919 acceptor_pool.cc:254] collecting diagnostics on the listening RPC socket 0.0.0.0:44665 every 8 connection(s)
I20260925 19:38:38.584969   920 acceptor_pool.cc:254] collecting diagnostics on the listening RPC socket 0.0.0.0:44665 every 8 connection(s)
/data0/somelongdirectorytoavoidrpathissues/src/kudu/src/kudu/rpc/rpc-test.cc:270: Failure
Failed
Bad status: Runtime error: could not verify certificate chain (error with cert: subject=CN = localhost, ST = sadfjas, C = AS, emailAddress = sdflkdsajf, O = lskdfjlsad, OU = sldfkja, issuer=C = AS, ST = ASDfkjdhf, L = lskdjf, O = saldfja, OU = skdjf, CN = localhost, emailAddress = sadjflkadsj): : certificate has expired
Google Test trace:
/data0/somelongdirectorytoavoidrpathissues/src/kudu/src/kudu/rpc/rpc-test.cc:267: Connecting to 0.0.0.0:44665
I20260925 19:38:38.610172   881 test_util.cc:175] -----------------------------------------------
I20260925 19:38:38.610385   881 test_util.cc:176] Had fatal failures, leaving test files at /tmp/dist-test-taskQJXxsH/test-tmp/rpc-test.5.Parameters_TestRpc.TestCallWithChainCertAndChainCA_SSL_TCP.1790365117313138-881-0
[  FAILED  ] Parameters/TestRpc.TestCallWithChainCertAndChainCA/SSL_TCP, where GetParam() = (true, false) (70 ms)
[ RUN      ] Parameters/TestRpc.TestCallWithPasswordProtectedKey/SSL_TCP
I20260925 19:38:38.632079   944 acceptor_pool.cc:254] collecting diagnostics on the listening RPC socket 0.0.0.0:36669 every 8 connection(s)
I20260925 19:38:38.632726   945 acceptor_pool.cc:254] collecting diagnostics on the listening RPC socket 0.0.0.0:36669 every 8 connection(s)
[       OK ] Parameters/TestRpc.TestCallWithPasswordProtectedKey/SSL_TCP (67 ms)
[ RUN      ] Parameters/TestRpc.TestCallToBadServer/SSL_TCP
I20260925 19:38:38.705755   881 rpc-test.cc:394] Status: Network error: Client connection negotiation failed: client connection to 0.0.0.0:0: connect: Connection refused (error 111)
I20260925 19:38:38.706986   881 rpc-test.cc:394] Status: Network error: Client connection negotiation failed: client connection to 0.0.0.0:0: connect: Connection refused (error 111)
I20260925 19:38:38.708141   881 rpc-test.cc:394] Status: Network error: Client connection negotiation failed: client connection to 0.0.0.0:0: connect: Connection refused (error 111)
I20260925 19:38:38.709301   881 rpc-test.cc:394] Status: Network error: Client connection negotiation failed: client connection to 0.0.0.0:0: connect: Connection refused (error 111)
I20260925 19:38:38.710482   881 rpc-test.cc:394] Status: Network error: Client connection negotiation failed: client connection to 0.0.0.0:0: connect: Connection refused (error 111)
[       OK ] Parameters/TestRpc.TestCallToBadServer/SSL_TCP (34 ms)
[ RUN      ] Parameters/TestRpc.TestWrongService/SSL_TCP
I20260925 19:38:38.728354   979 acceptor_pool.cc:254] collecting diagnostics on the listening RPC socket 0.0.0.0:34747 every 8 connection(s)
I20260925 19:38:38.729095   980 acceptor_pool.cc:254] collecting diagnostics on the listening RPC socket 0.0.0.0:34747 every 8 connection(s)
I20260925 19:38:38.756594   976 messenger.cc:345] service WrongServiceName not registered on TestServer
[       OK ] Parameters/TestRpc.TestWrongService/SSL_TCP (51 ms)
[ RUN      ] Parameters/TestRpc.TestConnectionKeepalive/SSL_TCP
I20260925 19:38:38.787456  1002 acceptor_pool.cc:254] collecting diagnostics on the listening RPC socket 0.0.0.0:38473 every 8 connection(s)
I20260925 19:38:38.788147  1003 acceptor_pool.cc:254] collecting diagnostics on the listening RPC socket 0.0.0.0:38473 every 8 connection(s)
I20260925 19:38:38.791476   881 rpc-test.cc:488] Connecting to 0.0.0.0:38473
[       OK ] Parameters/TestRpc.TestConnectionKeepalive/SSL_TCP (1065 ms)
[ RUN      ] Parameters/TestRpc.TestClientConnectionMetrics/SSL_TCP
I20260925 19:38:39.855315  1027 acceptor_pool.cc:254] collecting diagnostics on the listening RPC socket 0.0.0.0:32871 every 8 connection(s)
I20260925 19:38:39.855966  1028 acceptor_pool.cc:254] collecting diagnostics on the listening RPC socket 0.0.0.0:32871 every 8 connection(s)
I20260925 19:38:39.859097   881 rpc-test.cc:569] Connecting to 0.0.0.0:32871
[       OK ] Parameters/TestRpc.TestClientConnectionMetrics/SSL_TCP (110007 ms)
[ RUN      ] Parameters/TestRpc.TestCredentialsPolicy/SSL_TCP
I20260925 19:40:29.875921  1061 acceptor_pool.cc:254] collecting diagnostics on the listening RPC socket 0.0.0.0:43763 every 8 connection(s)
I20260925 19:40:29.876652  1062 acceptor_pool.cc:254] collecting diagnostics on the listening RPC socket 0.0.0.0:43763 every 8 connection(s)
I20260925 19:40:29.879758   881 rpc-test.cc:700] Connecting to 0.0.0.0:43763
[       OK ] Parameters/TestRpc.TestCredentialsPolicy/SSL_TCP (92 ms)
[ RUN      ] Parameters/TestRpc.TestCallLongerThanKeepalive/SSL_TCP
I20260925 19:40:29.951961  1086 acceptor_pool.cc:254] collecting diagnostics on the listening RPC socket 0.0.0.0:42521 every 8 connection(s)
I20260925 19:40:29.952661  1087 acceptor_pool.cc:254] collecting diagnostics on the listening RPC socket 0.0.0.0:42521 every 8 connection(s)
I20260925 19:40:29.986622  1090 rpc-test-base.h:222] got call: sleep_micros: 3000000 deferred: true
I20260925 19:40:32.990785  1090 rpcz_store.cc:275] Call kudu.rpc.GenericCalculatorService.Sleep from 127.0.0.1:41214 (request call id 0) took 3004 ms. Trace:
I20260925 19:40:32.991086  1090 rpcz_store.cc:276] 0925 19:40:29.986355 (+     0us) service_pool.cc:170] Inserting onto call queue
0925 19:40:29.986461 (+   106us) service_pool.cc:227] Handling call
0925 19:40:32.990730 (+3004269us) inbound_call.cc:173] Queueing success response
Metrics: {}
[       OK ] Parameters/TestRpc.TestCallLongerThanKeepalive/SSL_TCP (3071 ms)
[ RUN      ] Parameters/TestRpc.TestRpcSidecar/SSL_TCP
I20260925 19:40:33.025995  1111 acceptor_pool.cc:254] collecting diagnostics on the listening RPC socket 0.0.0.0:35343 every 8 connection(s)
I20260925 19:40:33.026695  1112 acceptor_pool.cc:254] collecting diagnostics on the listening RPC socket 0.0.0.0:35343 every 8 connection(s)
[       OK ] Parameters/TestRpc.TestRpcSidecar/SSL_TCP (502 ms)
[ RUN      ] Parameters/TestRpc.TestRpcSidecarLimits/SSL_TCP
I20260925 19:40:49.319512  1138 acceptor_pool.cc:254] collecting diagnostics on the listening RPC socket 0.0.0.0:34831 every 8 connection(s)
I20260925 19:40:49.320223  1139 acceptor_pool.cc:254] collecting diagnostics on the listening RPC socket 0.0.0.0:34831 every 8 connection(s)
W20260925 19:40:49.341269   881 serialization.cc:72] Serialized kudu.rpc_test.PushStringsRequestPB (2147483654 bytes) is larger than the maximum configured RPC message size (52428800 bytes). Sending anyway, but peer may reject the data.
W20260925 19:40:49.351518  1137 connection.cc:535] server connection from 127.0.0.1:48184 recv error: Network error: RPC frame had a length of 2147483714, but we only support messages up to 52428800 bytes long.
W20260925 19:40:49.351814  1137 connection.cc:158] shutting down server connection from 127.0.0.1:48184 with pending inbound data: 4/2147483714 bytes received; last active 0 ns ago: status Network error: RPC frame had a length of 2147483714, but we only support messages up to 52428800 bytes long.
W20260925 19:40:49.352718  1151 connection.cc:698] client connection to 0.0.0.0:34831 send error: Network error: failed to write to TLS socket: Connection reset by peer
W20260925 19:40:49.353250  1151 connection.cc:196] Error closing socket: Network error: TlsSocket::Close: Success
[       OK ] Parameters/TestRpc.TestRpcSidecarLimits/SSL_TCP (16418 ms)
[ RUN      ] Parameters/TestRpc.TestCallTimeoutDoesntAffectNegotiation/SSL_TCP
I20260925 19:40:49.948990  1163 acceptor_pool.cc:254] collecting diagnostics on the listening RPC socket 0.0.0.0:44485 every 8 connection(s)
I20260925 19:40:49.949630  1164 acceptor_pool.cc:254] collecting diagnostics on the listening RPC socket 0.0.0.0:44485 every 8 connection(s)
W20260925 19:40:49.967259  1159 negotiation.cc:266] Injecting 500ms delay in negotiation
I20260925 19:40:50.016865   881 rpc-test-base.h:595] status: Timed out: connection negotiation to 0.0.0.0:44485 for RPC Sleep timed out after 0.050s (ON_OUTBOUND_QUEUE), seconds elapsed: 0.0506377
[       OK ] Parameters/TestRpc.TestCallTimeoutDoesntAffectNegotiation/SSL_TCP (559 ms)
[ RUN      ] Parameters/TestRpc.TestRpcHandlerLatencyMetric/SSL_TCP
I20260925 19:40:50.515864  1188 acceptor_pool.cc:254] collecting diagnostics on the listening RPC socket 0.0.0.0:38673 every 8 connection(s)
I20260925 19:40:50.516513  1189 acceptor_pool.cc:254] collecting diagnostics on the listening RPC socket 0.0.0.0:38673 every 8 connection(s)
I20260925 19:40:50.574327   881 rpc-test.cc:1236] Sleep() min lat: 21561
I20260925 19:40:50.574523   881 rpc-test.cc:1237] Sleep() mean lat: 21561
I20260925 19:40:50.574694   881 rpc-test.cc:1238] Sleep() max lat: 21561
I20260925 19:40:50.574882   881 rpc-test.cc:1239] Sleep() #calls: 1
[       OK ] Parameters/TestRpc.TestRpcHandlerLatencyMetric/SSL_TCP (98 ms)
[ RUN      ] Parameters/TestRpc.TimedOutOnResponseMetricServiceQueue/SSL_TCP
I20260925 19:40:50.601305  1214 acceptor_pool.cc:254] collecting diagnostics on the listening RPC socket 0.0.0.0:44533 every 8 connection(s)
I20260925 19:40:50.601953  1215 acceptor_pool.cc:254] collecting diagnostics on the listening RPC socket 0.0.0.0:44533 every 8 connection(s)
W20260925 19:40:50.668531  1216 rpcz_store.cc:267] Call kudu.rpc_test.CalculatorService.Sleep from 127.0.0.1:54426 (request call id 2) took 20 ms (client timeout 20 ms). Trace:
W20260925 19:40:50.668881  1216 rpcz_store.cc:269] 0925 19:40:50.648017 (+     0us) service_pool.cc:170] Inserting onto call queue
0925 19:40:50.668398 (+ 20381us) service_pool.cc:214] Skipping call since client already timed out
0925 19:40:50.668485 (+    87us) inbound_call.cc:173] Queueing failure response
Metrics: {}
[       OK ] Parameters/TestRpc.TimedOutOnResponseMetricServiceQueue/SSL_TCP (93 ms)
[ RUN      ] Parameters/TestRpc.RpcPendingConnectionsMetric/SSL_TCP
I20260925 19:40:50.684381  1237 acceptor_pool.cc:254] collecting diagnostics on the listening RPC socket 0.0.0.0:35391 every 8 connection(s)
I20260925 19:40:50.685024  1238 acceptor_pool.cc:254] collecting diagnostics on the listening RPC socket 0.0.0.0:35391 every 8 connection(s)
W20260925 19:40:50.698644  1233 negotiation.cc:337] Failed RPC negotiation. Trace:
0925 19:40:50.697000 (+     0us) reactor.cc:625] Submitting negotiation task for server connection from 127.0.0.1:57138 (local address 127.0.0.1:35391)
0925 19:40:50.697531 (+   531us) server_negotiation.cc:206] Beginning negotiation
0925 19:40:50.697558 (+    27us) server_negotiation.cc:399] Waiting for connection header
0925 19:40:50.697903 (+   345us) negotiation.cc:327] Negotiation complete: Network error: Server connection negotiation failed: server connection from 127.0.0.1:57138: BlockingRecv error: recv got EOF from 127.0.0.1:57138 (error 108)
Metrics: {"server-negotiator.queue_time_us":116}
[       OK ] Parameters/TestRpc.RpcPendingConnectionsMetric/SSL_TCP (36 ms)
[ RUN      ] Parameters/TestRpc.TestRpcContextClientDeadline/SSL_TCP
I20260925 19:40:50.729820  1253 acceptor_pool.cc:254] collecting diagnostics on the listening RPC socket 0.0.0.0:44837 every 8 connection(s)
I20260925 19:40:50.730479  1254 acceptor_pool.cc:254] collecting diagnostics on the listening RPC socket 0.0.0.0:44837 every 8 connection(s)
[       OK ] Parameters/TestRpc.TestRpcContextClientDeadline/SSL_TCP (97 ms)
[ RUN      ] Parameters/TestRpc.TestApplicationFeatureFlagUnsupportedServer/SSL_TCP
I20260925 19:40:50.846812  1278 acceptor_pool.cc:254] collecting diagnostics on the listening RPC socket 0.0.0.0:33681 every 8 connection(s)
I20260925 19:40:50.847474  1279 acceptor_pool.cc:254] collecting diagnostics on the listening RPC socket 0.0.0.0:33681 every 8 connection(s)
[       OK ] Parameters/TestRpc.TestApplicationFeatureFlagUnsupportedServer/SSL_TCP (81 ms)
[ RUN      ] Parameters/TestRpc.TestCancellationAsync/SSL_TCP
I20260925 19:40:50.933465  1303 acceptor_pool.cc:254] collecting diagnostics on the listening RPC socket 0.0.0.0:41677 every 8 connection(s)
I20260925 19:40:50.934114  1304 acceptor_pool.cc:254] collecting diagnostics on the listening RPC socket 0.0.0.0:41677 every 8 connection(s)
I20260925 19:40:50.937033   881 rpc-test.cc:1716] Connecting to 0.0.0.0:41677
I20260925 19:40:50.950683   881 test_util.cc:268] Using random seed: -456321529
I20260925 19:40:51.171204  1307 rpc-test-base.h:240] got call: sleep_micros: 500 pattern: 4294967295 num_repetitions: 2097152 sidecar_idx: 0
I20260925 19:40:51.321230  1306 rpc-test-base.h:240] got call: sleep_micros: 500 pattern: 4294967295 num_repetitions: 2097152 sidecar_idx: 0
I20260925 19:40:51.508620  1307 rpc-test-base.h:240] got call: sleep_micros: 500 pattern: 4294967295 num_repetitions: 2097152 sidecar_idx: 0
I20260925 19:40:51.686005  1306 rpc-test-base.h:240] got call: sleep_micros: 500 pattern: 4294967295 num_repetitions: 2097152 sidecar_idx: 0
I20260925 19:40:51.863353  1307 rpc-test-base.h:240] got call: sleep_micros: 500 pattern: 4294967295 num_repetitions: 2097152 sidecar_idx: 0
I20260925 19:40:52.043676  1306 rpc-test-base.h:240] got call: sleep_micros: 500 pattern: 4294967295 num_repetitions: 2097152 sidecar_idx: 0
I20260925 19:40:52.216566  1307 rpc-test-base.h:240] got call: sleep_micros: 500 pattern: 4294967295 num_repetitions: 2097152 sidecar_idx: 0
I20260925 19:40:52.397675  1306 rpc-test-base.h:240] got call: sleep_micros: 500 pattern: 4294967295 num_repetitions: 2097152 sidecar_idx: 0
W20260925 19:40:52.550346  1300 connection.cc:698] server connection from 127.0.0.1:51512 send error: Network error: failed to write to TLS socket: Broken pipe
W20260925 19:40:52.550585  1300 connection.cc:441] server connection from 127.0.0.1:51512 torn down before Call kudu.rpc.GenericCalculatorService.SleepWithSidecar from 127.0.0.1:51512 (request call id 9) could send its response
W20260925 19:40:52.554867  1300 connection.cc:196] Error closing socket: Network error: TlsSocket::Close: Success
W20260925 19:40:52.601114  1300 connection.cc:441] server connection from 127.0.0.1:51512 torn down before Call kudu.rpc.GenericCalculatorService.SleepWithSidecar from 127.0.0.1:51512 (request call id 8) could send its response
[       OK ] Parameters/TestRpc.TestCancellationAsync/SSL_TCP (1719 ms)
[ RUN      ] Parameters/TestRpc.TestPerformanceBySocketType/SSL_TCP
I20260925 19:40:52.697031  1328 acceptor_pool.cc:254] collecting diagnostics on the listening RPC socket 0.0.0.0:41335 every 8 connection(s)
I20260925 19:40:52.697700  1329 acceptor_pool.cc:254] collecting diagnostics on the listening RPC socket 0.0.0.0:41335 every 8 connection(s)
I20260925 19:40:52.700934   881 rpc-test.cc:1846] Connecting to 0.0.0.0:41335
I20260925 19:41:11.290349   881 rpc-test.cc:1859] Sending 1024MB via ssl-enabled tcp socket: real 18.576s	user 16.532s	sys 10.277s
I20260925 19:41:29.543668   881 rpc-test.cc:1859] Sending 1024MB via ssl-enabled tcp socket: real 18.253s	user 15.997s	sys 10.156s
I20260925 19:41:47.701865   881 rpc-test.cc:1859] Sending 1024MB via ssl-enabled tcp socket: real 18.158s	user 16.131s	sys 9.866s
I20260925 19:42:05.887439   881 rpc-test.cc:1859] Sending 1024MB via ssl-enabled tcp socket: real 18.185s	user 16.116s	sys 9.882s
I20260925 19:42:24.325232   881 rpc-test.cc:1859] Sending 1024MB via ssl-enabled tcp socket: real 18.437s	user 16.338s	sys 10.085s
[       OK ] Parameters/TestRpc.TestPerformanceBySocketType/SSL_TCP (91729 ms)
[----------] 20 tests from Parameters/TestRpc (226976 ms total)

[----------] 1 test from Parameters/TestRpcSocketTxRxQueue
[ RUN      ] Parameters/TestRpcSocketTxRxQueue.OverCapacity/0
W20260925 19:42:24.769672  1372 negotiation.cc:337] Failed RPC negotiation. Trace:
0925 19:42:24.367072 (+     0us) reactor.cc:625] Submitting negotiation task for client connection to 0.0.0.0:35973 (local address 127.0.0.1:53546)
0925 19:42:24.367646 (+   574us) negotiation.cc:107] Waiting for socket to connect
0925 19:42:24.367674 (+    28us) client_negotiation.cc:174] Beginning negotiation
0925 19:42:24.367852 (+   178us) client_negotiation.cc:252] Sending NEGOTIATE NegotiatePB request
0925 19:42:24.768879 (+401027us) negotiation.cc:327] Negotiation complete: Network error: Client connection negotiation failed: client connection to 0.0.0.0:35973: BlockingRecv error: recv error from unknown peer: Transport endpoint is not connected (error 107)
Metrics: {"client-negotiator.queue_time_us":154}
W20260925 19:42:24.770009  1354 negotiation.cc:337] Failed RPC negotiation. Trace:
0925 19:42:24.353646 (+     0us) reactor.cc:625] Submitting negotiation task for client connection to 0.0.0.0:35973 (local address 127.0.0.1:53522)
0925 19:42:24.354148 (+   502us) negotiation.cc:107] Waiting for socket to connect
0925 19:42:24.354177 (+    29us) client_negotiation.cc:174] Beginning negotiation
0925 19:42:24.354498 (+   321us) client_negotiation.cc:252] Sending NEGOTIATE NegotiatePB request
0925 19:42:24.768974 (+414476us) negotiation.cc:327] Negotiation complete: Network error: Client connection negotiation failed: client connection to 0.0.0.0:35973: BlockingRecv error: recv error from unknown peer: Transport endpoint is not connected (error 107)
Metrics: {"client-negotiator.queue_time_us":92}
W20260925 19:42:24.770028  1363 negotiation.cc:337] Failed RPC negotiation. Trace:
0925 19:42:24.360210 (+     0us) reactor.cc:625] Submitting negotiation task for client connection to 0.0.0.0:35973 (local address 127.0.0.1:53532)
0925 19:42:24.360726 (+   516us) negotiation.cc:107] Waiting for socket to connect
0925 19:42:24.360755 (+    29us) client_negotiation.cc:174] Beginning negotiation
0925 19:42:24.360932 (+   177us) client_negotiation.cc:252] Sending NEGOTIATE NegotiatePB request
0925 19:42:24.768975 (+408043us) negotiation.cc:327] Negotiation complete: Network error: Client connection negotiation failed: client connection to 0.0.0.0:35973: BlockingRecv error: recv error from unknown peer: Transport endpoint is not connected (error 107)
Metrics: {"client-negotiator.queue_time_us":126}
W20260925 19:42:24.771445  1399 negotiation.cc:337] Failed RPC negotiation. Trace:
0925 19:42:24.403585 (+     0us) reactor.cc:625] Submitting negotiation task for client connection to 0.0.0.0:35973 (local address 127.0.0.1:53572)
0925 19:42:24.404072 (+   487us) negotiation.cc:107] Waiting for socket to connect
0925 19:42:24.404102 (+    30us) client_negotiation.cc:174] Beginning negotiation
0925 19:42:24.404287 (+   185us) client_negotiation.cc:252] Sending NEGOTIATE NegotiatePB request
0925 19:42:24.770495 (+366208us) negotiation.cc:327] Negotiation complete: Network error: Client connection negotiation failed: client connection to 0.0.0.0:35973: BlockingRecv error: recv error from unknown peer: Transport endpoint is not connected (error 107)
Metrics: {"client-negotiator.queue_time_us":146}
W20260925 19:42:24.771781  1381 negotiation.cc:337] Failed RPC negotiation. Trace:
0925 19:42:24.379691 (+     0us) reactor.cc:625] Submitting negotiation task for client connection to 0.0.0.0:35973 (local address 127.0.0.1:53552)
0925 19:42:24.380192 (+   501us) negotiation.cc:107] Waiting for socket to connect
0925 19:42:24.380224 (+    32us) client_negotiation.cc:174] Beginning negotiation
0925 19:42:24.380408 (+   184us) client_negotiation.cc:252] Sending NEGOTIATE NegotiatePB request
0925 19:42:24.770761 (+390353us) negotiation.cc:327] Negotiation complete: Network error: Client connection negotiation failed: client connection to 0.0.0.0:35973: BlockingRecv error: recv error from unknown peer: Transport endpoint is not connected (error 107)
Metrics: {"client-negotiator.queue_time_us":136}
W20260925 19:42:24.772044  1390 negotiation.cc:337] Failed RPC negotiation. Trace:
0925 19:42:24.391376 (+     0us) reactor.cc:625] Submitting negotiation task for client connection to 0.0.0.0:35973 (local address 127.0.0.1:53560)
0925 19:42:24.391981 (+   605us) negotiation.cc:107] Waiting for socket to connect
0925 19:42:24.392016 (+    35us) client_negotiation.cc:174] Beginning negotiation
0925 19:42:24.392218 (+   202us) client_negotiation.cc:252] Sending NEGOTIATE NegotiatePB request
0925 19:42:24.771061 (+378843us) negotiation.cc:327] Negotiation complete: Network error: Client connection negotiation failed: client connection to 0.0.0.0:35973: BlockingRecv error: recv error from unknown peer: Transport endpoint is not connected (error 107)
Metrics: {"client-negotiator.queue_time_us":123}
[       OK ] Parameters/TestRpcSocketTxRxQueue.OverCapacity/0 (1213 ms)
[----------] 1 test from Parameters/TestRpcSocketTxRxQueue (1213 ms total)

[----------] Global test environment tear-down
[==========] 21 tests from 2 test suites ran. (228191 ms total)
[  PASSED  ] 20 tests.
[  FAILED  ] 1 test, listed below:
[  FAILED  ] Parameters/TestRpc.TestCallWithChainCertAndChainCA/SSL_TCP, where GetParam() = (true, false)

 1 FAILED TEST