Diagnosed failure

Parameters/TestRpc.TestCallWithChainCertAndRootCA/SSL_TCP: /data0/somelongdirectorytoavoidrpathissues/src/kudu/src/kudu/rpc/rpc-test.cc:303: Failure
Failed
Bad status: Runtime error: could not verify certificate chain (error with cert: subject=CN = localhost, ST = sadfjas, C = AS, emailAddress = sdflkdsajf, O = lskdfjlsad, OU = sldfkja, issuer=C = AS, ST = ASDfkjdhf, L = lskdjf, O = saldfja, OU = skdjf, CN = localhost, emailAddress = sadjflkadsj): : certificate has expired
Google Test trace:
/data0/somelongdirectorytoavoidrpathissues/src/kudu/src/kudu/rpc/rpc-test.cc:300: Connecting to 0.0.0.0:36575
I20260924 02:10:43.718698 28992 test_util.cc:175] -----------------------------------------------
I20260924 02:10:43.718873 28992 test_util.cc:176] Had fatal failures, leaving test files at /tmp/dist-test-taskMiuZkY/test-tmp/rpc-test.1.Parameters_TestRpc.TestCallWithChainCertAndRootCA_SSL_TCP.1790215842047684-28992-0

Full log

Note: This is test shard 2 of 8.
[==========] Running 21 tests from 2 test suites.
[----------] Global test environment set-up.
[----------] 1 test from TestRpc
[ RUN      ] TestRpc.TestMethodsByName
[       OK ] TestRpc.TestMethodsByName (7 ms)
[----------] 1 test from TestRpc (7 ms total)

[----------] 20 tests from Parameters/TestRpc
[ RUN      ] Parameters/TestRpc.TestAcceptorPoolStartStop/SSL_TCP
WARNING: Logging before InitGoogleLogging() is written to STDERR
I20260924 02:10:42.165633 29007 acceptor_pool.cc:254] collecting diagnostics on the listening RPC socket 0.0.0.0:43233 every 8 connection(s)
I20260924 02:10:42.167409 29008 acceptor_pool.cc:254] collecting diagnostics on the listening RPC socket 0.0.0.0:43233 every 8 connection(s)
W20260924 02:10:43.168228 28992 thread.cc:536] Waited for 1000ms trying to join with acceptor (tid 29008)
I20260924 02:10:43.404196 29019 acceptor_pool.cc:254] collecting diagnostics on the listening RPC socket 0.0.0.0:45871 every 8 connection(s)
I20260924 02:10:43.406432 29020 acceptor_pool.cc:254] collecting diagnostics on the listening RPC socket 0.0.0.0:45871 every 8 connection(s)
I20260924 02:10:43.435683 29030 acceptor_pool.cc:254] collecting diagnostics on the listening RPC socket 0.0.0.0:42217 every 8 connection(s)
I20260924 02:10:43.437099 29031 acceptor_pool.cc:254] collecting diagnostics on the listening RPC socket 0.0.0.0:42217 every 8 connection(s)
I20260924 02:10:43.469511 29041 acceptor_pool.cc:254] collecting diagnostics on the listening RPC socket 0.0.0.0:34211 every 8 connection(s)
I20260924 02:10:43.470335 29042 acceptor_pool.cc:254] collecting diagnostics on the listening RPC socket 0.0.0.0:34211 every 8 connection(s)
I20260924 02:10:43.495249 29052 acceptor_pool.cc:254] collecting diagnostics on the listening RPC socket 0.0.0.0:41819 every 8 connection(s)
I20260924 02:10:43.496013 29053 acceptor_pool.cc:254] collecting diagnostics on the listening RPC socket 0.0.0.0:41819 every 8 connection(s)
[       OK ] Parameters/TestRpc.TestAcceptorPoolStartStop/SSL_TCP (1387 ms)
[ RUN      ] Parameters/TestRpc.TestCall/SSL_TCP
I20260924 02:10:43.526634 29065 acceptor_pool.cc:254] collecting diagnostics on the listening RPC socket 0.0.0.0:36311 every 8 connection(s)
I20260924 02:10:43.528298 29066 acceptor_pool.cc:254] collecting diagnostics on the listening RPC socket 0.0.0.0:36311 every 8 connection(s)
I20260924 02:10:43.534230 28992 rpc-test.cc:234] Connecting to 0.0.0.0:36311
[       OK ] Parameters/TestRpc.TestCall/SSL_TCP (177 ms)
[ RUN      ] Parameters/TestRpc.TestCallWithChainCertAndRootCA/SSL_TCP
I20260924 02:10:43.693609 29090 acceptor_pool.cc:254] collecting diagnostics on the listening RPC socket 0.0.0.0:36575 every 8 connection(s)
I20260924 02:10:43.694466 29091 acceptor_pool.cc:254] collecting diagnostics on the listening RPC socket 0.0.0.0:36575 every 8 connection(s)
/data0/somelongdirectorytoavoidrpathissues/src/kudu/src/kudu/rpc/rpc-test.cc:303: Failure
Failed
Bad status: Runtime error: could not verify certificate chain (error with cert: subject=CN = localhost, ST = sadfjas, C = AS, emailAddress = sdflkdsajf, O = lskdfjlsad, OU = sldfkja, issuer=C = AS, ST = ASDfkjdhf, L = lskdjf, O = saldfja, OU = skdjf, CN = localhost, emailAddress = sadjflkadsj): : certificate has expired
Google Test trace:
/data0/somelongdirectorytoavoidrpathissues/src/kudu/src/kudu/rpc/rpc-test.cc:300: Connecting to 0.0.0.0:36575
I20260924 02:10:43.718698 28992 test_util.cc:175] -----------------------------------------------
I20260924 02:10:43.718873 28992 test_util.cc:176] Had fatal failures, leaving test files at /tmp/dist-test-taskMiuZkY/test-tmp/rpc-test.1.Parameters_TestRpc.TestCallWithChainCertAndRootCA_SSL_TCP.1790215842047684-28992-0
[  FAILED  ] Parameters/TestRpc.TestCallWithChainCertAndRootCA/SSL_TCP, where GetParam() = (true, false) (41 ms)
[ RUN      ] Parameters/TestRpc.TestCallWithBadPasswordProtectedKey/SSL_TCP
[       OK ] Parameters/TestRpc.TestCallWithBadPasswordProtectedKey/SSL_TCP (34 ms)
[ RUN      ] Parameters/TestRpc.TestInvalidMethodCall/SSL_TCP
I20260924 02:10:43.799038 29127 acceptor_pool.cc:254] collecting diagnostics on the listening RPC socket 0.0.0.0:44697 every 8 connection(s)
I20260924 02:10:43.799856 29128 acceptor_pool.cc:254] collecting diagnostics on the listening RPC socket 0.0.0.0:44697 every 8 connection(s)
I20260924 02:10:43.803963 28992 rpc-test.cc:406] Connecting to 0.0.0.0:44697
[       OK ] Parameters/TestRpc.TestInvalidMethodCall/SSL_TCP (85 ms)
[ RUN      ] Parameters/TestRpc.TestHighFDs/SSL_TCP
I20260924 02:10:44.056582 29152 acceptor_pool.cc:254] collecting diagnostics on the listening RPC socket 0.0.0.0:35927 every 8 connection(s)
I20260924 02:10:44.057366 29153 acceptor_pool.cc:254] collecting diagnostics on the listening RPC socket 0.0.0.0:35927 every 8 connection(s)
[       OK ] Parameters/TestRpc.TestHighFDs/SSL_TCP (290 ms)
[ RUN      ] Parameters/TestRpc.TestConnectionAlwaysKeepalive/SSL_TCP
I20260924 02:10:44.147905 29175 acceptor_pool.cc:254] collecting diagnostics on the listening RPC socket 0.0.0.0:46505 every 8 connection(s)
I20260924 02:10:44.148799 29176 acceptor_pool.cc:254] collecting diagnostics on the listening RPC socket 0.0.0.0:46505 every 8 connection(s)
I20260924 02:10:44.152931 28992 rpc-test.cc:532] Connecting to 0.0.0.0:46505
[       OK ] Parameters/TestRpc.TestConnectionAlwaysKeepalive/SSL_TCP (3068 ms)
[ RUN      ] Parameters/TestRpc.TestReopenOutboundConnections/SSL_TCP
I20260924 02:10:47.248865 29198 acceptor_pool.cc:254] collecting diagnostics on the listening RPC socket 0.0.0.0:43263 every 8 connection(s)
I20260924 02:10:47.249598 29199 acceptor_pool.cc:254] collecting diagnostics on the listening RPC socket 0.0.0.0:43263 every 8 connection(s)
I20260924 02:10:47.252854 28992 rpc-test.cc:658] Connecting to 0.0.0.0:43263
[       OK ] Parameters/TestRpc.TestReopenOutboundConnections/SSL_TCP (438 ms)
[ RUN      ] Parameters/TestRpc.TestConnectionNetworkPlane/SSL_TCP
I20260924 02:10:47.662122 29221 acceptor_pool.cc:254] collecting diagnostics on the listening RPC socket 0.0.0.0:38413 every 8 connection(s)
I20260924 02:10:47.662771 29222 acceptor_pool.cc:254] collecting diagnostics on the listening RPC socket 0.0.0.0:38413 every 8 connection(s)
I20260924 02:10:47.666023 28992 rpc-test.cc:772] Connecting to 0.0.0.0:38413
[       OK ] Parameters/TestRpc.TestConnectionNetworkPlane/SSL_TCP (78 ms)
[ RUN      ] Parameters/TestRpc.TestTCPKeepalive/SSL_TCP
I20260924 02:10:47.757094 29246 acceptor_pool.cc:254] collecting diagnostics on the listening RPC socket 0.0.0.0:42377 every 8 connection(s)
I20260924 02:10:47.757791 29247 acceptor_pool.cc:254] collecting diagnostics on the listening RPC socket 0.0.0.0:42377 every 8 connection(s)
I20260924 02:10:47.807611 29250 rpc-test-base.h:222] got call: sleep_micros: 8000000 deferred: true
I20260924 02:10:55.812057 29250 rpcz_store.cc:275] Call kudu.rpc.GenericCalculatorService.Sleep from 127.0.0.1:43520 (request call id 0) took 8004 ms. Trace:
I20260924 02:10:55.812546 29250 rpcz_store.cc:276] 0924 02:10:47.807335 (+     0us) service_pool.cc:170] Inserting onto call queue
0924 02:10:47.807446 (+   111us) service_pool.cc:227] Handling call
0924 02:10:55.811672 (+8004226us) inbound_call.cc:173] Queueing success response
Metrics: {}
[       OK ] Parameters/TestRpc.TestTCPKeepalive/SSL_TCP (8112 ms)
[ RUN      ] Parameters/TestRpc.TestMaxSmallSidecars/SSL_TCP
I20260924 02:10:55.846885 29272 acceptor_pool.cc:254] collecting diagnostics on the listening RPC socket 0.0.0.0:33433 every 8 connection(s)
I20260924 02:10:55.847760 29273 acceptor_pool.cc:254] collecting diagnostics on the listening RPC socket 0.0.0.0:33433 every 8 connection(s)
[       OK ] Parameters/TestRpc.TestMaxSmallSidecars/SSL_TCP (227 ms)
[ RUN      ] Parameters/TestRpc.TestCallTimeout/SSL_TCP
I20260924 02:10:56.105648 29297 acceptor_pool.cc:254] collecting diagnostics on the listening RPC socket 0.0.0.0:40977 every 8 connection(s)
I20260924 02:10:56.106406 29298 acceptor_pool.cc:254] collecting diagnostics on the listening RPC socket 0.0.0.0:40977 every 8 connection(s)
I20260924 02:10:56.129776 28992 rpc-test-base.h:595] status: Timed out: connection negotiation to 0.0.0.0:40977 for RPC Sleep timed out after 0.000s (ON_OUTBOUND_QUEUE), seconds elapsed: 0.00275582
I20260924 02:10:56.138145 29301 rpc-test-base.h:222] got call: sleep_micros: 700000
I20260924 02:10:56.331485 28992 rpc-test-base.h:595] status: Timed out: Sleep RPC to 0.0.0.0:40977 timed out after 0.200s (SENT), seconds elapsed: 0.201247
I20260924 02:10:56.333043 29300 rpc-test-base.h:222] got call: sleep_micros: 2000000
W20260924 02:10:56.839089 29301 rpcz_store.cc:267] Call kudu.rpc.GenericCalculatorService.Sleep from 127.0.0.1:45504 (request call id 1) took 701 ms (client timeout 200 ms). Trace:
W20260924 02:10:56.839567 29301 rpcz_store.cc:269] 0924 02:10:56.137652 (+     0us) service_pool.cc:170] Inserting onto call queue
0924 02:10:56.138082 (+   430us) service_pool.cc:227] Handling call
0924 02:10:56.838997 (+700915us) inbound_call.cc:173] Queueing success response
Metrics: {}
I20260924 02:10:57.833770 28992 rpc-test-base.h:595] status: Timed out: Sleep RPC to 0.0.0.0:40977 timed out after 1.500s (SENT), seconds elapsed: 1.50191
W20260924 02:10:58.333652 29300 rpcz_store.cc:267] Call kudu.rpc.GenericCalculatorService.Sleep from 127.0.0.1:45504 (request call id 2) took 2000 ms (client timeout 1500 ms). Trace:
W20260924 02:10:58.333989 29300 rpcz_store.cc:269] 0924 02:10:56.332762 (+     0us) service_pool.cc:170] Inserting onto call queue
0924 02:10:56.332892 (+   130us) service_pool.cc:227] Handling call
0924 02:10:58.333593 (+2000701us) inbound_call.cc:173] Queueing success response
Metrics: {}
W20260924 02:10:58.334864 29296 connection.cc:441] server connection from 127.0.0.1:45504 torn down before Call kudu.rpc.GenericCalculatorService.Sleep from 127.0.0.1:45504 (request call id 2) could send its response
[       OK ] Parameters/TestRpc.TestCallTimeout/SSL_TCP (2286 ms)
[ RUN      ] Parameters/TestRpc.TestServerShutsDown/SSL_TCP
I20260924 02:10:58.344172 28992 rpc-test.cc:1125] Connecting to 0.0.0.0:37931
W20260924 02:10:58.354724 29314 negotiation.cc:337] Failed RPC negotiation. Trace:
0924 02:10:58.352977 (+     0us) reactor.cc:625] Submitting negotiation task for client connection to 0.0.0.0:37931 (local address 127.0.0.1:37108)
0924 02:10:58.353466 (+   489us) negotiation.cc:107] Waiting for socket to connect
0924 02:10:58.353504 (+    38us) client_negotiation.cc:174] Beginning negotiation
0924 02:10:58.353755 (+   251us) client_negotiation.cc:252] Sending NEGOTIATE NegotiatePB request
0924 02:10:58.354028 (+   273us) negotiation.cc:327] Negotiation complete: Network error: Client connection negotiation failed: client connection to 0.0.0.0:37931: BlockingWrite error: write error: Broken pipe (error 32)
Metrics: {"client-negotiator.queue_time_us":141}
[       OK ] Parameters/TestRpc.TestServerShutsDown/SSL_TCP (15 ms)
[ RUN      ] Parameters/TestRpc.TimedOutOnResponseMetric/SSL_TCP
I20260924 02:10:58.391201 29331 acceptor_pool.cc:254] collecting diagnostics on the listening RPC socket 0.0.0.0:40897 every 8 connection(s)
I20260924 02:10:58.392012 29332 acceptor_pool.cc:254] collecting diagnostics on the listening RPC socket 0.0.0.0:40897 every 8 connection(s)
W20260924 02:10:58.649781 29335 rpcz_store.cc:267] Call kudu.rpc_test.CalculatorService.Sleep from 127.0.0.1:51994 (request call id 3) took 50 ms (client timeout 25 ms). Trace:
W20260924 02:10:58.650168 29335 rpcz_store.cc:269] 0924 02:10:58.599154 (+     0us) service_pool.cc:170] Inserting onto call queue
0924 02:10:58.599280 (+   126us) service_pool.cc:227] Handling call
0924 02:10:58.649693 (+ 50413us) inbound_call.cc:173] Queueing success response
Related trace 'test_child':
Metrics: {"test_sleep_us":50000,"child_traces":[["test_child",{"related_trace_metric":1}]]}
W20260924 02:10:58.709836 29335 rpcz_store.cc:267] Call kudu.rpc_test.CalculatorService.Sleep from 127.0.0.1:51994 (request call id 4) took 50 ms (client timeout 50 ms). Trace:
W20260924 02:10:58.710223 29335 rpcz_store.cc:269] 0924 02:10:58.659233 (+     0us) service_pool.cc:170] Inserting onto call queue
0924 02:10:58.659411 (+   178us) service_pool.cc:227] Handling call
0924 02:10:58.709778 (+ 50367us) inbound_call.cc:173] Queueing success response
Related trace 'test_child':
Metrics: {"test_sleep_us":50000,"child_traces":[["test_child",{"related_trace_metric":1}]]}
[       OK ] Parameters/TestRpc.TimedOutOnResponseMetric/SSL_TCP (360 ms)
[ RUN      ] Parameters/TestRpc.AcceptorDispatchingTimesMetric/SSL_TCP
I20260924 02:10:58.737692 29356 acceptor_pool.cc:254] collecting diagnostics on the listening RPC socket 0.0.0.0:37549 every 8 connection(s)
I20260924 02:10:58.738384 29357 acceptor_pool.cc:254] collecting diagnostics on the listening RPC socket 0.0.0.0:37549 every 8 connection(s)
W20260924 02:10:58.745165 29352 negotiation.cc:337] Failed RPC negotiation. Trace:
0924 02:10:58.743442 (+     0us) reactor.cc:625] Submitting negotiation task for server connection from 127.0.0.1:34562 (local address 127.0.0.1:37549)
0924 02:10:58.744064 (+   622us) server_negotiation.cc:206] Beginning negotiation
0924 02:10:58.744093 (+    29us) server_negotiation.cc:399] Waiting for connection header
0924 02:10:58.744428 (+   335us) negotiation.cc:327] Negotiation complete: Network error: Server connection negotiation failed: server connection from 127.0.0.1:34562: BlockingRecv error: recv got EOF from 127.0.0.1:34562 (error 108)
Metrics: {"server-negotiator.queue_time_us":127}
[       OK ] Parameters/TestRpc.AcceptorDispatchingTimesMetric/SSL_TCP (31 ms)
[ RUN      ] Parameters/TestRpc.TestRpcCallbackDestroysMessenger/SSL_TCP
[       OK ] Parameters/TestRpc.TestRpcCallbackDestroysMessenger/SSL_TCP (20 ms)
[ RUN      ] Parameters/TestRpc.TestApplicationFeatureFlag/SSL_TCP
I20260924 02:10:58.802289 29381 acceptor_pool.cc:254] collecting diagnostics on the listening RPC socket 0.0.0.0:44577 every 8 connection(s)
I20260924 02:10:58.802994 29382 acceptor_pool.cc:254] collecting diagnostics on the listening RPC socket 0.0.0.0:44577 every 8 connection(s)
W20260924 02:10:58.846308 29378 messenger.cc:357] Unable to handle RPC call: Not implemented: call requires unsupported application feature flags: 99
[       OK ] Parameters/TestRpc.TestApplicationFeatureFlag/SSL_TCP (84 ms)
[ RUN      ] Parameters/TestRpc.TestCancellation/SSL_TCP
I20260924 02:10:58.875018 29406 acceptor_pool.cc:254] collecting diagnostics on the listening RPC socket 0.0.0.0:45853 every 8 connection(s)
I20260924 02:10:58.875761 29407 acceptor_pool.cc:254] collecting diagnostics on the listening RPC socket 0.0.0.0:45853 every 8 connection(s)
I20260924 02:10:58.879801 28992 rpc-test.cc:1648] Connecting to 0.0.0.0:45853
I20260924 02:10:58.986099 28992 rpc-test-base.h:595] status: Aborted: Sleep RPC to 0.0.0.0:45853 is cancelled in state READY, seconds elapsed: 0.000392874
I20260924 02:10:59.128062 28992 rpc-test-base.h:595] status: Aborted: Sleep RPC to 0.0.0.0:45853 is cancelled in state SENT, seconds elapsed: 0.000855927
I20260924 02:10:59.186395 29409 rpc-test-base.h:222] got call: sleep_micros: 510000
I20260924 02:10:59.302585 28992 rpc-test-base.h:595] status: Aborted: Sleep RPC to 0.0.0.0:45853 is cancelled in state SENT, seconds elapsed: 0.000913682
I20260924 02:10:59.350271 29408 rpc-test-base.h:222] got call: sleep_micros: 510000
I20260924 02:10:59.483749 28992 rpc-test-base.h:595] status: Aborted: Sleep RPC to 0.0.0.0:45853 is cancelled in state SENT, seconds elapsed: 0.00114205
W20260924 02:10:59.521142 29410 rpcz_store.cc:267] Call kudu.rpc.GenericCalculatorService.Sleep from 127.0.0.1:52916 (request call id 11) took 15 ms (client timeout 10 ms). Trace:
W20260924 02:10:59.521528 29410 rpcz_store.cc:269] 0924 02:10:59.505797 (+     0us) service_pool.cc:170] Inserting onto call queue
0924 02:10:59.520869 (+ 15072us) service_pool.cc:214] Skipping call since client already timed out
0924 02:10:59.520953 (+    84us) inbound_call.cc:173] Queueing failure response
Metrics: {}
I20260924 02:10:59.522073 29410 rpc-test-base.h:222] got call: sleep_micros: 1500000
W20260924 02:10:59.697161 29409 rpcz_store.cc:267] Call kudu.rpc.GenericCalculatorService.Sleep from 127.0.0.1:52916 (request call id 3) took 511 ms (client timeout 10 ms). Trace:
W20260924 02:10:59.697515 29409 rpcz_store.cc:269] 0924 02:10:59.186126 (+     0us) service_pool.cc:170] Inserting onto call queue
0924 02:10:59.186312 (+   186us) service_pool.cc:227] Handling call
0924 02:10:59.697100 (+510788us) inbound_call.cc:173] Queueing success response
Metrics: {}
W20260924 02:10:59.861131 29408 rpcz_store.cc:267] Call kudu.rpc.GenericCalculatorService.Sleep from 127.0.0.1:52916 (request call id 7) took 511 ms (client timeout 10 ms). Trace:
W20260924 02:10:59.861459 29408 rpcz_store.cc:269] 0924 02:10:59.349993 (+     0us) service_pool.cc:170] Inserting onto call queue
0924 02:10:59.350191 (+   198us) service_pool.cc:227] Handling call
0924 02:10:59.861082 (+510891us) inbound_call.cc:173] Queueing success response
Metrics: {}
I20260924 02:11:00.485649 28992 rpc-test-base.h:595] status: Timed out: Sleep RPC to 0.0.0.0:45853 timed out after 1.000s (SENT), seconds elapsed: 1.00128
I20260924 02:11:00.487003 29408 rpc-test-base.h:222] got call: sleep_micros: 1500000
W20260924 02:11:01.022626 29410 rpcz_store.cc:267] Call kudu.rpc.GenericCalculatorService.Sleep from 127.0.0.1:52916 (request call id 12) took 1516 ms (client timeout 1000 ms). Trace:
W20260924 02:11:01.022936 29410 rpcz_store.cc:269] 0924 02:10:59.506028 (+     0us) service_pool.cc:170] Inserting onto call queue
0924 02:10:59.522025 (+ 15997us) service_pool.cc:227] Handling call
0924 02:11:01.022574 (+1500549us) inbound_call.cc:173] Queueing success response
Metrics: {}
I20260924 02:11:01.487396 28992 rpc-test-base.h:595] status: Timed out: Sleep RPC to 0.0.0.0:45853 timed out after 1.000s (SENT), seconds elapsed: 1.00145
W20260924 02:11:01.489002 29405 messenger.cc:357] Unable to handle RPC call: Not implemented: call requires unsupported application feature flags: 99, 1
W20260924 02:11:01.490478 29405 messenger.cc:357] Unable to handle RPC call: Not implemented: call requires unsupported application feature flags: 99, 1
W20260924 02:11:01.987540 29408 rpcz_store.cc:267] Call kudu.rpc.GenericCalculatorService.Sleep from 127.0.0.1:52916 (request call id 13) took 1500 ms (client timeout 1000 ms). Trace:
W20260924 02:11:01.987844 29408 rpcz_store.cc:269] 0924 02:11:00.486829 (+     0us) service_pool.cc:170] Inserting onto call queue
0924 02:11:00.486963 (+   134us) service_pool.cc:227] Handling call
0924 02:11:01.987489 (+1500526us) inbound_call.cc:173] Queueing success response
Metrics: {}
W20260924 02:11:01.988546 29405 connection.cc:441] server connection from 127.0.0.1:52916 torn down before Call kudu.rpc.GenericCalculatorService.Sleep from 127.0.0.1:52916 (request call id 13) could send its response
[       OK ] Parameters/TestRpc.TestCancellation/SSL_TCP (3140 ms)
[ RUN      ] Parameters/TestRpc.TestCancellationMultiThreads/SSL_TCP
I20260924 02:11:02.034440 29431 acceptor_pool.cc:254] collecting diagnostics on the listening RPC socket 0.0.0.0:36045 every 8 connection(s)
I20260924 02:11:02.035300 29432 acceptor_pool.cc:254] collecting diagnostics on the listening RPC socket 0.0.0.0:36045 every 8 connection(s)
I20260924 02:11:02.040074 28992 rpc-test.cc:1808] Connecting to 0.0.0.0:36045
I20260924 02:11:02.196219 29446 test_util.cc:268] Using random seed: 478778890
I20260924 02:11:02.198035 29447 test_util.cc:268] Using random seed: 478780830
I20260924 02:11:02.201325 29448 test_util.cc:268] Using random seed: 478784330
I20260924 02:11:02.202921 29449 test_util.cc:268] Using random seed: 478785942
I20260924 02:11:02.204221 29450 test_util.cc:268] Using random seed: 478787265
I20260924 02:11:02.205576 29451 test_util.cc:268] Using random seed: 478788616
I20260924 02:11:02.206966 29452 test_util.cc:268] Using random seed: 478789992
I20260924 02:11:02.208504 29453 test_util.cc:268] Using random seed: 478791534
I20260924 02:11:02.209772 29454 test_util.cc:268] Using random seed: 478792823
I20260924 02:11:02.211114 29455 test_util.cc:268] Using random seed: 478794122
I20260924 02:11:02.212836 29456 test_util.cc:268] Using random seed: 478795826
I20260924 02:11:02.214255 29457 test_util.cc:268] Using random seed: 478797136
I20260924 02:11:02.215744 29458 test_util.cc:268] Using random seed: 478798788
I20260924 02:11:02.217154 29459 test_util.cc:268] Using random seed: 478800151
I20260924 02:11:02.218586 29460 test_util.cc:268] Using random seed: 478801579
I20260924 02:11:02.220211 29461 test_util.cc:268] Using random seed: 478803143
I20260924 02:11:02.222030 29462 test_util.cc:268] Using random seed: 478804994
I20260924 02:11:02.223848 29463 test_util.cc:268] Using random seed: 478806833
I20260924 02:11:02.225633 29464 test_util.cc:268] Using random seed: 478808481
I20260924 02:11:02.227800 29465 test_util.cc:268] Using random seed: 478810816
I20260924 02:11:02.229563 29466 test_util.cc:268] Using random seed: 478812486
I20260924 02:11:02.231396 29467 test_util.cc:268] Using random seed: 478814373
I20260924 02:11:02.234361 29468 test_util.cc:268] Using random seed: 478817358
I20260924 02:11:02.236577 29469 test_util.cc:268] Using random seed: 478819440
I20260924 02:11:02.240688 29470 test_util.cc:268] Using random seed: 478823635
I20260924 02:11:02.240945 29471 test_util.cc:268] Using random seed: 478823921
I20260924 02:11:02.242787 29472 test_util.cc:268] Using random seed: 478825781
I20260924 02:11:02.244829 29473 test_util.cc:268] Using random seed: 478827771
I20260924 02:11:02.246877 29474 test_util.cc:268] Using random seed: 478829798
I20260924 02:11:02.248448 29475 test_util.cc:268] Using random seed: 478831439
[       OK ] Parameters/TestRpc.TestCancellationMultiThreads/SSL_TCP (18352 ms)
[ RUN      ] Parameters/TestRpc.TestCallId/SSL_TCP
I20260924 02:11:20.373167 29488 acceptor_pool.cc:254] collecting diagnostics on the listening RPC socket 0.0.0.0:36803 every 8 connection(s)
I20260924 02:11:20.373939 29489 acceptor_pool.cc:254] collecting diagnostics on the listening RPC socket 0.0.0.0:36803 every 8 connection(s)
[       OK ] Parameters/TestRpc.TestCallId/SSL_TCP (86 ms)
[----------] 20 tests from Parameters/TestRpc (38323 ms total)

[----------] Global test environment tear-down
[==========] 21 tests from 2 test suites ran. (38331 ms total)
[  PASSED  ] 20 tests.
[  FAILED  ] 1 test, listed below:
[  FAILED  ] Parameters/TestRpc.TestCallWithChainCertAndRootCA/SSL_TCP, where GetParam() = (true, false)

 1 FAILED TEST