Diagnosed failure

Parameters/TestRpc.TestCallWithChainCertAndRootCA/SSL_UnixSocket: /data0/somelongdirectorytoavoidrpathissues/src/kudu/src/kudu/rpc/rpc-test.cc:303: Failure
Failed
Bad status: Runtime error: could not verify certificate chain (error with cert: subject=CN = localhost, ST = sadfjas, C = AS, emailAddress = sdflkdsajf, O = lskdfjlsad, OU = sldfkja, issuer=C = AS, ST = ASDfkjdhf, L = lskdjf, O = saldfja, OU = skdjf, CN = localhost, emailAddress = sadjflkadsj): : certificate has expired
Google Test trace:
/data0/somelongdirectorytoavoidrpathissues/src/kudu/src/kudu/rpc/rpc-test.cc:300: Connecting to unix:/tmp/dist-test-taskXb_AKr/test-tmp/rpc-test-fc5c8a5cda78443ca4b99cd9f7c1aae1.sock
I20260926 16:12:59.346406 18032 test_util.cc:175] -----------------------------------------------
I20260926 16:12:59.346643 18032 test_util.cc:176] Had fatal failures, leaving test files at /tmp/dist-test-taskXb_AKr/test-tmp/rpc-test.2.Parameters_TestRpc.TestCallWithChainCertAndRootCA_SSL_UnixSocket.1790439175798546-18032-0

Full log

Note: This is test shard 3 of 8.
[==========] Running 21 tests from 2 test suites.
[----------] Global test environment set-up.
[----------] 1 test from TestRpc
[ RUN      ] TestRpc.TestNegotiationTimeout
WARNING: Logging before InitGoogleLogging() is written to STDERR
I20260926 16:12:55.993352 18032 rpc-test-base.h:595] status: Timed out: connection negotiation to 0.0.0.0:43335 for RPC Sleep timed out after 0.100s (ON_OUTBOUND_QUEUE), seconds elapsed: 0.100816
W20260926 16:12:59.040901 18042 negotiation.cc:337] Failed RPC negotiation. Trace:
0926 16:12:55.893488 (+     0us) reactor.cc:625] Submitting negotiation task for client connection to 0.0.0.0:43335 (local address 127.0.0.1:51072)
0926 16:12:55.894216 (+   728us) negotiation.cc:107] Waiting for socket to connect
0926 16:12:55.894265 (+    49us) client_negotiation.cc:174] Beginning negotiation
0926 16:12:55.907497 (+ 13232us) client_negotiation.cc:252] Sending NEGOTIATE NegotiatePB request
0926 16:12:59.039714 (+3132217us) negotiation.cc:327] Negotiation complete: Timed out: Client connection negotiation failed: client connection to 0.0.0.0:43335: received 0 of 4 requested bytes
Metrics: {"client-negotiator.queue_time_us":208}
[       OK ] TestRpc.TestNegotiationTimeout (3191 ms)
[----------] 1 test from TestRpc (3191 ms total)

[----------] 20 tests from Parameters/TestRpc
[ RUN      ] Parameters/TestRpc.TestAcceptorPoolStartStop/SSL_UnixSocket
I20260926 16:12:59.084439 18058 acceptor_pool.cc:254] collecting diagnostics on the listening RPC socket unix:/tmp/dist-test-taskXb_AKr/test-tmp/rpc-test-45d570fc66bd43f4b4bbaf185c9a7643.sock every 8 connection(s)
I20260926 16:12:59.086371 18059 acceptor_pool.cc:254] collecting diagnostics on the listening RPC socket unix:/tmp/dist-test-taskXb_AKr/test-tmp/rpc-test-45d570fc66bd43f4b4bbaf185c9a7643.sock every 8 connection(s)
I20260926 16:12:59.125154 18069 acceptor_pool.cc:254] collecting diagnostics on the listening RPC socket unix:/tmp/dist-test-taskXb_AKr/test-tmp/rpc-test-45d570fc66bd43f4b4bbaf185c9a7643.sock every 8 connection(s)
I20260926 16:12:59.127308 18070 acceptor_pool.cc:254] collecting diagnostics on the listening RPC socket unix:/tmp/dist-test-taskXb_AKr/test-tmp/rpc-test-45d570fc66bd43f4b4bbaf185c9a7643.sock every 8 connection(s)
I20260926 16:12:59.142772 18080 acceptor_pool.cc:254] collecting diagnostics on the listening RPC socket unix:/tmp/dist-test-taskXb_AKr/test-tmp/rpc-test-45d570fc66bd43f4b4bbaf185c9a7643.sock every 8 connection(s)
I20260926 16:12:59.143508 18081 acceptor_pool.cc:254] collecting diagnostics on the listening RPC socket unix:/tmp/dist-test-taskXb_AKr/test-tmp/rpc-test-45d570fc66bd43f4b4bbaf185c9a7643.sock every 8 connection(s)
I20260926 16:12:59.166222 18091 acceptor_pool.cc:254] collecting diagnostics on the listening RPC socket unix:/tmp/dist-test-taskXb_AKr/test-tmp/rpc-test-45d570fc66bd43f4b4bbaf185c9a7643.sock every 8 connection(s)
I20260926 16:12:59.166787 18092 acceptor_pool.cc:254] collecting diagnostics on the listening RPC socket unix:/tmp/dist-test-taskXb_AKr/test-tmp/rpc-test-45d570fc66bd43f4b4bbaf185c9a7643.sock every 8 connection(s)
I20260926 16:12:59.195514 18102 acceptor_pool.cc:254] collecting diagnostics on the listening RPC socket unix:/tmp/dist-test-taskXb_AKr/test-tmp/rpc-test-45d570fc66bd43f4b4bbaf185c9a7643.sock every 8 connection(s)
I20260926 16:12:59.196254 18103 acceptor_pool.cc:254] collecting diagnostics on the listening RPC socket unix:/tmp/dist-test-taskXb_AKr/test-tmp/rpc-test-45d570fc66bd43f4b4bbaf185c9a7643.sock every 8 connection(s)
[       OK ] Parameters/TestRpc.TestAcceptorPoolStartStop/SSL_UnixSocket (155 ms)
[ RUN      ] Parameters/TestRpc.TestCall/SSL_UnixSocket
I20260926 16:12:59.217125 18115 acceptor_pool.cc:254] collecting diagnostics on the listening RPC socket unix:/tmp/dist-test-taskXb_AKr/test-tmp/rpc-test-6f570bf418fe4a1ca130afe454296822.sock every 8 connection(s)
I20260926 16:12:59.219432 18116 acceptor_pool.cc:254] collecting diagnostics on the listening RPC socket unix:/tmp/dist-test-taskXb_AKr/test-tmp/rpc-test-6f570bf418fe4a1ca130afe454296822.sock every 8 connection(s)
I20260926 16:12:59.225364 18032 rpc-test.cc:234] Connecting to unix:/tmp/dist-test-taskXb_AKr/test-tmp/rpc-test-6f570bf418fe4a1ca130afe454296822.sock
W20260926 16:12:59.289959 18112 connection.cc:196] Error closing socket: Network error: TlsSocket::Close: Broken pipe
[       OK ] Parameters/TestRpc.TestCall/SSL_UnixSocket (95 ms)
[ RUN      ] Parameters/TestRpc.TestCallWithChainCertAndRootCA/SSL_UnixSocket
I20260926 16:12:59.323240 18140 acceptor_pool.cc:254] collecting diagnostics on the listening RPC socket unix:/tmp/dist-test-taskXb_AKr/test-tmp/rpc-test-fc5c8a5cda78443ca4b99cd9f7c1aae1.sock every 8 connection(s)
I20260926 16:12:59.323961 18141 acceptor_pool.cc:254] collecting diagnostics on the listening RPC socket unix:/tmp/dist-test-taskXb_AKr/test-tmp/rpc-test-fc5c8a5cda78443ca4b99cd9f7c1aae1.sock every 8 connection(s)
/data0/somelongdirectorytoavoidrpathissues/src/kudu/src/kudu/rpc/rpc-test.cc:303: Failure
Failed
Bad status: Runtime error: could not verify certificate chain (error with cert: subject=CN = localhost, ST = sadfjas, C = AS, emailAddress = sdflkdsajf, O = lskdfjlsad, OU = sldfkja, issuer=C = AS, ST = ASDfkjdhf, L = lskdjf, O = saldfja, OU = skdjf, CN = localhost, emailAddress = sadjflkadsj): : certificate has expired
Google Test trace:
/data0/somelongdirectorytoavoidrpathissues/src/kudu/src/kudu/rpc/rpc-test.cc:300: Connecting to unix:/tmp/dist-test-taskXb_AKr/test-tmp/rpc-test-fc5c8a5cda78443ca4b99cd9f7c1aae1.sock
I20260926 16:12:59.346406 18032 test_util.cc:175] -----------------------------------------------
I20260926 16:12:59.346643 18032 test_util.cc:176] Had fatal failures, leaving test files at /tmp/dist-test-taskXb_AKr/test-tmp/rpc-test.2.Parameters_TestRpc.TestCallWithChainCertAndRootCA_SSL_UnixSocket.1790439175798546-18032-0
[  FAILED  ] Parameters/TestRpc.TestCallWithChainCertAndRootCA/SSL_UnixSocket, where GetParam() = (true, true) (51 ms)
[ RUN      ] Parameters/TestRpc.TestCallWithBadPasswordProtectedKey/SSL_UnixSocket
[       OK ] Parameters/TestRpc.TestCallWithBadPasswordProtectedKey/SSL_UnixSocket (36 ms)
[ RUN      ] Parameters/TestRpc.TestInvalidMethodCall/SSL_UnixSocket
I20260926 16:12:59.449242 18177 acceptor_pool.cc:254] collecting diagnostics on the listening RPC socket unix:/tmp/dist-test-taskXb_AKr/test-tmp/rpc-test-453f5c656b53419d92de0070607993e7.sock every 8 connection(s)
I20260926 16:12:59.449985 18178 acceptor_pool.cc:254] collecting diagnostics on the listening RPC socket unix:/tmp/dist-test-taskXb_AKr/test-tmp/rpc-test-453f5c656b53419d92de0070607993e7.sock every 8 connection(s)
I20260926 16:12:59.453374 18032 rpc-test.cc:406] Connecting to unix:/tmp/dist-test-taskXb_AKr/test-tmp/rpc-test-453f5c656b53419d92de0070607993e7.sock
[       OK ] Parameters/TestRpc.TestInvalidMethodCall/SSL_UnixSocket (114 ms)
[ RUN      ] Parameters/TestRpc.TestHighFDs/SSL_UnixSocket
I20260926 16:12:59.711676 18202 acceptor_pool.cc:254] collecting diagnostics on the listening RPC socket unix:/tmp/dist-test-taskXb_AKr/test-tmp/rpc-test-d7930591063544d3a6aef4dc5fceaab6.sock every 8 connection(s)
I20260926 16:12:59.712461 18203 acceptor_pool.cc:254] collecting diagnostics on the listening RPC socket unix:/tmp/dist-test-taskXb_AKr/test-tmp/rpc-test-d7930591063544d3a6aef4dc5fceaab6.sock every 8 connection(s)
W20260926 16:12:59.771878 18199 connection.cc:196] Error closing socket: Network error: TlsSocket::Close: Broken pipe
[       OK ] Parameters/TestRpc.TestHighFDs/SSL_UnixSocket (284 ms)
[ RUN      ] Parameters/TestRpc.TestConnectionAlwaysKeepalive/SSL_UnixSocket
I20260926 16:12:59.799439 18225 acceptor_pool.cc:254] collecting diagnostics on the listening RPC socket unix:/tmp/dist-test-taskXb_AKr/test-tmp/rpc-test-b21d6351de46420e9170ef2bf59a176b.sock every 8 connection(s)
I20260926 16:12:59.799831 18226 acceptor_pool.cc:254] collecting diagnostics on the listening RPC socket unix:/tmp/dist-test-taskXb_AKr/test-tmp/rpc-test-b21d6351de46420e9170ef2bf59a176b.sock every 8 connection(s)
I20260926 16:12:59.802937 18032 rpc-test.cc:532] Connecting to unix:/tmp/dist-test-taskXb_AKr/test-tmp/rpc-test-b21d6351de46420e9170ef2bf59a176b.sock
W20260926 16:13:02.848157 18224 connection.cc:196] Error closing socket: Network error: TlsSocket::Close: Broken pipe
[       OK ] Parameters/TestRpc.TestConnectionAlwaysKeepalive/SSL_UnixSocket (3070 ms)
[ RUN      ] Parameters/TestRpc.TestReopenOutboundConnections/SSL_UnixSocket
I20260926 16:13:02.896409 18248 acceptor_pool.cc:254] collecting diagnostics on the listening RPC socket unix:/tmp/dist-test-taskXb_AKr/test-tmp/rpc-test-096c81f0bce248da8a79d7b1fa569a13.sock every 8 connection(s)
I20260926 16:13:02.897174 18249 acceptor_pool.cc:254] collecting diagnostics on the listening RPC socket unix:/tmp/dist-test-taskXb_AKr/test-tmp/rpc-test-096c81f0bce248da8a79d7b1fa569a13.sock every 8 connection(s)
I20260926 16:13:02.900301 18032 rpc-test.cc:658] Connecting to unix:/tmp/dist-test-taskXb_AKr/test-tmp/rpc-test-096c81f0bce248da8a79d7b1fa569a13.sock
W20260926 16:13:02.934821 18247 connection.cc:196] Error closing socket: Network error: TlsSocket::Close: Broken pipe
W20260926 16:13:02.944710 18247 connection.cc:196] Error closing socket: Network error: TlsSocket::Close: Broken pipe
W20260926 16:13:02.956511 18247 connection.cc:196] Error closing socket: Network error: TlsSocket::Close: Broken pipe
W20260926 16:13:02.967551 18247 connection.cc:196] Error closing socket: Network error: TlsSocket::Close: Broken pipe
W20260926 16:13:02.978283 18247 connection.cc:196] Error closing socket: Network error: TlsSocket::Close: Broken pipe
W20260926 16:13:02.989233 18247 connection.cc:196] Error closing socket: Network error: TlsSocket::Close: Broken pipe
W20260926 16:13:03.001024 18247 connection.cc:196] Error closing socket: Network error: TlsSocket::Close: Broken pipe
W20260926 16:13:03.012768 18247 connection.cc:196] Error closing socket: Network error: TlsSocket::Close: Broken pipe
W20260926 16:13:03.025270 18247 connection.cc:196] Error closing socket: Network error: TlsSocket::Close: Broken pipe
W20260926 16:13:03.036473 18247 connection.cc:196] Error closing socket: Network error: TlsSocket::Close: Broken pipe
W20260926 16:13:03.048607 18247 connection.cc:196] Error closing socket: Network error: TlsSocket::Close: Broken pipe
W20260926 16:13:03.061092 18247 connection.cc:196] Error closing socket: Network error: TlsSocket::Close: Broken pipe
W20260926 16:13:03.072453 18247 connection.cc:196] Error closing socket: Network error: TlsSocket::Close: Broken pipe
W20260926 16:13:03.083968 18247 connection.cc:196] Error closing socket: Network error: TlsSocket::Close: Broken pipe
W20260926 16:13:03.083968 18248 acceptor_pool.cc:285] unable to collect diagnostics on RPC socket unix:/tmp/dist-test-taskXb_AKr/test-tmp/rpc-test-096c81f0bce248da8a79d7b1fa569a13.sock: Not implemented: netlink diagnostics is currently supported only on IPv4 TCP sockets
W20260926 16:13:03.094949 18247 connection.cc:196] Error closing socket: Network error: TlsSocket::Close: Broken pipe
W20260926 16:13:03.107143 18247 connection.cc:196] Error closing socket: Network error: TlsSocket::Close: Broken pipe
W20260926 16:13:03.118496 18247 connection.cc:196] Error closing socket: Network error: TlsSocket::Close: Broken pipe
W20260926 16:13:03.130126 18247 connection.cc:196] Error closing socket: Network error: TlsSocket::Close: Broken pipe
W20260926 16:13:03.141366 18247 connection.cc:196] Error closing socket: Network error: TlsSocket::Close: Broken pipe
W20260926 16:13:03.152671 18247 connection.cc:196] Error closing socket: Network error: TlsSocket::Close: Broken pipe
W20260926 16:13:03.166538 18247 connection.cc:196] Error closing socket: Network error: TlsSocket::Close: Broken pipe
W20260926 16:13:03.179454 18247 connection.cc:196] Error closing socket: Network error: TlsSocket::Close: Broken pipe
W20260926 16:13:03.190745 18247 connection.cc:196] Error closing socket: Network error: TlsSocket::Close: Broken pipe
W20260926 16:13:03.202927 18247 connection.cc:196] Error closing socket: Network error: TlsSocket::Close: Broken pipe
W20260926 16:13:03.215049 18247 connection.cc:196] Error closing socket: Network error: TlsSocket::Close: Broken pipe
W20260926 16:13:03.225211 18247 connection.cc:196] Error closing socket: Network error: TlsSocket::Close: Broken pipe
W20260926 16:13:03.237272 18247 connection.cc:196] Error closing socket: Network error: TlsSocket::Close: Broken pipe
W20260926 16:13:03.247813 18247 connection.cc:196] Error closing socket: Network error: TlsSocket::Close: Broken pipe
W20260926 16:13:03.259223 18247 connection.cc:196] Error closing socket: Network error: TlsSocket::Close: Broken pipe
W20260926 16:13:03.269304 18247 connection.cc:196] Error closing socket: Network error: TlsSocket::Close: Broken pipe
W20260926 16:13:03.278354 18247 connection.cc:196] Error closing socket: Network error: TlsSocket::Close: Broken pipe
W20260926 16:13:03.290784 18247 connection.cc:196] Error closing socket: Network error: TlsSocket::Close: Broken pipe
[       OK ] Parameters/TestRpc.TestReopenOutboundConnections/SSL_UnixSocket (443 ms)
[ RUN      ] Parameters/TestRpc.TestConnectionNetworkPlane/SSL_UnixSocket
I20260926 16:13:03.309715 18271 acceptor_pool.cc:254] collecting diagnostics on the listening RPC socket unix:/tmp/dist-test-taskXb_AKr/test-tmp/rpc-test-0d434c6b3ef84794b2292ea6ffc855d8.sock every 8 connection(s)
I20260926 16:13:03.310547 18272 acceptor_pool.cc:254] collecting diagnostics on the listening RPC socket unix:/tmp/dist-test-taskXb_AKr/test-tmp/rpc-test-0d434c6b3ef84794b2292ea6ffc855d8.sock every 8 connection(s)
I20260926 16:13:03.314083 18032 rpc-test.cc:772] Connecting to unix:/tmp/dist-test-taskXb_AKr/test-tmp/rpc-test-0d434c6b3ef84794b2292ea6ffc855d8.sock
W20260926 16:13:03.372793 18270 connection.cc:196] Error closing socket: Network error: TlsSocket::Close: Broken pipe
[       OK ] Parameters/TestRpc.TestConnectionNetworkPlane/SSL_UnixSocket (81 ms)
[ RUN      ] Parameters/TestRpc.TestTCPKeepalive/SSL_UnixSocket
I20260926 16:13:03.402913 18296 acceptor_pool.cc:254] collecting diagnostics on the listening RPC socket unix:/tmp/dist-test-taskXb_AKr/test-tmp/rpc-test-8c6259074adc47518dcee0530ab6c829.sock every 8 connection(s)
I20260926 16:13:03.403750 18297 acceptor_pool.cc:254] collecting diagnostics on the listening RPC socket unix:/tmp/dist-test-taskXb_AKr/test-tmp/rpc-test-8c6259074adc47518dcee0530ab6c829.sock every 8 connection(s)
I20260926 16:13:03.466676 18300 rpc-test-base.h:222] got call: sleep_micros: 8000000 deferred: true
I20260926 16:13:11.470785 18300 rpcz_store.cc:275] Call kudu.rpc.GenericCalculatorService.Sleep from unix:<unnamed> (request call id 0) took 8004 ms. Trace:
I20260926 16:13:11.471433 18300 rpcz_store.cc:276] 0926 16:13:03.466490 (+     0us) service_pool.cc:170] Inserting onto call queue
0926 16:13:03.466620 (+   130us) service_pool.cc:227] Handling call
0926 16:13:11.470609 (+8003989us) inbound_call.cc:173] Queueing success response
Metrics: {}
W20260926 16:13:11.478168 18293 connection.cc:196] Error closing socket: Network error: TlsSocket::Close: Broken pipe
[       OK ] Parameters/TestRpc.TestTCPKeepalive/SSL_UnixSocket (8107 ms)
[ RUN      ] Parameters/TestRpc.TestMaxSmallSidecars/SSL_UnixSocket
I20260926 16:13:11.529207 18322 acceptor_pool.cc:254] collecting diagnostics on the listening RPC socket unix:/tmp/dist-test-taskXb_AKr/test-tmp/rpc-test-5f9fbe5ced4f4d9c9040d6759b041ad3.sock every 8 connection(s)
I20260926 16:13:11.530164 18323 acceptor_pool.cc:254] collecting diagnostics on the listening RPC socket unix:/tmp/dist-test-taskXb_AKr/test-tmp/rpc-test-5f9fbe5ced4f4d9c9040d6759b041ad3.sock every 8 connection(s)
W20260926 16:13:11.703181 18319 connection.cc:196] Error closing socket: Network error: TlsSocket::Close: Broken pipe
[       OK ] Parameters/TestRpc.TestMaxSmallSidecars/SSL_UnixSocket (225 ms)
[ RUN      ] Parameters/TestRpc.TestCallTimeout/SSL_UnixSocket
I20260926 16:13:11.731300 18347 acceptor_pool.cc:254] collecting diagnostics on the listening RPC socket unix:/tmp/dist-test-taskXb_AKr/test-tmp/rpc-test-22ac1ba1a49244fab99eafc25f6bba5c.sock every 8 connection(s)
I20260926 16:13:11.731988 18348 acceptor_pool.cc:254] collecting diagnostics on the listening RPC socket unix:/tmp/dist-test-taskXb_AKr/test-tmp/rpc-test-22ac1ba1a49244fab99eafc25f6bba5c.sock every 8 connection(s)
I20260926 16:13:11.757694 18032 rpc-test-base.h:595] status: Timed out: connection negotiation to unix:/tmp/dist-test-taskXb_AKr/test-tmp/rpc-test-22ac1ba1a49244fab99eafc25f6bba5c.sock for RPC Sleep timed out after 0.000s (ON_OUTBOUND_QUEUE), seconds elapsed: 0.00308983
I20260926 16:13:11.765203 18351 rpc-test-base.h:222] got call: sleep_micros: 700000
I20260926 16:13:11.959198 18032 rpc-test-base.h:595] status: Timed out: Sleep RPC to unix:/tmp/dist-test-taskXb_AKr/test-tmp/rpc-test-22ac1ba1a49244fab99eafc25f6bba5c.sock timed out after 0.200s (SENT), seconds elapsed: 0.201143
I20260926 16:13:11.960719 18350 rpc-test-base.h:222] got call: sleep_micros: 2000000
W20260926 16:13:12.465934 18351 rpcz_store.cc:267] Call kudu.rpc.GenericCalculatorService.Sleep from unix:<unnamed> (request call id 1) took 700 ms (client timeout 200 ms). Trace:
W20260926 16:13:12.466331 18351 rpcz_store.cc:269] 0926 16:13:11.765035 (+     0us) service_pool.cc:170] Inserting onto call queue
0926 16:13:11.765156 (+   121us) service_pool.cc:227] Handling call
0926 16:13:12.465881 (+700725us) inbound_call.cc:173] Queueing success response
Metrics: {}
I20260926 16:13:13.462129 18032 rpc-test-base.h:595] status: Timed out: Sleep RPC to unix:/tmp/dist-test-taskXb_AKr/test-tmp/rpc-test-22ac1ba1a49244fab99eafc25f6bba5c.sock timed out after 1.500s (SENT), seconds elapsed: 1.50254
W20260926 16:13:13.961220 18350 rpcz_store.cc:267] Call kudu.rpc.GenericCalculatorService.Sleep from unix:<unnamed> (request call id 2) took 2000 ms (client timeout 1500 ms). Trace:
W20260926 16:13:13.961663 18350 rpcz_store.cc:269] 0926 16:13:11.960400 (+     0us) service_pool.cc:170] Inserting onto call queue
0926 16:13:11.960548 (+   148us) service_pool.cc:227] Handling call
0926 16:13:13.961163 (+2000615us) inbound_call.cc:173] Queueing success response
Metrics: {}
W20260926 16:13:13.962486 18344 connection.cc:441] server connection from unix:<unnamed> torn down before Call kudu.rpc.GenericCalculatorService.Sleep from unix:<unnamed> (request call id 2) could send its response
[       OK ] Parameters/TestRpc.TestCallTimeout/SSL_UnixSocket (2258 ms)
[ RUN      ] Parameters/TestRpc.TestServerShutsDown/SSL_UnixSocket
I20260926 16:13:13.971679 18032 rpc-test.cc:1125] Connecting to 0.0.0.0:39277
W20260926 16:13:13.981031 18364 negotiation.cc:337] Failed RPC negotiation. Trace:
0926 16:13:13.978900 (+     0us) reactor.cc:625] Submitting negotiation task for client connection to 0.0.0.0:39277 (local address 127.0.0.1:37198)
0926 16:13:13.979487 (+   587us) negotiation.cc:107] Waiting for socket to connect
0926 16:13:13.979534 (+    47us) client_negotiation.cc:174] Beginning negotiation
0926 16:13:13.979835 (+   301us) client_negotiation.cc:252] Sending NEGOTIATE NegotiatePB request
0926 16:13:13.980182 (+   347us) negotiation.cc:327] Negotiation complete: Network error: Client connection negotiation failed: client connection to 0.0.0.0:39277: BlockingWrite error: write error: Broken pipe (error 32)
Metrics: {"client-negotiator.queue_time_us":157}
[       OK ] Parameters/TestRpc.TestServerShutsDown/SSL_UnixSocket (14 ms)
[ RUN      ] Parameters/TestRpc.TimedOutOnResponseMetric/SSL_UnixSocket
I20260926 16:13:14.018141 18381 acceptor_pool.cc:254] collecting diagnostics on the listening RPC socket unix:/tmp/dist-test-taskXb_AKr/test-tmp/rpc-test-72ea02ee25d349118ea0eeab923de4f2.sock every 8 connection(s)
I20260926 16:13:14.018869 18382 acceptor_pool.cc:254] collecting diagnostics on the listening RPC socket unix:/tmp/dist-test-taskXb_AKr/test-tmp/rpc-test-72ea02ee25d349118ea0eeab923de4f2.sock every 8 connection(s)
W20260926 16:13:14.265398 18385 rpcz_store.cc:267] Call kudu.rpc_test.CalculatorService.Sleep from unix:<unnamed> (request call id 3) took 50 ms (client timeout 25 ms). Trace:
W20260926 16:13:14.265702 18385 rpcz_store.cc:269] 0926 16:13:14.214712 (+     0us) service_pool.cc:170] Inserting onto call queue
0926 16:13:14.214847 (+   135us) service_pool.cc:227] Handling call
0926 16:13:14.265311 (+ 50464us) inbound_call.cc:173] Queueing success response
Related trace 'test_child':
Metrics: {"test_sleep_us":50000,"child_traces":[["test_child",{"related_trace_metric":1}]]}
W20260926 16:13:14.325014 18385 rpcz_store.cc:267] Call kudu.rpc_test.CalculatorService.Sleep from unix:<unnamed> (request call id 4) took 50 ms (client timeout 50 ms). Trace:
W20260926 16:13:14.325325 18385 rpcz_store.cc:269] 0926 16:13:14.274295 (+     0us) service_pool.cc:170] Inserting onto call queue
0926 16:13:14.274453 (+   158us) service_pool.cc:227] Handling call
0926 16:13:14.324940 (+ 50487us) inbound_call.cc:173] Queueing success response
Related trace 'test_child':
Metrics: {"test_sleep_us":50000,"child_traces":[["test_child",{"related_trace_metric":1}]]}
[       OK ] Parameters/TestRpc.TimedOutOnResponseMetric/SSL_UnixSocket (350 ms)
[ RUN      ] Parameters/TestRpc.AcceptorDispatchingTimesMetric/SSL_UnixSocket
I20260926 16:13:14.348333 18406 acceptor_pool.cc:254] collecting diagnostics on the listening RPC socket 0.0.0.0:44699 every 8 connection(s)
I20260926 16:13:14.349107 18407 acceptor_pool.cc:254] collecting diagnostics on the listening RPC socket 0.0.0.0:44699 every 8 connection(s)
W20260926 16:13:14.355492 18402 negotiation.cc:337] Failed RPC negotiation. Trace:
0926 16:13:14.353287 (+     0us) reactor.cc:625] Submitting negotiation task for server connection from 127.0.0.1:35786 (local address 127.0.0.1:44699)
0926 16:13:14.354033 (+   746us) server_negotiation.cc:206] Beginning negotiation
0926 16:13:14.354058 (+    25us) server_negotiation.cc:399] Waiting for connection header
0926 16:13:14.354513 (+   455us) negotiation.cc:327] Negotiation complete: Network error: Server connection negotiation failed: server connection from 127.0.0.1:35786: BlockingRecv error: recv got EOF from 127.0.0.1:35786 (error 108)
Metrics: {"server-negotiator.queue_time_us":142}
[       OK ] Parameters/TestRpc.AcceptorDispatchingTimesMetric/SSL_UnixSocket (23 ms)
[ RUN      ] Parameters/TestRpc.TestRpcCallbackDestroysMessenger/SSL_UnixSocket
[       OK ] Parameters/TestRpc.TestRpcCallbackDestroysMessenger/SSL_UnixSocket (42 ms)
[ RUN      ] Parameters/TestRpc.TestApplicationFeatureFlag/SSL_UnixSocket
I20260926 16:13:14.434338 18431 acceptor_pool.cc:254] collecting diagnostics on the listening RPC socket unix:/tmp/dist-test-taskXb_AKr/test-tmp/rpc-test-04282ba2968d4fe58e438bc0190357a9.sock every 8 connection(s)
I20260926 16:13:14.435230 18432 acceptor_pool.cc:254] collecting diagnostics on the listening RPC socket unix:/tmp/dist-test-taskXb_AKr/test-tmp/rpc-test-04282ba2968d4fe58e438bc0190357a9.sock every 8 connection(s)
W20260926 16:13:14.473107 18428 messenger.cc:357] Unable to handle RPC call: Not implemented: call requires unsupported application feature flags: 99
[       OK ] Parameters/TestRpc.TestApplicationFeatureFlag/SSL_UnixSocket (80 ms)
[ RUN      ] Parameters/TestRpc.TestCancellation/SSL_UnixSocket
I20260926 16:13:14.518913 18456 acceptor_pool.cc:254] collecting diagnostics on the listening RPC socket unix:/tmp/dist-test-taskXb_AKr/test-tmp/rpc-test-915c38aac49d441d83c725442446e9f7.sock every 8 connection(s)
I20260926 16:13:14.519693 18457 acceptor_pool.cc:254] collecting diagnostics on the listening RPC socket unix:/tmp/dist-test-taskXb_AKr/test-tmp/rpc-test-915c38aac49d441d83c725442446e9f7.sock every 8 connection(s)
I20260926 16:13:14.523111 18032 rpc-test.cc:1648] Connecting to unix:/tmp/dist-test-taskXb_AKr/test-tmp/rpc-test-915c38aac49d441d83c725442446e9f7.sock
I20260926 16:13:14.641242 18032 rpc-test-base.h:595] status: Aborted: Sleep RPC to unix:/tmp/dist-test-taskXb_AKr/test-tmp/rpc-test-915c38aac49d441d83c725442446e9f7.sock is cancelled in state READY, seconds elapsed: 0.000430942
I20260926 16:13:14.852402 18032 rpc-test-base.h:595] status: Aborted: Sleep RPC to unix:/tmp/dist-test-taskXb_AKr/test-tmp/rpc-test-915c38aac49d441d83c725442446e9f7.sock is cancelled in state SENT, seconds elapsed: 0.000996216
I20260926 16:13:14.852602 18459 rpc-test-base.h:222] got call: sleep_micros: 510000
I20260926 16:13:15.053530 18032 rpc-test-base.h:595] status: Aborted: Sleep RPC to unix:/tmp/dist-test-taskXb_AKr/test-tmp/rpc-test-915c38aac49d441d83c725442446e9f7.sock is cancelled in state SENT, seconds elapsed: 0.000725706
I20260926 16:13:15.053869 18458 rpc-test-base.h:222] got call: sleep_micros: 510000
I20260926 16:13:15.242883 18032 rpc-test-base.h:595] status: Aborted: Sleep RPC to unix:/tmp/dist-test-taskXb_AKr/test-tmp/rpc-test-915c38aac49d441d83c725442446e9f7.sock is cancelled in state SENT, seconds elapsed: 0.000804591
W20260926 16:13:15.253604 18460 rpcz_store.cc:267] Call kudu.rpc.GenericCalculatorService.Sleep from unix:<unnamed> (request call id 11) took 10 ms (client timeout 10 ms). Trace:
W20260926 16:13:15.253928 18460 rpcz_store.cc:269] 0926 16:13:15.243067 (+     0us) service_pool.cc:170] Inserting onto call queue
0926 16:13:15.253308 (+ 10241us) service_pool.cc:214] Skipping call since client already timed out
0926 16:13:15.253435 (+   127us) inbound_call.cc:173] Queueing failure response
Metrics: {}
I20260926 16:13:15.254487 18460 rpc-test-base.h:222] got call: sleep_micros: 1500000
W20260926 16:13:15.363262 18459 rpcz_store.cc:267] Call kudu.rpc.GenericCalculatorService.Sleep from unix:<unnamed> (request call id 3) took 510 ms (client timeout 10 ms). Trace:
W20260926 16:13:15.363634 18459 rpcz_store.cc:269] 0926 16:13:14.852421 (+     0us) service_pool.cc:170] Inserting onto call queue
0926 16:13:14.852547 (+   126us) service_pool.cc:227] Handling call
0926 16:13:15.363200 (+510653us) inbound_call.cc:173] Queueing success response
Metrics: {}
W20260926 16:13:15.564534 18458 rpcz_store.cc:267] Call kudu.rpc.GenericCalculatorService.Sleep from unix:<unnamed> (request call id 7) took 510 ms (client timeout 10 ms). Trace:
W20260926 16:13:15.564904 18458 rpcz_store.cc:269] 0926 16:13:15.053700 (+     0us) service_pool.cc:170] Inserting onto call queue
0926 16:13:15.053815 (+   115us) service_pool.cc:227] Handling call
0926 16:13:15.564477 (+510662us) inbound_call.cc:173] Queueing success response
Metrics: {}
I20260926 16:13:16.244926 18032 rpc-test-base.h:595] status: Timed out: Sleep RPC to unix:/tmp/dist-test-taskXb_AKr/test-tmp/rpc-test-915c38aac49d441d83c725442446e9f7.sock timed out after 1.000s (SENT), seconds elapsed: 1.0015
I20260926 16:13:16.247067 18458 rpc-test-base.h:222] got call: sleep_micros: 1500000
W20260926 16:13:16.755290 18460 rpcz_store.cc:267] Call kudu.rpc.GenericCalculatorService.Sleep from unix:<unnamed> (request call id 12) took 1511 ms (client timeout 1000 ms). Trace:
W20260926 16:13:16.755633 18460 rpcz_store.cc:269] 0926 16:13:15.244104 (+     0us) service_pool.cc:170] Inserting onto call queue
0926 16:13:15.254448 (+ 10344us) service_pool.cc:227] Handling call
0926 16:13:16.755131 (+1500683us) inbound_call.cc:173] Queueing success response
Metrics: {}
I20260926 16:13:17.247623 18032 rpc-test-base.h:595] status: Timed out: Sleep RPC to unix:/tmp/dist-test-taskXb_AKr/test-tmp/rpc-test-915c38aac49d441d83c725442446e9f7.sock timed out after 1.000s (SENT), seconds elapsed: 1.00217
W20260926 16:13:17.249248 18453 messenger.cc:357] Unable to handle RPC call: Not implemented: call requires unsupported application feature flags: 99, 1
W20260926 16:13:17.251015 18453 messenger.cc:357] Unable to handle RPC call: Not implemented: call requires unsupported application feature flags: 99, 1
W20260926 16:13:17.484066 18453 connection.cc:196] Error closing socket: Network error: TlsSocket::Close: Broken pipe
W20260926 16:13:17.747805 18458 rpcz_store.cc:267] Call kudu.rpc.GenericCalculatorService.Sleep from unix:<unnamed> (request call id 13) took 1501 ms (client timeout 1000 ms). Trace:
W20260926 16:13:17.748170 18458 rpcz_store.cc:269] 0926 16:13:16.246717 (+     0us) service_pool.cc:170] Inserting onto call queue
0926 16:13:16.246918 (+   201us) service_pool.cc:227] Handling call
0926 16:13:17.747744 (+1500826us) inbound_call.cc:173] Queueing success response
Metrics: {}
W20260926 16:13:17.748812 18453 connection.cc:441] server connection from unix:<unnamed> torn down before Call kudu.rpc.GenericCalculatorService.Sleep from unix:<unnamed> (request call id 13) could send its response
[       OK ] Parameters/TestRpc.TestCancellation/SSL_UnixSocket (3275 ms)
[ RUN      ] Parameters/TestRpc.TestCancellationMultiThreads/SSL_UnixSocket
I20260926 16:13:17.779922 18482 acceptor_pool.cc:254] collecting diagnostics on the listening RPC socket unix:/tmp/dist-test-taskXb_AKr/test-tmp/rpc-test-ccfb4568849d4db39440ae66375a469c.sock every 8 connection(s)
I20260926 16:13:17.780794 18483 acceptor_pool.cc:254] collecting diagnostics on the listening RPC socket unix:/tmp/dist-test-taskXb_AKr/test-tmp/rpc-test-ccfb4568849d4db39440ae66375a469c.sock every 8 connection(s)
I20260926 16:13:17.784261 18032 rpc-test.cc:1808] Connecting to unix:/tmp/dist-test-taskXb_AKr/test-tmp/rpc-test-ccfb4568849d4db39440ae66375a469c.sock
I20260926 16:13:17.961969 18496 test_util.cc:268] Using random seed: 476245644
I20260926 16:13:17.963225 18497 test_util.cc:268] Using random seed: 476246960
I20260926 16:13:17.965168 18498 test_util.cc:268] Using random seed: 476248915
I20260926 16:13:17.968078 18500 test_util.cc:268] Using random seed: 476251697
I20260926 16:13:17.969305 18499 test_util.cc:268] Using random seed: 476250419
I20260926 16:13:17.969856 18501 test_util.cc:268] Using random seed: 476253430
I20260926 16:13:17.971740 18502 test_util.cc:268] Using random seed: 476255375
I20260926 16:13:17.973721 18503 test_util.cc:268] Using random seed: 476257355
I20260926 16:13:17.975935 18504 test_util.cc:268] Using random seed: 476259041
I20260926 16:13:17.977380 18505 test_util.cc:268] Using random seed: 476261014
I20260926 16:13:17.980672 18506 test_util.cc:268] Using random seed: 476264257
I20260926 16:13:17.982996 18507 test_util.cc:268] Using random seed: 476266564
I20260926 16:13:17.986166 18508 test_util.cc:268] Using random seed: 476269685
I20260926 16:13:17.988435 18509 test_util.cc:268] Using random seed: 476272043
I20260926 16:13:17.990578 18510 test_util.cc:268] Using random seed: 476274244
I20260926 16:13:17.992286 18511 test_util.cc:268] Using random seed: 476275868
I20260926 16:13:17.994190 18512 test_util.cc:268] Using random seed: 476277775
I20260926 16:13:17.996129 18513 test_util.cc:268] Using random seed: 476279731
I20260926 16:13:17.999732 18514 test_util.cc:268] Using random seed: 476283327
I20260926 16:13:18.001704 18515 test_util.cc:268] Using random seed: 476285223
I20260926 16:13:18.004455 18516 test_util.cc:268] Using random seed: 476288043
I20260926 16:13:18.006625 18517 test_util.cc:268] Using random seed: 476290222
I20260926 16:13:18.009588 18518 test_util.cc:268] Using random seed: 476293122
I20260926 16:13:18.011626 18519 test_util.cc:268] Using random seed: 476294678
I20260926 16:13:18.013042 18520 test_util.cc:268] Using random seed: 476296680
I20260926 16:13:18.015225 18521 test_util.cc:268] Using random seed: 476298802
I20260926 16:13:18.017153 18522 test_util.cc:268] Using random seed: 476300782
I20260926 16:13:18.019244 18523 test_util.cc:268] Using random seed: 476302844
I20260926 16:13:18.021647 18524 test_util.cc:268] Using random seed: 476304695
I20260926 16:13:18.022926 18525 test_util.cc:268] Using random seed: 476306493
W20260926 16:13:38.218848 18479 connection.cc:196] Error closing socket: Network error: TlsSocket::Close: Broken pipe
[       OK ] Parameters/TestRpc.TestCancellationMultiThreads/SSL_UnixSocket (20479 ms)
[ RUN      ] Parameters/TestRpc.TestCallId/SSL_UnixSocket
I20260926 16:13:38.283198 18539 acceptor_pool.cc:254] collecting diagnostics on the listening RPC socket unix:/tmp/dist-test-taskXb_AKr/test-tmp/rpc-test-70924a1bd47e4dd7ae5e3726718515ce.sock every 8 connection(s)
I20260926 16:13:38.284085 18540 acceptor_pool.cc:254] collecting diagnostics on the listening RPC socket unix:/tmp/dist-test-taskXb_AKr/test-tmp/rpc-test-70924a1bd47e4dd7ae5e3726718515ce.sock every 8 connection(s)
[       OK ] Parameters/TestRpc.TestCallId/SSL_UnixSocket (104 ms)
[----------] 20 tests from Parameters/TestRpc (39297 ms total)

[----------] Global test environment tear-down
[==========] 21 tests from 2 test suites ran. (42489 ms total)
[  PASSED  ] 20 tests.
[  FAILED  ] 1 test, listed below:
[  FAILED  ] Parameters/TestRpc.TestCallWithChainCertAndRootCA/SSL_UnixSocket, where GetParam() = (true, true)

 1 FAILED TEST
I20260926 16:13:38.360349 18032 logging.cc:424] LogThrottler /data0/somelongdirectorytoavoidrpathissues/src/kudu/src/kudu/rpc/acceptor_pool.cc:285: suppressed but not reported on 3 messages since previous log ~35 seconds ago