Diagnosed failure

Parameters/TestRpc.TestCallWithChainCertAndChainCA/SSL_TCP: /data0/somelongdirectorytoavoidrpathissues/src/kudu/src/kudu/rpc/rpc-test.cc:270: Failure
Failed
Bad status: Runtime error: could not verify certificate chain (error with cert: subject=CN = localhost, ST = sadfjas, C = AS, emailAddress = sdflkdsajf, O = lskdfjlsad, OU = sldfkja, issuer=C = AS, ST = ASDfkjdhf, L = lskdjf, O = saldfja, OU = skdjf, CN = localhost, emailAddress = sadjflkadsj): : certificate has expired
Google Test trace:
/data0/somelongdirectorytoavoidrpathissues/src/kudu/src/kudu/rpc/rpc-test.cc:267: Connecting to 0.0.0.0:36561
I20260924 14:31:40.779304 23957 test_util.cc:175] -----------------------------------------------
I20260924 14:31:40.779500 23957 test_util.cc:176] Had fatal failures, leaving test files at /tmp/dist-test-taskIBBYYP/test-tmp/rpc-test.5.Parameters_TestRpc.TestCallWithChainCertAndChainCA_SSL_TCP.1790260299414177-23957-0

Full log

Note: This is test shard 6 of 8.
[==========] Running 21 tests from 2 test suites.
[----------] Global test environment set-up.
[----------] 20 tests from Parameters/TestRpc
[ RUN      ] Parameters/TestRpc.TestMessengerCreateDestroy/SSL_TCP
WARNING: Logging before InitGoogleLogging() is written to STDERR
I20260924 14:31:39.535840 23957 rpc-test.cc:169] started messenger TestCreateDestroy
[       OK ] Parameters/TestRpc.TestMessengerCreateDestroy/SSL_TCP (1126 ms)
[ RUN      ] Parameters/TestRpc.TestNegotiationDeadlock/SSL_TCP
I20260924 14:31:40.659371 23979 acceptor_pool.cc:254] collecting diagnostics on the listening RPC socket 0.0.0.0:39107 every 8 connection(s)
I20260924 14:31:40.660825 23980 acceptor_pool.cc:254] collecting diagnostics on the listening RPC socket 0.0.0.0:39107 every 8 connection(s)
[       OK ] Parameters/TestRpc.TestNegotiationDeadlock/SSL_TCP (120 ms)
[ RUN      ] Parameters/TestRpc.TestCallWithChainCertAndChainCA/SSL_TCP
I20260924 14:31:40.748804 23995 acceptor_pool.cc:254] collecting diagnostics on the listening RPC socket 0.0.0.0:36561 every 8 connection(s)
I20260924 14:31:40.750950 23996 acceptor_pool.cc:254] collecting diagnostics on the listening RPC socket 0.0.0.0:36561 every 8 connection(s)
/data0/somelongdirectorytoavoidrpathissues/src/kudu/src/kudu/rpc/rpc-test.cc:270: Failure
Failed
Bad status: Runtime error: could not verify certificate chain (error with cert: subject=CN = localhost, ST = sadfjas, C = AS, emailAddress = sdflkdsajf, O = lskdfjlsad, OU = sldfkja, issuer=C = AS, ST = ASDfkjdhf, L = lskdjf, O = saldfja, OU = skdjf, CN = localhost, emailAddress = sadjflkadsj): : certificate has expired
Google Test trace:
/data0/somelongdirectorytoavoidrpathissues/src/kudu/src/kudu/rpc/rpc-test.cc:267: Connecting to 0.0.0.0:36561
I20260924 14:31:40.779304 23957 test_util.cc:175] -----------------------------------------------
I20260924 14:31:40.779500 23957 test_util.cc:176] Had fatal failures, leaving test files at /tmp/dist-test-taskIBBYYP/test-tmp/rpc-test.5.Parameters_TestRpc.TestCallWithChainCertAndChainCA_SSL_TCP.1790260299414177-23957-0
[  FAILED  ] Parameters/TestRpc.TestCallWithChainCertAndChainCA/SSL_TCP, where GetParam() = (true, false) (62 ms)
[ RUN      ] Parameters/TestRpc.TestCallWithPasswordProtectedKey/SSL_TCP
I20260924 14:31:40.801764 24020 acceptor_pool.cc:254] collecting diagnostics on the listening RPC socket 0.0.0.0:44161 every 8 connection(s)
I20260924 14:31:40.802502 24021 acceptor_pool.cc:254] collecting diagnostics on the listening RPC socket 0.0.0.0:44161 every 8 connection(s)
[       OK ] Parameters/TestRpc.TestCallWithPasswordProtectedKey/SSL_TCP (78 ms)
[ RUN      ] Parameters/TestRpc.TestCallToBadServer/SSL_TCP
I20260924 14:31:40.874612 23957 rpc-test.cc:394] Status: Network error: Client connection negotiation failed: client connection to 0.0.0.0:0: connect: Connection refused (error 111)
I20260924 14:31:40.876171 23957 rpc-test.cc:394] Status: Network error: Client connection negotiation failed: client connection to 0.0.0.0:0: connect: Connection refused (error 111)
I20260924 14:31:40.877656 23957 rpc-test.cc:394] Status: Network error: Client connection negotiation failed: client connection to 0.0.0.0:0: connect: Connection refused (error 111)
I20260924 14:31:40.879365 23957 rpc-test.cc:394] Status: Network error: Client connection negotiation failed: client connection to 0.0.0.0:0: connect: Connection refused (error 111)
I20260924 14:31:40.881310 23957 rpc-test.cc:394] Status: Network error: Client connection negotiation failed: client connection to 0.0.0.0:0: connect: Connection refused (error 111)
[       OK ] Parameters/TestRpc.TestCallToBadServer/SSL_TCP (25 ms)
[ RUN      ] Parameters/TestRpc.TestWrongService/SSL_TCP
I20260924 14:31:40.908543 24055 acceptor_pool.cc:254] collecting diagnostics on the listening RPC socket 0.0.0.0:34409 every 8 connection(s)
I20260924 14:31:40.909613 24056 acceptor_pool.cc:254] collecting diagnostics on the listening RPC socket 0.0.0.0:34409 every 8 connection(s)
I20260924 14:31:40.953975 24054 messenger.cc:345] service WrongServiceName not registered on TestServer
[       OK ] Parameters/TestRpc.TestWrongService/SSL_TCP (78 ms)
[ RUN      ] Parameters/TestRpc.TestConnectionKeepalive/SSL_TCP
I20260924 14:31:40.993887 24078 acceptor_pool.cc:254] collecting diagnostics on the listening RPC socket 0.0.0.0:44349 every 8 connection(s)
I20260924 14:31:40.994634 24079 acceptor_pool.cc:254] collecting diagnostics on the listening RPC socket 0.0.0.0:44349 every 8 connection(s)
I20260924 14:31:40.997994 23957 rpc-test.cc:488] Connecting to 0.0.0.0:44349
[       OK ] Parameters/TestRpc.TestConnectionKeepalive/SSL_TCP (1097 ms)
[ RUN      ] Parameters/TestRpc.TestClientConnectionMetrics/SSL_TCP
I20260924 14:31:42.083150 24103 acceptor_pool.cc:254] collecting diagnostics on the listening RPC socket 0.0.0.0:41969 every 8 connection(s)
I20260924 14:31:42.083938 24104 acceptor_pool.cc:254] collecting diagnostics on the listening RPC socket 0.0.0.0:41969 every 8 connection(s)
I20260924 14:31:42.087267 23957 rpc-test.cc:569] Connecting to 0.0.0.0:41969
[       OK ] Parameters/TestRpc.TestClientConnectionMetrics/SSL_TCP (121606 ms)
[ RUN      ] Parameters/TestRpc.TestCredentialsPolicy/SSL_TCP
I20260924 14:33:43.693455 24138 acceptor_pool.cc:254] collecting diagnostics on the listening RPC socket 0.0.0.0:34703 every 8 connection(s)
I20260924 14:33:43.694311 24139 acceptor_pool.cc:254] collecting diagnostics on the listening RPC socket 0.0.0.0:34703 every 8 connection(s)
I20260924 14:33:43.697650 23957 rpc-test.cc:700] Connecting to 0.0.0.0:34703
[       OK ] Parameters/TestRpc.TestCredentialsPolicy/SSL_TCP (108 ms)
[ RUN      ] Parameters/TestRpc.TestCallLongerThanKeepalive/SSL_TCP
I20260924 14:33:43.797801 24163 acceptor_pool.cc:254] collecting diagnostics on the listening RPC socket 0.0.0.0:34775 every 8 connection(s)
I20260924 14:33:43.798539 24164 acceptor_pool.cc:254] collecting diagnostics on the listening RPC socket 0.0.0.0:34775 every 8 connection(s)
I20260924 14:33:43.829957 24167 rpc-test-base.h:222] got call: sleep_micros: 3000000 deferred: true
I20260924 14:33:46.834517 24167 rpcz_store.cc:275] Call kudu.rpc.GenericCalculatorService.Sleep from 127.0.0.1:58656 (request call id 0) took 3004 ms. Trace:
I20260924 14:33:46.834918 24167 rpcz_store.cc:276] 0924 14:33:43.829652 (+     0us) service_pool.cc:170] Inserting onto call queue
0924 14:33:43.829804 (+   152us) service_pool.cc:227] Handling call
0924 14:33:46.834458 (+3004654us) inbound_call.cc:173] Queueing success response
Metrics: {}
[       OK ] Parameters/TestRpc.TestCallLongerThanKeepalive/SSL_TCP (3068 ms)
[ RUN      ] Parameters/TestRpc.TestRpcSidecar/SSL_TCP
I20260924 14:33:46.885433 24188 acceptor_pool.cc:254] collecting diagnostics on the listening RPC socket 0.0.0.0:42111 every 8 connection(s)
I20260924 14:33:46.886258 24189 acceptor_pool.cc:254] collecting diagnostics on the listening RPC socket 0.0.0.0:42111 every 8 connection(s)
[       OK ] Parameters/TestRpc.TestRpcSidecar/SSL_TCP (565 ms)
[ RUN      ] Parameters/TestRpc.TestRpcSidecarLimits/SSL_TCP
I20260924 14:34:03.955647 24215 acceptor_pool.cc:254] collecting diagnostics on the listening RPC socket 0.0.0.0:37085 every 8 connection(s)
I20260924 14:34:03.956452 24216 acceptor_pool.cc:254] collecting diagnostics on the listening RPC socket 0.0.0.0:37085 every 8 connection(s)
W20260924 14:34:03.979030 23957 serialization.cc:72] Serialized kudu.rpc_test.PushStringsRequestPB (2147483654 bytes) is larger than the maximum configured RPC message size (52428800 bytes). Sending anyway, but peer may reject the data.
W20260924 14:34:03.992074 24212 connection.cc:535] server connection from 127.0.0.1:53088 recv error: Network error: RPC frame had a length of 2147483714, but we only support messages up to 52428800 bytes long.
W20260924 14:34:03.992535 24212 connection.cc:158] shutting down server connection from 127.0.0.1:53088 with pending inbound data: 4/2147483714 bytes received; last active 0 ns ago: status Network error: RPC frame had a length of 2147483714, but we only support messages up to 52428800 bytes long.
W20260924 14:34:03.993744 24228 connection.cc:698] client connection to 0.0.0.0:37085 send error: Network error: failed to write to TLS socket: Connection reset by peer
W20260924 14:34:03.994423 24228 connection.cc:196] Error closing socket: Network error: TlsSocket::Close: Success
[       OK ] Parameters/TestRpc.TestRpcSidecarLimits/SSL_TCP (17231 ms)
[ RUN      ] Parameters/TestRpc.TestCallTimeoutDoesntAffectNegotiation/SSL_TCP
I20260924 14:34:04.685035 24240 acceptor_pool.cc:254] collecting diagnostics on the listening RPC socket 0.0.0.0:35245 every 8 connection(s)
I20260924 14:34:04.685782 24241 acceptor_pool.cc:254] collecting diagnostics on the listening RPC socket 0.0.0.0:35245 every 8 connection(s)
W20260924 14:34:04.712237 24236 negotiation.cc:266] Injecting 500ms delay in negotiation
I20260924 14:34:04.762826 23957 rpc-test-base.h:595] status: Timed out: connection negotiation to 0.0.0.0:35245 for RPC Sleep timed out after 0.050s (ON_OUTBOUND_QUEUE), seconds elapsed: 0.0517243
[       OK ] Parameters/TestRpc.TestCallTimeoutDoesntAffectNegotiation/SSL_TCP (587 ms)
[ RUN      ] Parameters/TestRpc.TestRpcHandlerLatencyMetric/SSL_TCP
I20260924 14:34:05.275161 24265 acceptor_pool.cc:254] collecting diagnostics on the listening RPC socket 0.0.0.0:34269 every 8 connection(s)
I20260924 14:34:05.275872 24266 acceptor_pool.cc:254] collecting diagnostics on the listening RPC socket 0.0.0.0:34269 every 8 connection(s)
I20260924 14:34:05.339639 23957 rpc-test.cc:1236] Sleep() min lat: 21869
I20260924 14:34:05.339866 23957 rpc-test.cc:1237] Sleep() mean lat: 21869
I20260924 14:34:05.340000 23957 rpc-test.cc:1238] Sleep() max lat: 21869
I20260924 14:34:05.340130 23957 rpc-test.cc:1239] Sleep() #calls: 1
[       OK ] Parameters/TestRpc.TestRpcHandlerLatencyMetric/SSL_TCP (118 ms)
[ RUN      ] Parameters/TestRpc.TimedOutOnResponseMetricServiceQueue/SSL_TCP
I20260924 14:34:05.372411 24291 acceptor_pool.cc:254] collecting diagnostics on the listening RPC socket 0.0.0.0:45589 every 8 connection(s)
I20260924 14:34:05.373160 24292 acceptor_pool.cc:254] collecting diagnostics on the listening RPC socket 0.0.0.0:45589 every 8 connection(s)
W20260924 14:34:05.451434 24293 rpcz_store.cc:267] Call kudu.rpc_test.CalculatorService.Sleep from 127.0.0.1:60750 (request call id 2) took 20 ms (client timeout 20 ms). Trace:
W20260924 14:34:05.451859 24293 rpcz_store.cc:269] 0924 14:34:05.430891 (+     0us) service_pool.cc:170] Inserting onto call queue
0924 14:34:05.451282 (+ 20391us) service_pool.cc:214] Skipping call since client already timed out
0924 14:34:05.451375 (+    93us) inbound_call.cc:173] Queueing failure response
Metrics: {}
[       OK ] Parameters/TestRpc.TimedOutOnResponseMetricServiceQueue/SSL_TCP (109 ms)
[ RUN      ] Parameters/TestRpc.RpcPendingConnectionsMetric/SSL_TCP
I20260924 14:34:05.470343 24314 acceptor_pool.cc:254] collecting diagnostics on the listening RPC socket 0.0.0.0:39177 every 8 connection(s)
I20260924 14:34:05.471087 24315 acceptor_pool.cc:254] collecting diagnostics on the listening RPC socket 0.0.0.0:39177 every 8 connection(s)
W20260924 14:34:05.476366 24310 negotiation.cc:337] Failed RPC negotiation. Trace:
0924 14:34:05.475051 (+     0us) reactor.cc:625] Submitting negotiation task for server connection from 127.0.0.1:39908 (local address 127.0.0.1:39177)
0924 14:34:05.475476 (+   425us) server_negotiation.cc:206] Beginning negotiation
0924 14:34:05.475495 (+    19us) server_negotiation.cc:399] Waiting for connection header
0924 14:34:05.475766 (+   271us) negotiation.cc:327] Negotiation complete: Network error: Server connection negotiation failed: server connection from 127.0.0.1:39908: BlockingRecv error: recv got EOF from 127.0.0.1:39908 (error 108)
Metrics: {"server-negotiator.queue_time_us":107}
[       OK ] Parameters/TestRpc.RpcPendingConnectionsMetric/SSL_TCP (30 ms)
[ RUN      ] Parameters/TestRpc.TestRpcContextClientDeadline/SSL_TCP
I20260924 14:34:05.508144 24330 acceptor_pool.cc:254] collecting diagnostics on the listening RPC socket 0.0.0.0:41633 every 8 connection(s)
I20260924 14:34:05.508834 24331 acceptor_pool.cc:254] collecting diagnostics on the listening RPC socket 0.0.0.0:41633 every 8 connection(s)
[       OK ] Parameters/TestRpc.TestRpcContextClientDeadline/SSL_TCP (90 ms)
[ RUN      ] Parameters/TestRpc.TestApplicationFeatureFlagUnsupportedServer/SSL_TCP
I20260924 14:34:05.605028 24355 acceptor_pool.cc:254] collecting diagnostics on the listening RPC socket 0.0.0.0:46063 every 8 connection(s)
I20260924 14:34:05.605790 24356 acceptor_pool.cc:254] collecting diagnostics on the listening RPC socket 0.0.0.0:46063 every 8 connection(s)
[       OK ] Parameters/TestRpc.TestApplicationFeatureFlagUnsupportedServer/SSL_TCP (67 ms)
[ RUN      ] Parameters/TestRpc.TestCancellationAsync/SSL_TCP
I20260924 14:34:05.668674 24380 acceptor_pool.cc:254] collecting diagnostics on the listening RPC socket 0.0.0.0:44033 every 8 connection(s)
I20260924 14:34:05.669375 24381 acceptor_pool.cc:254] collecting diagnostics on the listening RPC socket 0.0.0.0:44033 every 8 connection(s)
I20260924 14:34:05.673013 23957 rpc-test.cc:1716] Connecting to 0.0.0.0:44033
I20260924 14:34:05.689774 23957 test_util.cc:268] Using random seed: 2112599959
I20260924 14:34:05.931598 24384 rpc-test-base.h:240] got call: sleep_micros: 500 pattern: 4294967295 num_repetitions: 2097152 sidecar_idx: 0
I20260924 14:34:06.096067 24383 rpc-test-base.h:240] got call: sleep_micros: 500 pattern: 4294967295 num_repetitions: 2097152 sidecar_idx: 0
I20260924 14:34:06.292184 24384 rpc-test-base.h:240] got call: sleep_micros: 500 pattern: 4294967295 num_repetitions: 2097152 sidecar_idx: 0
I20260924 14:34:06.474787 24383 rpc-test-base.h:240] got call: sleep_micros: 500 pattern: 4294967295 num_repetitions: 2097152 sidecar_idx: 0
I20260924 14:34:06.654711 24384 rpc-test-base.h:240] got call: sleep_micros: 500 pattern: 4294967295 num_repetitions: 2097152 sidecar_idx: 0
I20260924 14:34:06.834129 24384 rpc-test-base.h:240] got call: sleep_micros: 500 pattern: 4294967295 num_repetitions: 2097152 sidecar_idx: 0
I20260924 14:34:07.012081 24384 rpc-test-base.h:240] got call: sleep_micros: 500 pattern: 4294967295 num_repetitions: 2097152 sidecar_idx: 0
I20260924 14:34:07.191107 24384 rpc-test-base.h:240] got call: sleep_micros: 500 pattern: 4294967295 num_repetitions: 2097152 sidecar_idx: 0
W20260924 14:34:07.351040 24377 connection.cc:196] Error closing socket: Network error: TlsSocket::Close: Broken pipe
W20260924 14:34:07.395377 24377 connection.cc:441] server connection from 127.0.0.1:56174 torn down before Call kudu.rpc.GenericCalculatorService.SleepWithSidecar from 127.0.0.1:56174 (request call id 8) could send its response
[       OK ] Parameters/TestRpc.TestCancellationAsync/SSL_TCP (1757 ms)
[ RUN      ] Parameters/TestRpc.TestPerformanceBySocketType/SSL_TCP
I20260924 14:34:07.496995 24405 acceptor_pool.cc:254] collecting diagnostics on the listening RPC socket 0.0.0.0:34215 every 8 connection(s)
I20260924 14:34:07.497702 24406 acceptor_pool.cc:254] collecting diagnostics on the listening RPC socket 0.0.0.0:34215 every 8 connection(s)
I20260924 14:34:07.500883 23957 rpc-test.cc:1846] Connecting to 0.0.0.0:34215
I20260924 14:34:27.230504 23957 rpc-test.cc:1859] Sending 1024MB via ssl-enabled tcp socket: real 19.709s	user 17.408s	sys 11.130s
I20260924 14:34:46.693151 23957 rpc-test.cc:1859] Sending 1024MB via ssl-enabled tcp socket: real 19.462s	user 17.171s	sys 10.970s
I20260924 14:35:06.426757 23957 rpc-test.cc:1859] Sending 1024MB via ssl-enabled tcp socket: real 19.733s	user 17.053s	sys 11.495s
I20260924 14:35:25.976238 23957 rpc-test.cc:1859] Sending 1024MB via ssl-enabled tcp socket: real 19.549s	user 17.246s	sys 11.081s
I20260924 14:35:45.535080 23957 rpc-test.cc:1859] Sending 1024MB via ssl-enabled tcp socket: real 19.558s	user 17.244s	sys 10.965s
[       OK ] Parameters/TestRpc.TestPerformanceBySocketType/SSL_TCP (98146 ms)
[----------] 20 tests from Parameters/TestRpc (246083 ms total)

[----------] 1 test from Parameters/TestRpcSocketTxRxQueue
[ RUN      ] Parameters/TestRpcSocketTxRxQueue.OverCapacity/0
W20260924 14:35:45.995604 24459 negotiation.cc:337] Failed RPC negotiation. Trace:
0924 14:35:45.591000 (+     0us) reactor.cc:625] Submitting negotiation task for client connection to 0.0.0.0:46085 (local address 127.0.0.1:37326)
0924 14:35:45.591589 (+   589us) negotiation.cc:107] Waiting for socket to connect
0924 14:35:45.591631 (+    42us) client_negotiation.cc:174] Beginning negotiation
0924 14:35:45.591906 (+   275us) client_negotiation.cc:252] Sending NEGOTIATE NegotiatePB request
0924 14:35:45.994433 (+402527us) negotiation.cc:327] Negotiation complete: Network error: Client connection negotiation failed: client connection to 0.0.0.0:46085: BlockingRecv error: recv error from unknown peer: Transport endpoint is not connected (error 107)
Metrics: {"client-negotiator.queue_time_us":141}
W20260924 14:35:45.995668 24441 negotiation.cc:337] Failed RPC negotiation. Trace:
0924 14:35:45.569550 (+     0us) reactor.cc:625] Submitting negotiation task for client connection to 0.0.0.0:46085 (local address 127.0.0.1:37308)
0924 14:35:45.570092 (+   542us) negotiation.cc:107] Waiting for socket to connect
0924 14:35:45.570123 (+    31us) client_negotiation.cc:174] Beginning negotiation
0924 14:35:45.570327 (+   204us) client_negotiation.cc:252] Sending NEGOTIATE NegotiatePB request
0924 14:35:45.994473 (+424146us) negotiation.cc:327] Negotiation complete: Network error: Client connection negotiation failed: client connection to 0.0.0.0:46085: BlockingRecv error: recv error from unknown peer: Transport endpoint is not connected (error 107)
Metrics: {"client-negotiator.queue_time_us":143}
W20260924 14:35:45.995659 24432 negotiation.cc:337] Failed RPC negotiation. Trace:
0924 14:35:45.562611 (+     0us) reactor.cc:625] Submitting negotiation task for client connection to 0.0.0.0:46085 (local address 127.0.0.1:37292)
0924 14:35:45.563304 (+   693us) negotiation.cc:107] Waiting for socket to connect
0924 14:35:45.563344 (+    40us) client_negotiation.cc:174] Beginning negotiation
0924 14:35:45.563818 (+   474us) client_negotiation.cc:252] Sending NEGOTIATE NegotiatePB request
0924 14:35:45.994403 (+430585us) negotiation.cc:327] Negotiation complete: Network error: Client connection negotiation failed: client connection to 0.0.0.0:46085: BlockingRecv error: recv error from unknown peer: Transport endpoint is not connected (error 107)
Metrics: {"client-negotiator.queue_time_us":175}
W20260924 14:35:45.998929 24477 negotiation.cc:337] Failed RPC negotiation. Trace:
0924 14:35:45.616267 (+     0us) reactor.cc:625] Submitting negotiation task for client connection to 0.0.0.0:46085 (local address 127.0.0.1:35702)
0924 14:35:45.616827 (+   560us) negotiation.cc:107] Waiting for socket to connect
0924 14:35:45.616858 (+    31us) client_negotiation.cc:174] Beginning negotiation
0924 14:35:45.617074 (+   216us) client_negotiation.cc:252] Sending NEGOTIATE NegotiatePB request
0924 14:35:45.996180 (+379106us) negotiation.cc:327] Negotiation complete: Network error: Client connection negotiation failed: client connection to 0.0.0.0:46085: BlockingRecv error: recv error from unknown peer: Transport endpoint is not connected (error 107)
Metrics: {"client-negotiator.queue_time_us":149}
W20260924 14:35:45.998973 24450 negotiation.cc:337] Failed RPC negotiation. Trace:
0924 14:35:45.577071 (+     0us) reactor.cc:625] Submitting negotiation task for client connection to 0.0.0.0:46085 (local address 127.0.0.1:37324)
0924 14:35:45.577618 (+   547us) negotiation.cc:107] Waiting for socket to connect
0924 14:35:45.577650 (+    32us) client_negotiation.cc:174] Beginning negotiation
0924 14:35:45.577844 (+   194us) client_negotiation.cc:252] Sending NEGOTIATE NegotiatePB request
0924 14:35:45.994442 (+416598us) negotiation.cc:327] Negotiation complete: Network error: Client connection negotiation failed: client connection to 0.0.0.0:46085: BlockingRecv error: recv error from unknown peer: Transport endpoint is not connected (error 107)
Metrics: {"client-negotiator.queue_time_us":144}
W20260924 14:35:45.999094 24468 negotiation.cc:337] Failed RPC negotiation. Trace:
0924 14:35:45.603608 (+     0us) reactor.cc:625] Submitting negotiation task for client connection to 0.0.0.0:46085 (local address 127.0.0.1:35686)
0924 14:35:45.604160 (+   552us) negotiation.cc:107] Waiting for socket to connect
0924 14:35:45.604192 (+    32us) client_negotiation.cc:174] Beginning negotiation
0924 14:35:45.604394 (+   202us) client_negotiation.cc:252] Sending NEGOTIATE NegotiatePB request
0924 14:35:45.996279 (+391885us) negotiation.cc:327] Negotiation complete: Network error: Client connection negotiation failed: client connection to 0.0.0.0:46085: BlockingRecv error: recv error from unknown peer: Transport endpoint is not connected (error 107)
Metrics: {"client-negotiator.queue_time_us":142}
[       OK ] Parameters/TestRpcSocketTxRxQueue.OverCapacity/0 (1234 ms)
[----------] 1 test from Parameters/TestRpcSocketTxRxQueue (1234 ms total)

[----------] Global test environment tear-down
[==========] 21 tests from 2 test suites ran. (247318 ms total)
[  PASSED  ] 20 tests.
[  FAILED  ] 1 test, listed below:
[  FAILED  ] Parameters/TestRpc.TestCallWithChainCertAndChainCA/SSL_TCP, where GetParam() = (true, false)

 1 FAILED TEST