Diagnosed failure

Parameters/TestRpc.TestCallWithChainCertAndChainCA/SSL_TCP: /data0/somelongdirectorytoavoidrpathissues/src/kudu/src/kudu/rpc/rpc-test.cc:270: Failure
Failed
Bad status: Runtime error: could not verify certificate chain (error with cert: subject=CN = localhost, ST = sadfjas, C = AS, emailAddress = sdflkdsajf, O = lskdfjlsad, OU = sldfkja, issuer=C = AS, ST = ASDfkjdhf, L = lskdjf, O = saldfja, OU = skdjf, CN = localhost, emailAddress = sadjflkadsj): : certificate has expired
Google Test trace:
/data0/somelongdirectorytoavoidrpathissues/src/kudu/src/kudu/rpc/rpc-test.cc:267: Connecting to 0.0.0.0:39881
I20260925 22:40:43.294941  1300 test_util.cc:175] -----------------------------------------------
I20260925 22:40:43.294996  1300 test_util.cc:176] Had fatal failures, leaving test files at /tmp/dist-test-taskHaWua_/test-tmp/rpc-test.5.Parameters_TestRpc.TestCallWithChainCertAndChainCA_SSL_TCP.1790376043217204-1300-0

Full log

Note: This is test shard 6 of 8.
[==========] Running 21 tests from 2 test suites.
[----------] Global test environment set-up.
[----------] 20 tests from Parameters/TestRpc
[ RUN      ] Parameters/TestRpc.TestMessengerCreateDestroy/SSL_TCP
WARNING: Logging before InitGoogleLogging() is written to STDERR
I20260925 22:40:43.260107  1300 rpc-test.cc:169] started messenger TestCreateDestroy
[       OK ] Parameters/TestRpc.TestMessengerCreateDestroy/SSL_TCP (37 ms)
[ RUN      ] Parameters/TestRpc.TestNegotiationDeadlock/SSL_TCP
I20260925 22:40:43.271170  1321 acceptor_pool.cc:254] collecting diagnostics on the listening RPC socket 0.0.0.0:36063 every 8 connection(s)
I20260925 22:40:43.271170  1320 acceptor_pool.cc:254] collecting diagnostics on the listening RPC socket 0.0.0.0:36063 every 8 connection(s)
[       OK ] Parameters/TestRpc.TestNegotiationDeadlock/SSL_TCP (19 ms)
[ RUN      ] Parameters/TestRpc.TestCallWithChainCertAndChainCA/SSL_TCP
I20260925 22:40:43.290441  1336 acceptor_pool.cc:254] collecting diagnostics on the listening RPC socket 0.0.0.0:39881 every 8 connection(s)
I20260925 22:40:43.290527  1337 acceptor_pool.cc:254] collecting diagnostics on the listening RPC socket 0.0.0.0:39881 every 8 connection(s)
/data0/somelongdirectorytoavoidrpathissues/src/kudu/src/kudu/rpc/rpc-test.cc:270: Failure
Failed
Bad status: Runtime error: could not verify certificate chain (error with cert: subject=CN = localhost, ST = sadfjas, C = AS, emailAddress = sdflkdsajf, O = lskdfjlsad, OU = sldfkja, issuer=C = AS, ST = ASDfkjdhf, L = lskdjf, O = saldfja, OU = skdjf, CN = localhost, emailAddress = sadjflkadsj): : certificate has expired
Google Test trace:
/data0/somelongdirectorytoavoidrpathissues/src/kudu/src/kudu/rpc/rpc-test.cc:267: Connecting to 0.0.0.0:39881
I20260925 22:40:43.294941  1300 test_util.cc:175] -----------------------------------------------
I20260925 22:40:43.294996  1300 test_util.cc:176] Had fatal failures, leaving test files at /tmp/dist-test-taskHaWua_/test-tmp/rpc-test.5.Parameters_TestRpc.TestCallWithChainCertAndChainCA_SSL_TCP.1790376043217204-1300-0
[  FAILED  ] Parameters/TestRpc.TestCallWithChainCertAndChainCA/SSL_TCP, where GetParam() = (true, false) (13 ms)
[ RUN      ] Parameters/TestRpc.TestCallWithPasswordProtectedKey/SSL_TCP
I20260925 22:40:43.320048  1361 acceptor_pool.cc:254] collecting diagnostics on the listening RPC socket 0.0.0.0:36295 every 8 connection(s)
I20260925 22:40:43.320073  1362 acceptor_pool.cc:254] collecting diagnostics on the listening RPC socket 0.0.0.0:36295 every 8 connection(s)
[       OK ] Parameters/TestRpc.TestCallWithPasswordProtectedKey/SSL_TCP (39 ms)
[ RUN      ] Parameters/TestRpc.TestCallToBadServer/SSL_TCP
I20260925 22:40:43.343446  1300 rpc-test.cc:394] Status: Network error: Client connection negotiation failed: client connection to 0.0.0.0:0: connect: Connection refused (error 111)
I20260925 22:40:43.343802  1300 rpc-test.cc:394] Status: Network error: Client connection negotiation failed: client connection to 0.0.0.0:0: connect: Connection refused (error 111)
I20260925 22:40:43.344110  1300 rpc-test.cc:394] Status: Network error: Client connection negotiation failed: client connection to 0.0.0.0:0: connect: Connection refused (error 111)
I20260925 22:40:43.344449  1300 rpc-test.cc:394] Status: Network error: Client connection negotiation failed: client connection to 0.0.0.0:0: connect: Connection refused (error 111)
I20260925 22:40:43.344770  1300 rpc-test.cc:394] Status: Network error: Client connection negotiation failed: client connection to 0.0.0.0:0: connect: Connection refused (error 111)
[       OK ] Parameters/TestRpc.TestCallToBadServer/SSL_TCP (11 ms)
[ RUN      ] Parameters/TestRpc.TestWrongService/SSL_TCP
I20260925 22:40:43.360383  1396 acceptor_pool.cc:254] collecting diagnostics on the listening RPC socket 0.0.0.0:36109 every 8 connection(s)
I20260925 22:40:43.360424  1397 acceptor_pool.cc:254] collecting diagnostics on the listening RPC socket 0.0.0.0:36109 every 8 connection(s)
I20260925 22:40:43.374640  1393 messenger.cc:345] service WrongServiceName not registered on TestServer
[       OK ] Parameters/TestRpc.TestWrongService/SSL_TCP (31 ms)
[ RUN      ] Parameters/TestRpc.TestConnectionKeepalive/SSL_TCP
I20260925 22:40:43.386948  1419 acceptor_pool.cc:254] collecting diagnostics on the listening RPC socket 0.0.0.0:38465 every 8 connection(s)
I20260925 22:40:43.386981  1420 acceptor_pool.cc:254] collecting diagnostics on the listening RPC socket 0.0.0.0:38465 every 8 connection(s)
I20260925 22:40:43.387215  1300 rpc-test.cc:488] Connecting to 0.0.0.0:38465
[       OK ] Parameters/TestRpc.TestConnectionKeepalive/SSL_TCP (1034 ms)
[ RUN      ] Parameters/TestRpc.TestClientConnectionMetrics/SSL_TCP
I20260925 22:40:44.421403  1444 acceptor_pool.cc:254] collecting diagnostics on the listening RPC socket 0.0.0.0:39233 every 8 connection(s)
I20260925 22:40:44.421470  1445 acceptor_pool.cc:254] collecting diagnostics on the listening RPC socket 0.0.0.0:39233 every 8 connection(s)
I20260925 22:40:44.421691  1300 rpc-test.cc:569] Connecting to 0.0.0.0:39233
[       OK ] Parameters/TestRpc.TestClientConnectionMetrics/SSL_TCP (13922 ms)
[ RUN      ] Parameters/TestRpc.TestCredentialsPolicy/SSL_TCP
I20260925 22:40:58.344866  1467 acceptor_pool.cc:254] collecting diagnostics on the listening RPC socket 0.0.0.0:46093 every 8 connection(s)
I20260925 22:40:58.344931  1468 acceptor_pool.cc:254] collecting diagnostics on the listening RPC socket 0.0.0.0:46093 every 8 connection(s)
I20260925 22:40:58.345160  1300 rpc-test.cc:700] Connecting to 0.0.0.0:46093
[       OK ] Parameters/TestRpc.TestCredentialsPolicy/SSL_TCP (50 ms)
[ RUN      ] Parameters/TestRpc.TestCallLongerThanKeepalive/SSL_TCP
I20260925 22:40:58.404597  1492 acceptor_pool.cc:254] collecting diagnostics on the listening RPC socket 0.0.0.0:41553 every 8 connection(s)
I20260925 22:40:58.404614  1493 acceptor_pool.cc:254] collecting diagnostics on the listening RPC socket 0.0.0.0:41553 every 8 connection(s)
I20260925 22:40:58.413893  1496 rpc-test-base.h:222] got call: sleep_micros: 3000000 deferred: true
I20260925 22:41:01.414894  1496 rpcz_store.cc:275] Call kudu.rpc.GenericCalculatorService.Sleep from 127.0.0.1:39846 (request call id 0) took 3001 ms. Trace:
I20260925 22:41:01.415019  1496 rpcz_store.cc:276] 0925 22:40:58.413817 (+     0us) service_pool.cc:170] Inserting onto call queue
0925 22:40:58.413869 (+    52us) service_pool.cc:227] Handling call
0925 22:41:01.414873 (+3001004us) inbound_call.cc:173] Queueing success response
Metrics: {}
[       OK ] Parameters/TestRpc.TestCallLongerThanKeepalive/SSL_TCP (3033 ms)
[ RUN      ] Parameters/TestRpc.TestRpcSidecar/SSL_TCP
I20260925 22:41:01.423672  1517 acceptor_pool.cc:254] collecting diagnostics on the listening RPC socket 0.0.0.0:34021 every 8 connection(s)
I20260925 22:41:01.423744  1518 acceptor_pool.cc:254] collecting diagnostics on the listening RPC socket 0.0.0.0:34021 every 8 connection(s)
[       OK ] Parameters/TestRpc.TestRpcSidecar/SSL_TCP (65 ms)
[ RUN      ] Parameters/TestRpc.TestRpcSidecarLimits/SSL_TCP
I20260925 22:41:03.161787  1543 acceptor_pool.cc:254] collecting diagnostics on the listening RPC socket 0.0.0.0:34983 every 8 connection(s)
I20260925 22:41:03.161867  1542 acceptor_pool.cc:254] collecting diagnostics on the listening RPC socket 0.0.0.0:34983 every 8 connection(s)
W20260925 22:41:03.168119  1300 serialization.cc:72] Serialized kudu.rpc_test.PushStringsRequestPB (2147483654 bytes) is larger than the maximum configured RPC message size (52428800 bytes). Sending anyway, but peer may reject the data.
W20260925 22:41:03.172235  1539 connection.cc:535] server connection from 127.0.0.1:56448 recv error: Network error: RPC frame had a length of 2147483714, but we only support messages up to 52428800 bytes long.
W20260925 22:41:03.172336  1539 connection.cc:158] shutting down server connection from 127.0.0.1:56448 with pending inbound data: 4/2147483714 bytes received; last active 0 ns ago: status Network error: RPC frame had a length of 2147483714, but we only support messages up to 52428800 bytes long.
W20260925 22:41:03.172642  1555 connection.cc:196] Error closing socket: Network error: TlsSocket::Close: Connection reset by peer
I20260925 22:41:03.180851  1567 acceptor_pool.cc:254] collecting diagnostics on the listening RPC socket 0.0.0.0:42499 every 8 connection(s)
I20260925 22:41:03.180866  1568 acceptor_pool.cc:254] collecting diagnostics on the listening RPC socket 0.0.0.0:42499 every 8 connection(s)
W20260925 22:41:07.389340  1566 connection.cc:577] server connection from 127.0.0.1:58878: received bad data: 'Corruption: Invalid packet: message had a length of 2147483710, but we only support messages up to 2147483647 bytes
'
[       OK ] Parameters/TestRpc.TestRpcSidecarLimits/SSL_TCP (5908 ms)
[ RUN      ] Parameters/TestRpc.TestCallTimeoutDoesntAffectNegotiation/SSL_TCP
I20260925 22:41:07.410024  1592 acceptor_pool.cc:254] collecting diagnostics on the listening RPC socket 0.0.0.0:45977 every 8 connection(s)
I20260925 22:41:07.410048  1593 acceptor_pool.cc:254] collecting diagnostics on the listening RPC socket 0.0.0.0:45977 every 8 connection(s)
W20260925 22:41:07.432900  1588 negotiation.cc:266] Injecting 500ms delay in negotiation
I20260925 22:41:07.483234  1300 rpc-test-base.h:595] status: Timed out: connection negotiation to 0.0.0.0:45977 for RPC Sleep timed out after 0.050s (ON_OUTBOUND_QUEUE), seconds elapsed: 0.0508289
[       OK ] Parameters/TestRpc.TestCallTimeoutDoesntAffectNegotiation/SSL_TCP (546 ms)
[ RUN      ] Parameters/TestRpc.TestRpcHandlerLatencyMetric/SSL_TCP
I20260925 22:41:07.958705  1617 acceptor_pool.cc:254] collecting diagnostics on the listening RPC socket 0.0.0.0:40537 every 8 connection(s)
I20260925 22:41:07.958736  1618 acceptor_pool.cc:254] collecting diagnostics on the listening RPC socket 0.0.0.0:40537 every 8 connection(s)
I20260925 22:41:07.998250  1300 rpc-test.cc:1236] Sleep() min lat: 20468
I20260925 22:41:07.998332  1300 rpc-test.cc:1237] Sleep() mean lat: 20468
I20260925 22:41:07.998361  1300 rpc-test.cc:1238] Sleep() max lat: 20468
I20260925 22:41:07.998373  1300 rpc-test.cc:1239] Sleep() #calls: 1
[       OK ] Parameters/TestRpc.TestRpcHandlerLatencyMetric/SSL_TCP (61 ms)
[ RUN      ] Parameters/TestRpc.TimedOutOnResponseMetricServiceQueue/SSL_TCP
I20260925 22:41:08.019390  1643 acceptor_pool.cc:254] collecting diagnostics on the listening RPC socket 0.0.0.0:34855 every 8 connection(s)
I20260925 22:41:08.019426  1644 acceptor_pool.cc:254] collecting diagnostics on the listening RPC socket 0.0.0.0:34855 every 8 connection(s)
W20260925 22:41:08.102430  1645 rpcz_store.cc:267] Call kudu.rpc_test.CalculatorService.Sleep from 127.0.0.1:57002 (request call id 2) took 20 ms (client timeout 20 ms). Trace:
W20260925 22:41:08.102564  1645 rpcz_store.cc:269] 0925 22:41:08.082042 (+     0us) service_pool.cc:170] Inserting onto call queue
0925 22:41:08.102376 (+ 20334us) service_pool.cc:214] Skipping call since client already timed out
0925 22:41:08.102410 (+    34us) inbound_call.cc:173] Queueing failure response
Metrics: {}
[       OK ] Parameters/TestRpc.TimedOutOnResponseMetricServiceQueue/SSL_TCP (103 ms)
[ RUN      ] Parameters/TestRpc.RpcPendingConnectionsMetric/SSL_TCP
I20260925 22:41:08.106566  1666 acceptor_pool.cc:254] collecting diagnostics on the listening RPC socket 0.0.0.0:37833 every 8 connection(s)
I20260925 22:41:08.106627  1667 acceptor_pool.cc:254] collecting diagnostics on the listening RPC socket 0.0.0.0:37833 every 8 connection(s)
W20260925 22:41:08.115674  1662 negotiation.cc:337] Failed RPC negotiation. Trace:
0925 22:41:08.115165 (+     0us) reactor.cc:625] Submitting negotiation task for server connection from 127.0.0.1:50628 (local address 127.0.0.1:37833)
0925 22:41:08.115302 (+   137us) server_negotiation.cc:206] Beginning negotiation
0925 22:41:08.115306 (+     4us) server_negotiation.cc:399] Waiting for connection header
0925 22:41:08.115411 (+   105us) negotiation.cc:327] Negotiation complete: Network error: Server connection negotiation failed: server connection from 127.0.0.1:50628: BlockingRecv error: recv got EOF from 127.0.0.1:50628 (error 108)
Metrics: {"server-negotiator.queue_time_us":35}
[       OK ] Parameters/TestRpc.RpcPendingConnectionsMetric/SSL_TCP (24 ms)
[ RUN      ] Parameters/TestRpc.TestRpcContextClientDeadline/SSL_TCP
I20260925 22:41:08.139176  1682 acceptor_pool.cc:254] collecting diagnostics on the listening RPC socket 0.0.0.0:46469 every 8 connection(s)
I20260925 22:41:08.139190  1683 acceptor_pool.cc:254] collecting diagnostics on the listening RPC socket 0.0.0.0:46469 every 8 connection(s)
[       OK ] Parameters/TestRpc.TestRpcContextClientDeadline/SSL_TCP (67 ms)
[ RUN      ] Parameters/TestRpc.TestApplicationFeatureFlagUnsupportedServer/SSL_TCP
I20260925 22:41:08.208485  1707 acceptor_pool.cc:254] collecting diagnostics on the listening RPC socket 0.0.0.0:40089 every 8 connection(s)
I20260925 22:41:08.208493  1708 acceptor_pool.cc:254] collecting diagnostics on the listening RPC socket 0.0.0.0:40089 every 8 connection(s)
[       OK ] Parameters/TestRpc.TestApplicationFeatureFlagUnsupportedServer/SSL_TCP (36 ms)
[ RUN      ] Parameters/TestRpc.TestCancellationAsync/SSL_TCP
I20260925 22:41:08.249696  1732 acceptor_pool.cc:254] collecting diagnostics on the listening RPC socket 0.0.0.0:35687 every 8 connection(s)
I20260925 22:41:08.249723  1733 acceptor_pool.cc:254] collecting diagnostics on the listening RPC socket 0.0.0.0:35687 every 8 connection(s)
I20260925 22:41:08.249963  1300 rpc-test.cc:1716] Connecting to 0.0.0.0:35687
I20260925 22:41:08.269744  1300 test_util.cc:268] Using random seed: 1771062955
I20260925 22:41:08.294005  1736 rpc-test-base.h:240] got call: sleep_micros: 500 pattern: 4294967295 num_repetitions: 2097152 sidecar_idx: 0
I20260925 22:41:08.311419  1735 rpc-test-base.h:240] got call: sleep_micros: 500 pattern: 4294967295 num_repetitions: 2097152 sidecar_idx: 0
I20260925 22:41:08.330972  1736 rpc-test-base.h:240] got call: sleep_micros: 500 pattern: 4294967295 num_repetitions: 2097152 sidecar_idx: 0
I20260925 22:41:08.349640  1735 rpc-test-base.h:240] got call: sleep_micros: 500 pattern: 4294967295 num_repetitions: 2097152 sidecar_idx: 0
I20260925 22:41:08.369724  1736 rpc-test-base.h:240] got call: sleep_micros: 500 pattern: 4294967295 num_repetitions: 2097152 sidecar_idx: 0
I20260925 22:41:08.387997  1735 rpc-test-base.h:240] got call: sleep_micros: 500 pattern: 4294967295 num_repetitions: 2097152 sidecar_idx: 0
W20260925 22:41:08.393719  1729 connection.cc:441] server connection from 127.0.0.1:50368 torn down before Call kudu.rpc.GenericCalculatorService.SleepWithSidecar from 127.0.0.1:50368 (request call id 8) could send its response
W20260925 22:41:08.405447  1729 connection.cc:441] server connection from 127.0.0.1:50368 torn down before Call kudu.rpc.GenericCalculatorService.SleepWithSidecar from 127.0.0.1:50368 (request call id 9) could send its response
[       OK ] Parameters/TestRpc.TestCancellationAsync/SSL_TCP (173 ms)
[ RUN      ] Parameters/TestRpc.TestPerformanceBySocketType/SSL_TCP
I20260925 22:41:08.424202  1757 acceptor_pool.cc:254] collecting diagnostics on the listening RPC socket 0.0.0.0:36507 every 8 connection(s)
I20260925 22:41:08.424229  1758 acceptor_pool.cc:254] collecting diagnostics on the listening RPC socket 0.0.0.0:36507 every 8 connection(s)
I20260925 22:41:08.424466  1300 rpc-test.cc:1846] Connecting to 0.0.0.0:36507
I20260925 22:41:10.606595  1300 rpc-test.cc:1859] Sending 1024MB via ssl-enabled tcp socket: real 2.174s	user 2.237s	sys 1.582s
I20260925 22:41:12.759876  1300 rpc-test.cc:1859] Sending 1024MB via ssl-enabled tcp socket: real 2.153s	user 2.241s	sys 1.545s
I20260925 22:41:14.891820  1300 rpc-test.cc:1859] Sending 1024MB via ssl-enabled tcp socket: real 2.132s	user 2.208s	sys 1.559s
I20260925 22:41:17.083071  1300 rpc-test.cc:1859] Sending 1024MB via ssl-enabled tcp socket: real 2.191s	user 2.431s	sys 1.446s
I20260925 22:41:19.225855  1300 rpc-test.cc:1859] Sending 1024MB via ssl-enabled tcp socket: real 2.143s	user 2.296s	sys 1.466s
[       OK ] Parameters/TestRpc.TestPerformanceBySocketType/SSL_TCP (10821 ms)
[----------] 20 tests from Parameters/TestRpc (36003 ms total)

[----------] 1 test from Parameters/TestRpcSocketTxRxQueue
[ RUN      ] Parameters/TestRpcSocketTxRxQueue.OverCapacity/0
W20260925 22:41:19.496471  1783 negotiation.cc:337] Failed RPC negotiation. Trace:
0925 22:41:19.231498 (+     0us) reactor.cc:625] Submitting negotiation task for client connection to 0.0.0.0:44017 (local address 127.0.0.1:35124)
0925 22:41:19.231595 (+    97us) negotiation.cc:107] Waiting for socket to connect
0925 22:41:19.231605 (+    10us) client_negotiation.cc:174] Beginning negotiation
0925 22:41:19.231680 (+    75us) client_negotiation.cc:252] Sending NEGOTIATE NegotiatePB request
0925 22:41:19.496316 (+264636us) negotiation.cc:327] Negotiation complete: Network error: Client connection negotiation failed: client connection to 0.0.0.0:44017: BlockingRecv error: recv error from unknown peer: Transport endpoint is not connected (error 107)
Metrics: {"client-negotiator.queue_time_us":37}
W20260925 22:41:19.496515  1819 negotiation.cc:337] Failed RPC negotiation. Trace:
0925 22:41:19.235738 (+     0us) reactor.cc:625] Submitting negotiation task for client connection to 0.0.0.0:44017 (local address 127.0.0.1:35164)
0925 22:41:19.235840 (+   102us) negotiation.cc:107] Waiting for socket to connect
0925 22:41:19.235851 (+    11us) client_negotiation.cc:174] Beginning negotiation
0925 22:41:19.235930 (+    79us) client_negotiation.cc:252] Sending NEGOTIATE NegotiatePB request
0925 22:41:19.496425 (+260495us) negotiation.cc:327] Negotiation complete: Network error: Client connection negotiation failed: client connection to 0.0.0.0:44017: BlockingRecv error: recv error from unknown peer: Transport endpoint is not connected (error 107)
Metrics: {"client-negotiator.queue_time_us":41}
W20260925 22:41:19.496526  1774 negotiation.cc:337] Failed RPC negotiation. Trace:
0925 22:41:19.230165 (+     0us) reactor.cc:625] Submitting negotiation task for client connection to 0.0.0.0:44017 (local address 127.0.0.1:35118)
0925 22:41:19.230260 (+    95us) negotiation.cc:107] Waiting for socket to connect
0925 22:41:19.230270 (+    10us) client_negotiation.cc:174] Beginning negotiation
0925 22:41:19.230364 (+    94us) client_negotiation.cc:252] Sending NEGOTIATE NegotiatePB request
0925 22:41:19.496340 (+265976us) negotiation.cc:327] Negotiation complete: Network error: Client connection negotiation failed: client connection to 0.0.0.0:44017: BlockingRecv error: recv error from unknown peer: Transport endpoint is not connected (error 107)
Metrics: {"client-negotiator.queue_time_us":26}
W20260925 22:41:19.496748  1810 negotiation.cc:337] Failed RPC negotiation. Trace:
0925 22:41:19.234719 (+     0us) reactor.cc:625] Submitting negotiation task for client connection to 0.0.0.0:44017 (local address 127.0.0.1:35152)
0925 22:41:19.234796 (+    77us) negotiation.cc:107] Waiting for socket to connect
0925 22:41:19.234806 (+    10us) client_negotiation.cc:174] Beginning negotiation
0925 22:41:19.234877 (+    71us) client_negotiation.cc:252] Sending NEGOTIATE NegotiatePB request
0925 22:41:19.496677 (+261800us) negotiation.cc:327] Negotiation complete: Network error: Client connection negotiation failed: client connection to 0.0.0.0:44017: BlockingRecv error: recv error from unknown peer: Transport endpoint is not connected (error 107)
Metrics: {"client-negotiator.queue_time_us":23}
W20260925 22:41:19.496526  1792 negotiation.cc:337] Failed RPC negotiation. Trace:
0925 22:41:19.232533 (+     0us) reactor.cc:625] Submitting negotiation task for client connection to 0.0.0.0:44017 (local address 127.0.0.1:35136)
0925 22:41:19.232622 (+    89us) negotiation.cc:107] Waiting for socket to connect
0925 22:41:19.232635 (+    13us) client_negotiation.cc:174] Beginning negotiation
0925 22:41:19.232725 (+    90us) client_negotiation.cc:252] Sending NEGOTIATE NegotiatePB request
0925 22:41:19.496340 (+263615us) negotiation.cc:327] Negotiation complete: Network error: Client connection negotiation failed: client connection to 0.0.0.0:44017: BlockingRecv error: recv error from unknown peer: Transport endpoint is not connected (error 107)
Metrics: {"client-negotiator.queue_time_us":23}
W20260925 22:41:19.496951  1801 negotiation.cc:337] Failed RPC negotiation. Trace:
0925 22:41:19.233630 (+     0us) reactor.cc:625] Submitting negotiation task for client connection to 0.0.0.0:44017 (local address 127.0.0.1:35144)
0925 22:41:19.233707 (+    77us) negotiation.cc:107] Waiting for socket to connect
0925 22:41:19.233717 (+    10us) client_negotiation.cc:174] Beginning negotiation
0925 22:41:19.233790 (+    73us) client_negotiation.cc:252] Sending NEGOTIATE NegotiatePB request
0925 22:41:19.496316 (+262526us) negotiation.cc:327] Negotiation complete: Network error: Client connection negotiation failed: client connection to 0.0.0.0:44017: BlockingRecv error: recv error from unknown peer: Transport endpoint is not connected (error 107)
Metrics: {"client-negotiator.queue_time_us":23}
[       OK ] Parameters/TestRpcSocketTxRxQueue.OverCapacity/0 (1046 ms)
[----------] 1 test from Parameters/TestRpcSocketTxRxQueue (1046 ms total)

[----------] Global test environment tear-down
[==========] 21 tests from 2 test suites ran. (37050 ms total)
[  PASSED  ] 20 tests.
[  FAILED  ] 1 test, listed below:
[  FAILED  ] Parameters/TestRpc.TestCallWithChainCertAndChainCA/SSL_TCP, where GetParam() = (true, false)

 1 FAILED TEST