Diagnosed failure

Parameters/TestRpc.TestCallWithChainCertAndChainCA/SSL_TCP: /data0/somelongdirectorytoavoidrpathissues/src/kudu/src/kudu/rpc/rpc-test.cc:270: Failure
Failed
Bad status: Runtime error: could not verify certificate chain (error with cert: subject=CN = localhost, ST = sadfjas, C = AS, emailAddress = sdflkdsajf, O = lskdfjlsad, OU = sldfkja, issuer=C = AS, ST = ASDfkjdhf, L = lskdjf, O = saldfja, OU = skdjf, CN = localhost, emailAddress = sadjflkadsj): : certificate has expired
Google Test trace:
/data0/somelongdirectorytoavoidrpathissues/src/kudu/src/kudu/rpc/rpc-test.cc:267: Connecting to 0.0.0.0:43387
I20260923 14:36:18.671039  2118 test_util.cc:175] -----------------------------------------------
I20260923 14:36:18.671103  2118 test_util.cc:176] Had fatal failures, leaving test files at /tmp/dist-test-taskKlL7SF/test-tmp/rpc-test.5.Parameters_TestRpc.TestCallWithChainCertAndChainCA_SSL_TCP.1790174178548735-2118-0

Full log

Note: This is test shard 6 of 8.
[==========] Running 21 tests from 2 test suites.
[----------] Global test environment set-up.
[----------] 20 tests from Parameters/TestRpc
[ RUN      ] Parameters/TestRpc.TestMessengerCreateDestroy/SSL_TCP
WARNING: Logging before InitGoogleLogging() is written to STDERR
I20260923 14:36:18.589762  2118 rpc-test.cc:169] started messenger TestCreateDestroy
[       OK ] Parameters/TestRpc.TestMessengerCreateDestroy/SSL_TCP (35 ms)
[ RUN      ] Parameters/TestRpc.TestNegotiationDeadlock/SSL_TCP
I20260923 14:36:18.603708  2138 acceptor_pool.cc:254] collecting diagnostics on the listening RPC socket 0.0.0.0:41969 every 8 connection(s)
I20260923 14:36:18.603852  2139 acceptor_pool.cc:254] collecting diagnostics on the listening RPC socket 0.0.0.0:41969 every 8 connection(s)
[       OK ] Parameters/TestRpc.TestNegotiationDeadlock/SSL_TCP (24 ms)
[ RUN      ] Parameters/TestRpc.TestCallWithChainCertAndChainCA/SSL_TCP
I20260923 14:36:18.665772  2155 acceptor_pool.cc:254] collecting diagnostics on the listening RPC socket 0.0.0.0:43387 every 8 connection(s)
I20260923 14:36:18.665793  2154 acceptor_pool.cc:254] collecting diagnostics on the listening RPC socket 0.0.0.0:43387 every 8 connection(s)
/data0/somelongdirectorytoavoidrpathissues/src/kudu/src/kudu/rpc/rpc-test.cc:270: Failure
Failed
Bad status: Runtime error: could not verify certificate chain (error with cert: subject=CN = localhost, ST = sadfjas, C = AS, emailAddress = sdflkdsajf, O = lskdfjlsad, OU = sldfkja, issuer=C = AS, ST = ASDfkjdhf, L = lskdjf, O = saldfja, OU = skdjf, CN = localhost, emailAddress = sadjflkadsj): : certificate has expired
Google Test trace:
/data0/somelongdirectorytoavoidrpathissues/src/kudu/src/kudu/rpc/rpc-test.cc:267: Connecting to 0.0.0.0:43387
I20260923 14:36:18.671039  2118 test_util.cc:175] -----------------------------------------------
I20260923 14:36:18.671103  2118 test_util.cc:176] Had fatal failures, leaving test files at /tmp/dist-test-taskKlL7SF/test-tmp/rpc-test.5.Parameters_TestRpc.TestCallWithChainCertAndChainCA_SSL_TCP.1790174178548735-2118-0
[  FAILED  ] Parameters/TestRpc.TestCallWithChainCertAndChainCA/SSL_TCP, where GetParam() = (true, false) (54 ms)
[ RUN      ] Parameters/TestRpc.TestCallWithPasswordProtectedKey/SSL_TCP
I20260923 14:36:18.692391  2179 acceptor_pool.cc:254] collecting diagnostics on the listening RPC socket 0.0.0.0:36109 every 8 connection(s)
I20260923 14:36:18.692414  2180 acceptor_pool.cc:254] collecting diagnostics on the listening RPC socket 0.0.0.0:36109 every 8 connection(s)
[       OK ] Parameters/TestRpc.TestCallWithPasswordProtectedKey/SSL_TCP (39 ms)
[ RUN      ] Parameters/TestRpc.TestCallToBadServer/SSL_TCP
I20260923 14:36:18.724344  2118 rpc-test.cc:394] Status: Network error: Client connection negotiation failed: client connection to 0.0.0.0:0: connect: Connection refused (error 111)
I20260923 14:36:18.724855  2118 rpc-test.cc:394] Status: Network error: Client connection negotiation failed: client connection to 0.0.0.0:0: connect: Connection refused (error 111)
I20260923 14:36:18.725272  2118 rpc-test.cc:394] Status: Network error: Client connection negotiation failed: client connection to 0.0.0.0:0: connect: Connection refused (error 111)
I20260923 14:36:18.725723  2118 rpc-test.cc:394] Status: Network error: Client connection negotiation failed: client connection to 0.0.0.0:0: connect: Connection refused (error 111)
I20260923 14:36:18.726136  2118 rpc-test.cc:394] Status: Network error: Client connection negotiation failed: client connection to 0.0.0.0:0: connect: Connection refused (error 111)
[       OK ] Parameters/TestRpc.TestCallToBadServer/SSL_TCP (15 ms)
[ RUN      ] Parameters/TestRpc.TestWrongService/SSL_TCP
I20260923 14:36:18.737164  2214 acceptor_pool.cc:254] collecting diagnostics on the listening RPC socket 0.0.0.0:36783 every 8 connection(s)
I20260923 14:36:18.737195  2215 acceptor_pool.cc:254] collecting diagnostics on the listening RPC socket 0.0.0.0:36783 every 8 connection(s)
I20260923 14:36:18.758033  2212 messenger.cc:345] service WrongServiceName not registered on TestServer
[       OK ] Parameters/TestRpc.TestWrongService/SSL_TCP (33 ms)
[ RUN      ] Parameters/TestRpc.TestConnectionKeepalive/SSL_TCP
I20260923 14:36:18.777505  2237 acceptor_pool.cc:254] collecting diagnostics on the listening RPC socket 0.0.0.0:41719 every 8 connection(s)
I20260923 14:36:18.777542  2238 acceptor_pool.cc:254] collecting diagnostics on the listening RPC socket 0.0.0.0:41719 every 8 connection(s)
I20260923 14:36:18.777872  2118 rpc-test.cc:488] Connecting to 0.0.0.0:41719
[       OK ] Parameters/TestRpc.TestConnectionKeepalive/SSL_TCP (1044 ms)
[ RUN      ] Parameters/TestRpc.TestClientConnectionMetrics/SSL_TCP
I20260923 14:36:19.821818  2262 acceptor_pool.cc:254] collecting diagnostics on the listening RPC socket 0.0.0.0:36227 every 8 connection(s)
I20260923 14:36:19.821837  2263 acceptor_pool.cc:254] collecting diagnostics on the listening RPC socket 0.0.0.0:36227 every 8 connection(s)
I20260923 14:36:19.822172  2118 rpc-test.cc:569] Connecting to 0.0.0.0:36227
[       OK ] Parameters/TestRpc.TestClientConnectionMetrics/SSL_TCP (12873 ms)
[ RUN      ] Parameters/TestRpc.TestCredentialsPolicy/SSL_TCP
I20260923 14:36:32.694868  2285 acceptor_pool.cc:254] collecting diagnostics on the listening RPC socket 0.0.0.0:37099 every 8 connection(s)
I20260923 14:36:32.694933  2286 acceptor_pool.cc:254] collecting diagnostics on the listening RPC socket 0.0.0.0:37099 every 8 connection(s)
I20260923 14:36:32.695288  2118 rpc-test.cc:700] Connecting to 0.0.0.0:37099
[       OK ] Parameters/TestRpc.TestCredentialsPolicy/SSL_TCP (45 ms)
[ RUN      ] Parameters/TestRpc.TestCallLongerThanKeepalive/SSL_TCP
I20260923 14:36:32.750371  2310 acceptor_pool.cc:254] collecting diagnostics on the listening RPC socket 0.0.0.0:46315 every 8 connection(s)
I20260923 14:36:32.750401  2311 acceptor_pool.cc:254] collecting diagnostics on the listening RPC socket 0.0.0.0:46315 every 8 connection(s)
I20260923 14:36:32.769896  2314 rpc-test-base.h:222] got call: sleep_micros: 3000000 deferred: true
I20260923 14:36:35.770885  2314 rpcz_store.cc:275] Call kudu.rpc.GenericCalculatorService.Sleep from 127.0.0.1:49294 (request call id 0) took 3001 ms. Trace:
I20260923 14:36:35.771019  2314 rpcz_store.cc:276] 0923 14:36:32.769776 (+     0us) service_pool.cc:170] Inserting onto call queue
0923 14:36:32.769863 (+    87us) service_pool.cc:227] Handling call
0923 14:36:35.770863 (+3001000us) inbound_call.cc:173] Queueing success response
Metrics: {}
[       OK ] Parameters/TestRpc.TestCallLongerThanKeepalive/SSL_TCP (3049 ms)
[ RUN      ] Parameters/TestRpc.TestRpcSidecar/SSL_TCP
I20260923 14:36:35.795120  2336 acceptor_pool.cc:254] collecting diagnostics on the listening RPC socket 0.0.0.0:43515 every 8 connection(s)
I20260923 14:36:35.795151  2335 acceptor_pool.cc:254] collecting diagnostics on the listening RPC socket 0.0.0.0:43515 every 8 connection(s)
[       OK ] Parameters/TestRpc.TestRpcSidecar/SSL_TCP (95 ms)
[ RUN      ] Parameters/TestRpc.TestRpcSidecarLimits/SSL_TCP
I20260923 14:36:37.719962  2360 acceptor_pool.cc:254] collecting diagnostics on the listening RPC socket 0.0.0.0:37637 every 8 connection(s)
I20260923 14:36:37.719995  2361 acceptor_pool.cc:254] collecting diagnostics on the listening RPC socket 0.0.0.0:37637 every 8 connection(s)
W20260923 14:36:37.725724  2118 serialization.cc:72] Serialized kudu.rpc_test.PushStringsRequestPB (2147483654 bytes) is larger than the maximum configured RPC message size (52428800 bytes). Sending anyway, but peer may reject the data.
W20260923 14:36:37.730005  2358 connection.cc:535] server connection from 127.0.0.1:49244 recv error: Network error: RPC frame had a length of 2147483714, but we only support messages up to 52428800 bytes long.
W20260923 14:36:37.730069  2358 connection.cc:158] shutting down server connection from 127.0.0.1:49244 with pending inbound data: 4/2147483714 bytes received; last active 0 ns ago: status Network error: RPC frame had a length of 2147483714, but we only support messages up to 52428800 bytes long.
W20260923 14:36:37.730234  2373 connection.cc:698] client connection to 0.0.0.0:37637 send error: Network error: failed to write to TLS socket: Connection reset by peer
W20260923 14:36:37.730422  2373 connection.cc:196] Error closing socket: Network error: TlsSocket::Close: Success
I20260923 14:36:37.754365  2385 acceptor_pool.cc:254] collecting diagnostics on the listening RPC socket 0.0.0.0:35999 every 8 connection(s)
I20260923 14:36:37.754383  2386 acceptor_pool.cc:254] collecting diagnostics on the listening RPC socket 0.0.0.0:35999 every 8 connection(s)
W20260923 14:36:42.504031  2382 connection.cc:577] server connection from 127.0.0.1:43424: received bad data: 'Corruption: Invalid packet: message had a length of 2147483710, but we only support messages up to 2147483647 bytes
'
[       OK ] Parameters/TestRpc.TestRpcSidecarLimits/SSL_TCP (6637 ms)
[ RUN      ] Parameters/TestRpc.TestCallTimeoutDoesntAffectNegotiation/SSL_TCP
I20260923 14:36:42.548980  2410 acceptor_pool.cc:254] collecting diagnostics on the listening RPC socket 0.0.0.0:45595 every 8 connection(s)
I20260923 14:36:42.549024  2411 acceptor_pool.cc:254] collecting diagnostics on the listening RPC socket 0.0.0.0:45595 every 8 connection(s)
W20260923 14:36:42.567234  2406 negotiation.cc:266] Injecting 500ms delay in negotiation
I20260923 14:36:42.617632  2118 rpc-test-base.h:595] status: Timed out: connection negotiation to 0.0.0.0:45595 for RPC Sleep timed out after 0.050s (ON_OUTBOUND_QUEUE), seconds elapsed: 0.0509934
[       OK ] Parameters/TestRpc.TestCallTimeoutDoesntAffectNegotiation/SSL_TCP (573 ms)
[ RUN      ] Parameters/TestRpc.TestRpcHandlerLatencyMetric/SSL_TCP
I20260923 14:36:43.088819  2435 acceptor_pool.cc:254] collecting diagnostics on the listening RPC socket 0.0.0.0:45509 every 8 connection(s)
I20260923 14:36:43.088979  2436 acceptor_pool.cc:254] collecting diagnostics on the listening RPC socket 0.0.0.0:45509 every 8 connection(s)
I20260923 14:36:43.153321  2118 rpc-test.cc:1236] Sleep() min lat: 20362
I20260923 14:36:43.153395  2118 rpc-test.cc:1237] Sleep() mean lat: 20362
I20260923 14:36:43.153424  2118 rpc-test.cc:1238] Sleep() max lat: 20362
I20260923 14:36:43.153438  2118 rpc-test.cc:1239] Sleep() #calls: 1
[       OK ] Parameters/TestRpc.TestRpcHandlerLatencyMetric/SSL_TCP (74 ms)
[ RUN      ] Parameters/TestRpc.TimedOutOnResponseMetricServiceQueue/SSL_TCP
I20260923 14:36:43.168197  2461 acceptor_pool.cc:254] collecting diagnostics on the listening RPC socket 0.0.0.0:37415 every 8 connection(s)
I20260923 14:36:43.168274  2462 acceptor_pool.cc:254] collecting diagnostics on the listening RPC socket 0.0.0.0:37415 every 8 connection(s)
W20260923 14:36:43.223971  2463 rpcz_store.cc:267] Call kudu.rpc_test.CalculatorService.Sleep from 127.0.0.1:53964 (request call id 2) took 20 ms (client timeout 20 ms). Trace:
W20260923 14:36:43.224104  2463 rpcz_store.cc:269] 0923 14:36:43.203569 (+     0us) service_pool.cc:170] Inserting onto call queue
0923 14:36:43.223913 (+ 20344us) service_pool.cc:214] Skipping call since client already timed out
0923 14:36:43.223949 (+    36us) inbound_call.cc:173] Queueing failure response
Metrics: {}
[       OK ] Parameters/TestRpc.TimedOutOnResponseMetricServiceQueue/SSL_TCP (70 ms)
[ RUN      ] Parameters/TestRpc.RpcPendingConnectionsMetric/SSL_TCP
I20260923 14:36:43.228641  2484 acceptor_pool.cc:254] collecting diagnostics on the listening RPC socket 0.0.0.0:46393 every 8 connection(s)
I20260923 14:36:43.228735  2485 acceptor_pool.cc:254] collecting diagnostics on the listening RPC socket 0.0.0.0:46393 every 8 connection(s)
W20260923 14:36:43.229795  2480 negotiation.cc:337] Failed RPC negotiation. Trace:
0923 14:36:43.229399 (+     0us) reactor.cc:625] Submitting negotiation task for server connection from 127.0.0.1:39484 (local address 127.0.0.1:46393)
0923 14:36:43.229504 (+   105us) server_negotiation.cc:206] Beginning negotiation
0923 14:36:43.229508 (+     4us) server_negotiation.cc:399] Waiting for connection header
0923 14:36:43.229592 (+    84us) negotiation.cc:327] Negotiation complete: Network error: Server connection negotiation failed: server connection from 127.0.0.1:39484: BlockingRecv error: recv got EOF from 127.0.0.1:39484 (error 108)
Metrics: {"server-negotiator.queue_time_us":36}
[       OK ] Parameters/TestRpc.RpcPendingConnectionsMetric/SSL_TCP (14 ms)
[ RUN      ] Parameters/TestRpc.TestRpcContextClientDeadline/SSL_TCP
I20260923 14:36:43.248265  2500 acceptor_pool.cc:254] collecting diagnostics on the listening RPC socket 0.0.0.0:40561 every 8 connection(s)
I20260923 14:36:43.248318  2501 acceptor_pool.cc:254] collecting diagnostics on the listening RPC socket 0.0.0.0:40561 every 8 connection(s)
[       OK ] Parameters/TestRpc.TestRpcContextClientDeadline/SSL_TCP (43 ms)
[ RUN      ] Parameters/TestRpc.TestApplicationFeatureFlagUnsupportedServer/SSL_TCP
I20260923 14:36:43.298775  2525 acceptor_pool.cc:254] collecting diagnostics on the listening RPC socket 0.0.0.0:33949 every 8 connection(s)
I20260923 14:36:43.298812  2526 acceptor_pool.cc:254] collecting diagnostics on the listening RPC socket 0.0.0.0:33949 every 8 connection(s)
[       OK ] Parameters/TestRpc.TestApplicationFeatureFlagUnsupportedServer/SSL_TCP (59 ms)
[ RUN      ] Parameters/TestRpc.TestCancellationAsync/SSL_TCP
I20260923 14:36:43.355274  2550 acceptor_pool.cc:254] collecting diagnostics on the listening RPC socket 0.0.0.0:37851 every 8 connection(s)
I20260923 14:36:43.355305  2551 acceptor_pool.cc:254] collecting diagnostics on the listening RPC socket 0.0.0.0:37851 every 8 connection(s)
I20260923 14:36:43.355612  2118 rpc-test.cc:1716] Connecting to 0.0.0.0:37851
I20260923 14:36:43.363122  2118 test_util.cc:268] Using random seed: 1769619248
I20260923 14:36:43.383841  2554 rpc-test-base.h:240] got call: sleep_micros: 500 pattern: 4294967295 num_repetitions: 2097152 sidecar_idx: 0
I20260923 14:36:43.400648  2553 rpc-test-base.h:240] got call: sleep_micros: 500 pattern: 4294967295 num_repetitions: 2097152 sidecar_idx: 0
I20260923 14:36:43.418309  2554 rpc-test-base.h:240] got call: sleep_micros: 500 pattern: 4294967295 num_repetitions: 2097152 sidecar_idx: 0
I20260923 14:36:43.435956  2553 rpc-test-base.h:240] got call: sleep_micros: 500 pattern: 4294967295 num_repetitions: 2097152 sidecar_idx: 0
I20260923 14:36:43.461150  2553 rpc-test-base.h:240] got call: sleep_micros: 500 pattern: 4294967295 num_repetitions: 2097152 sidecar_idx: 0
I20260923 14:36:43.486655  2553 rpc-test-base.h:240] got call: sleep_micros: 500 pattern: 4294967295 num_repetitions: 2097152 sidecar_idx: 0
I20260923 14:36:43.512575  2553 rpc-test-base.h:240] got call: sleep_micros: 500 pattern: 4294967295 num_repetitions: 2097152 sidecar_idx: 0
W20260923 14:36:43.530395  2547 connection.cc:441] server connection from 127.0.0.1:59522 torn down before Call kudu.rpc.GenericCalculatorService.SleepWithSidecar from 127.0.0.1:59522 (request call id 9) could send its response
[       OK ] Parameters/TestRpc.TestCancellationAsync/SSL_TCP (187 ms)
[ RUN      ] Parameters/TestRpc.TestPerformanceBySocketType/SSL_TCP
I20260923 14:36:43.567960  2575 acceptor_pool.cc:254] collecting diagnostics on the listening RPC socket 0.0.0.0:34893 every 8 connection(s)
I20260923 14:36:43.567991  2576 acceptor_pool.cc:254] collecting diagnostics on the listening RPC socket 0.0.0.0:34893 every 8 connection(s)
I20260923 14:36:43.568324  2118 rpc-test.cc:1846] Connecting to 0.0.0.0:34893
I20260923 14:36:45.862936  2118 rpc-test.cc:1859] Sending 1024MB via ssl-enabled tcp socket: real 2.276s	user 2.433s	sys 1.548s
I20260923 14:36:48.311468  2118 rpc-test.cc:1859] Sending 1024MB via ssl-enabled tcp socket: real 2.448s	user 2.629s	sys 1.670s
I20260923 14:36:50.687960  2118 rpc-test.cc:1859] Sending 1024MB via ssl-enabled tcp socket: real 2.376s	user 2.453s	sys 1.706s
I20260923 14:36:53.106119  2118 rpc-test.cc:1859] Sending 1024MB via ssl-enabled tcp socket: real 2.418s	user 2.550s	sys 1.709s
I20260923 14:36:55.503047  2118 rpc-test.cc:1859] Sending 1024MB via ssl-enabled tcp socket: real 2.397s	user 2.478s	sys 1.749s
[       OK ] Parameters/TestRpc.TestPerformanceBySocketType/SSL_TCP (11973 ms)
[----------] 20 tests from Parameters/TestRpc (36949 ms total)

[----------] 1 test from Parameters/TestRpcSocketTxRxQueue
[ RUN      ] Parameters/TestRpcSocketTxRxQueue.OverCapacity/0
W20260923 14:36:55.776010  2619 negotiation.cc:337] Failed RPC negotiation. Trace:
0923 14:36:55.511311 (+     0us) reactor.cc:625] Submitting negotiation task for client connection to 0.0.0.0:40033 (local address 127.0.0.1:47000)
0923 14:36:55.511391 (+    80us) negotiation.cc:107] Waiting for socket to connect
0923 14:36:55.511426 (+    35us) client_negotiation.cc:174] Beginning negotiation
0923 14:36:55.511526 (+   100us) client_negotiation.cc:252] Sending NEGOTIATE NegotiatePB request
0923 14:36:55.775824 (+264298us) negotiation.cc:327] Negotiation complete: Network error: Client connection negotiation failed: client connection to 0.0.0.0:40033: BlockingRecv error: recv error from unknown peer: Transport endpoint is not connected (error 107)
Metrics: {"client-negotiator.queue_time_us":26}
W20260923 14:36:55.776006  2592 negotiation.cc:337] Failed RPC negotiation. Trace:
0923 14:36:55.507751 (+     0us) reactor.cc:625] Submitting negotiation task for client connection to 0.0.0.0:40033 (local address 127.0.0.1:46968)
0923 14:36:55.507861 (+   110us) negotiation.cc:107] Waiting for socket to connect
0923 14:36:55.507878 (+    17us) client_negotiation.cc:174] Beginning negotiation
0923 14:36:55.507979 (+   101us) client_negotiation.cc:252] Sending NEGOTIATE NegotiatePB request
0923 14:36:55.775832 (+267853us) negotiation.cc:327] Negotiation complete: Network error: Client connection negotiation failed: client connection to 0.0.0.0:40033: BlockingRecv error: recv error from unknown peer: Transport endpoint is not connected (error 107)
Metrics: {"client-negotiator.queue_time_us":26}
W20260923 14:36:55.776247  2610 negotiation.cc:337] Failed RPC negotiation. Trace:
0923 14:36:55.510098 (+     0us) reactor.cc:625] Submitting negotiation task for client connection to 0.0.0.0:40033 (local address 127.0.0.1:46994)
0923 14:36:55.510212 (+   114us) negotiation.cc:107] Waiting for socket to connect
0923 14:36:55.510226 (+    14us) client_negotiation.cc:174] Beginning negotiation
0923 14:36:55.510305 (+    79us) client_negotiation.cc:252] Sending NEGOTIATE NegotiatePB request
0923 14:36:55.775932 (+265627us) negotiation.cc:327] Negotiation complete: Network error: Client connection negotiation failed: client connection to 0.0.0.0:40033: BlockingRecv error: recv error from unknown peer: Transport endpoint is not connected (error 107)
Metrics: {"client-negotiator.queue_time_us":26}
W20260923 14:36:55.776432  2601 negotiation.cc:337] Failed RPC negotiation. Trace:
0923 14:36:55.508939 (+     0us) reactor.cc:625] Submitting negotiation task for client connection to 0.0.0.0:40033 (local address 127.0.0.1:46980)
0923 14:36:55.509029 (+    90us) negotiation.cc:107] Waiting for socket to connect
0923 14:36:55.509039 (+    10us) client_negotiation.cc:174] Beginning negotiation
0923 14:36:55.509102 (+    63us) client_negotiation.cc:252] Sending NEGOTIATE NegotiatePB request
0923 14:36:55.775932 (+266830us) negotiation.cc:327] Negotiation complete: Network error: Client connection negotiation failed: client connection to 0.0.0.0:40033: BlockingRecv error: recv error from unknown peer: Transport endpoint is not connected (error 107)
Metrics: {"client-negotiator.queue_time_us":26}
W20260923 14:36:55.776576  2628 negotiation.cc:337] Failed RPC negotiation. Trace:
0923 14:36:55.512528 (+     0us) reactor.cc:625] Submitting negotiation task for client connection to 0.0.0.0:40033 (local address 127.0.0.1:47006)
0923 14:36:55.512665 (+   137us) negotiation.cc:107] Waiting for socket to connect
0923 14:36:55.512691 (+    26us) client_negotiation.cc:174] Beginning negotiation
0923 14:36:55.512782 (+    91us) client_negotiation.cc:252] Sending NEGOTIATE NegotiatePB request
0923 14:36:55.776497 (+263715us) negotiation.cc:327] Negotiation complete: Network error: Client connection negotiation failed: client connection to 0.0.0.0:40033: BlockingRecv error: recv error from unknown peer: Transport endpoint is not connected (error 107)
Metrics: {"client-negotiator.queue_time_us":45}
W20260923 14:36:55.776628  2637 negotiation.cc:337] Failed RPC negotiation. Trace:
0923 14:36:55.513699 (+     0us) reactor.cc:625] Submitting negotiation task for client connection to 0.0.0.0:40033 (local address 127.0.0.1:47020)
0923 14:36:55.513834 (+   135us) negotiation.cc:107] Waiting for socket to connect
0923 14:36:55.513849 (+    15us) client_negotiation.cc:174] Beginning negotiation
0923 14:36:55.513936 (+    87us) client_negotiation.cc:252] Sending NEGOTIATE NegotiatePB request
0923 14:36:55.776497 (+262561us) negotiation.cc:327] Negotiation complete: Network error: Client connection negotiation failed: client connection to 0.0.0.0:40033: BlockingRecv error: recv error from unknown peer: Transport endpoint is not connected (error 107)
Metrics: {"client-negotiator.queue_time_us":44}
[       OK ] Parameters/TestRpcSocketTxRxQueue.OverCapacity/0 (1039 ms)
[----------] 1 test from Parameters/TestRpcSocketTxRxQueue (1039 ms total)

[----------] Global test environment tear-down
[==========] 21 tests from 2 test suites ran. (37989 ms total)
[  PASSED  ] 20 tests.
[  FAILED  ] 1 test, listed below:
[  FAILED  ] Parameters/TestRpc.TestCallWithChainCertAndChainCA/SSL_TCP, where GetParam() = (true, false)

 1 FAILED TEST