Diagnosed failure

Parameters/TestRpc.TestCallWithChainCertAndChainCA/SSL_UnixSocket: /data0/somelongdirectorytoavoidrpathissues/src/kudu/src/kudu/rpc/rpc-test.cc:270: Failure
Failed
Bad status: Runtime error: could not verify certificate chain (error with cert: subject=CN = localhost, ST = sadfjas, C = AS, emailAddress = sdflkdsajf, O = lskdfjlsad, OU = sldfkja, issuer=C = AS, ST = ASDfkjdhf, L = lskdjf, O = saldfja, OU = skdjf, CN = localhost, emailAddress = sadjflkadsj): : certificate has expired
Google Test trace:
/data0/somelongdirectorytoavoidrpathissues/src/kudu/src/kudu/rpc/rpc-test.cc:267: Connecting to unix:/tmp/dist-test-taskSc0tun/test-tmp/rpc-test-a894c8572dad4a968e7ca7e67e759aac.sock
I20260925 15:09:34.306005 25559 test_util.cc:175] -----------------------------------------------
I20260925 15:09:34.306066 25559 test_util.cc:176] Had fatal failures, leaving test files at /tmp/dist-test-taskSc0tun/test-tmp/rpc-test.6.Parameters_TestRpc.TestCallWithChainCertAndChainCA_SSL_UnixSocket.1790348974219245-25559-0

Full log

Note: This is test shard 7 of 8.
[==========] Running 21 tests from 2 test suites.
[----------] Global test environment set-up.
[----------] 20 tests from Parameters/TestRpc
[ RUN      ] Parameters/TestRpc.TestMessengerCreateDestroy/SSL_UnixSocket
WARNING: Logging before InitGoogleLogging() is written to STDERR
I20260925 15:09:34.254799 25559 rpc-test.cc:169] started messenger TestCreateDestroy
[       OK ] Parameters/TestRpc.TestMessengerCreateDestroy/SSL_UnixSocket (19 ms)
[ RUN      ] Parameters/TestRpc.TestNegotiationDeadlock/SSL_UnixSocket
I20260925 15:09:34.269606 25579 acceptor_pool.cc:254] collecting diagnostics on the listening RPC socket unix:/tmp/dist-test-taskSc0tun/test-tmp/rpc-test-92ae925efb484eba887a9d236139e4f0.sock every 8 connection(s)
I20260925 15:09:34.269817 25580 acceptor_pool.cc:254] collecting diagnostics on the listening RPC socket unix:/tmp/dist-test-taskSc0tun/test-tmp/rpc-test-92ae925efb484eba887a9d236139e4f0.sock every 8 connection(s)
[       OK ] Parameters/TestRpc.TestNegotiationDeadlock/SSL_UnixSocket (27 ms)
[ RUN      ] Parameters/TestRpc.TestCallWithChainCertAndChainCA/SSL_UnixSocket
I20260925 15:09:34.296597 25595 acceptor_pool.cc:254] collecting diagnostics on the listening RPC socket unix:/tmp/dist-test-taskSc0tun/test-tmp/rpc-test-a894c8572dad4a968e7ca7e67e759aac.sock every 8 connection(s)
I20260925 15:09:34.296852 25596 acceptor_pool.cc:254] collecting diagnostics on the listening RPC socket unix:/tmp/dist-test-taskSc0tun/test-tmp/rpc-test-a894c8572dad4a968e7ca7e67e759aac.sock every 8 connection(s)
/data0/somelongdirectorytoavoidrpathissues/src/kudu/src/kudu/rpc/rpc-test.cc:270: Failure
Failed
Bad status: Runtime error: could not verify certificate chain (error with cert: subject=CN = localhost, ST = sadfjas, C = AS, emailAddress = sdflkdsajf, O = lskdfjlsad, OU = sldfkja, issuer=C = AS, ST = ASDfkjdhf, L = lskdjf, O = saldfja, OU = skdjf, CN = localhost, emailAddress = sadjflkadsj): : certificate has expired
Google Test trace:
/data0/somelongdirectorytoavoidrpathissues/src/kudu/src/kudu/rpc/rpc-test.cc:267: Connecting to unix:/tmp/dist-test-taskSc0tun/test-tmp/rpc-test-a894c8572dad4a968e7ca7e67e759aac.sock
I20260925 15:09:34.306005 25559 test_util.cc:175] -----------------------------------------------
I20260925 15:09:34.306066 25559 test_util.cc:176] Had fatal failures, leaving test files at /tmp/dist-test-taskSc0tun/test-tmp/rpc-test.6.Parameters_TestRpc.TestCallWithChainCertAndChainCA_SSL_UnixSocket.1790348974219245-25559-0
[  FAILED  ] Parameters/TestRpc.TestCallWithChainCertAndChainCA/SSL_UnixSocket, where GetParam() = (true, true) (20 ms)
[ RUN      ] Parameters/TestRpc.TestCallWithPasswordProtectedKey/SSL_UnixSocket
I20260925 15:09:34.316671 25620 acceptor_pool.cc:254] collecting diagnostics on the listening RPC socket unix:/tmp/dist-test-taskSc0tun/test-tmp/rpc-test-09cb404cb75b44d6ab835560b39e3a7e.sock every 8 connection(s)
I20260925 15:09:34.316856 25621 acceptor_pool.cc:254] collecting diagnostics on the listening RPC socket unix:/tmp/dist-test-taskSc0tun/test-tmp/rpc-test-09cb404cb75b44d6ab835560b39e3a7e.sock every 8 connection(s)
W20260925 15:09:34.341393 25617 connection.cc:196] Error closing socket: Network error: TlsSocket::Close: Broken pipe
[       OK ] Parameters/TestRpc.TestCallWithPasswordProtectedKey/SSL_UnixSocket (38 ms)
[ RUN      ] Parameters/TestRpc.TestCallToBadServer/SSL_UnixSocket
I20260925 15:09:34.371580 25559 rpc-test.cc:394] Status: Network error: Client connection negotiation failed: client connection to 0.0.0.0:0: connect: Connection refused (error 111)
I20260925 15:09:34.372182 25559 rpc-test.cc:394] Status: Network error: Client connection negotiation failed: client connection to 0.0.0.0:0: connect: Connection refused (error 111)
I20260925 15:09:34.372771 25559 rpc-test.cc:394] Status: Network error: Client connection negotiation failed: client connection to 0.0.0.0:0: connect: Connection refused (error 111)
I20260925 15:09:34.373332 25559 rpc-test.cc:394] Status: Network error: Client connection negotiation failed: client connection to 0.0.0.0:0: connect: Connection refused (error 111)
I20260925 15:09:34.373864 25559 rpc-test.cc:394] Status: Network error: Client connection negotiation failed: client connection to 0.0.0.0:0: connect: Connection refused (error 111)
[       OK ] Parameters/TestRpc.TestCallToBadServer/SSL_UnixSocket (30 ms)
[ RUN      ] Parameters/TestRpc.TestWrongService/SSL_UnixSocket
I20260925 15:09:34.407795 25655 acceptor_pool.cc:254] collecting diagnostics on the listening RPC socket unix:/tmp/dist-test-taskSc0tun/test-tmp/rpc-test-1bd36ebd54eb4d4ba9acb76f63695945.sock every 8 connection(s)
I20260925 15:09:34.408015 25656 acceptor_pool.cc:254] collecting diagnostics on the listening RPC socket unix:/tmp/dist-test-taskSc0tun/test-tmp/rpc-test-1bd36ebd54eb4d4ba9acb76f63695945.sock every 8 connection(s)
I20260925 15:09:34.425168 25652 messenger.cc:345] service WrongServiceName not registered on TestServer
[       OK ] Parameters/TestRpc.TestWrongService/SSL_UnixSocket (53 ms)
[ RUN      ] Parameters/TestRpc.TestConnectionKeepalive/SSL_UnixSocket
I20260925 15:09:34.442785 25678 acceptor_pool.cc:254] collecting diagnostics on the listening RPC socket unix:/tmp/dist-test-taskSc0tun/test-tmp/rpc-test-0f3ba166df5e458a94475bdc2bfae062.sock every 8 connection(s)
I20260925 15:09:34.443015 25679 acceptor_pool.cc:254] collecting diagnostics on the listening RPC socket unix:/tmp/dist-test-taskSc0tun/test-tmp/rpc-test-0f3ba166df5e458a94475bdc2bfae062.sock every 8 connection(s)
I20260925 15:09:34.443805 25559 rpc-test.cc:488] Connecting to unix:/tmp/dist-test-taskSc0tun/test-tmp/rpc-test-0f3ba166df5e458a94475bdc2bfae062.sock
W20260925 15:09:34.931119 25691 connection.cc:196] Error closing socket: Network error: TlsSocket::Close: Broken pipe
[       OK ] Parameters/TestRpc.TestConnectionKeepalive/SSL_UnixSocket (1040 ms)
[ RUN      ] Parameters/TestRpc.TestClientConnectionMetrics/SSL_UnixSocket
I20260925 15:09:35.484165 25703 acceptor_pool.cc:254] collecting diagnostics on the listening RPC socket unix:/tmp/dist-test-taskSc0tun/test-tmp/rpc-test-663b570b8c7c41babad6a77fb5b37fd5.sock every 8 connection(s)
I20260925 15:09:35.484431 25704 acceptor_pool.cc:254] collecting diagnostics on the listening RPC socket unix:/tmp/dist-test-taskSc0tun/test-tmp/rpc-test-663b570b8c7c41babad6a77fb5b37fd5.sock every 8 connection(s)
I20260925 15:09:35.485205 25559 rpc-test.cc:569] Connecting to unix:/tmp/dist-test-taskSc0tun/test-tmp/rpc-test-663b570b8c7c41babad6a77fb5b37fd5.sock
W20260925 15:09:54.528530 25700 connection.cc:196] Error closing socket: Network error: TlsSocket::Close: Broken pipe
[       OK ] Parameters/TestRpc.TestClientConnectionMetrics/SSL_UnixSocket (19063 ms)
[ RUN      ] Parameters/TestRpc.TestCredentialsPolicy/SSL_UnixSocket
I20260925 15:09:54.561522 25726 acceptor_pool.cc:254] collecting diagnostics on the listening RPC socket unix:/tmp/dist-test-taskSc0tun/test-tmp/rpc-test-a810db5c1db84084a683afed52f01298.sock every 8 connection(s)
I20260925 15:09:54.561743 25727 acceptor_pool.cc:254] collecting diagnostics on the listening RPC socket unix:/tmp/dist-test-taskSc0tun/test-tmp/rpc-test-a810db5c1db84084a683afed52f01298.sock every 8 connection(s)
I20260925 15:09:54.562526 25559 rpc-test.cc:700] Connecting to unix:/tmp/dist-test-taskSc0tun/test-tmp/rpc-test-a810db5c1db84084a683afed52f01298.sock
W20260925 15:09:54.592983 25725 connection.cc:196] Error closing socket: Network error: TlsSocket::Close: Broken pipe
W20260925 15:09:54.598946 25725 connection.cc:196] Error closing socket: Network error: TlsSocket::Close: Broken pipe
[       OK ] Parameters/TestRpc.TestCredentialsPolicy/SSL_UnixSocket (67 ms)
[ RUN      ] Parameters/TestRpc.TestCallLongerThanKeepalive/SSL_UnixSocket
I20260925 15:09:54.617192 25751 acceptor_pool.cc:254] collecting diagnostics on the listening RPC socket unix:/tmp/dist-test-taskSc0tun/test-tmp/rpc-test-71987f01e31d4f5da2ba00e32b3b06a1.sock every 8 connection(s)
I20260925 15:09:54.617383 25752 acceptor_pool.cc:254] collecting diagnostics on the listening RPC socket unix:/tmp/dist-test-taskSc0tun/test-tmp/rpc-test-71987f01e31d4f5da2ba00e32b3b06a1.sock every 8 connection(s)
I20260925 15:09:54.633486 25755 rpc-test-base.h:222] got call: sleep_micros: 3000000 deferred: true
I20260925 15:09:57.634999 25755 rpcz_store.cc:275] Call kudu.rpc.GenericCalculatorService.Sleep from unix:<unnamed> (request call id 0) took 3001 ms. Trace:
I20260925 15:09:57.635169 25755 rpcz_store.cc:276] 0925 15:09:54.633405 (+     0us) service_pool.cc:170] Inserting onto call queue
0925 15:09:54.633455 (+    50us) service_pool.cc:227] Handling call
0925 15:09:57.634951 (+3001496us) inbound_call.cc:173] Queueing success response
Metrics: {}
[       OK ] Parameters/TestRpc.TestCallLongerThanKeepalive/SSL_UnixSocket (3039 ms)
[ RUN      ] Parameters/TestRpc.TestRpcSidecar/SSL_UnixSocket
I20260925 15:09:57.662842 25776 acceptor_pool.cc:254] collecting diagnostics on the listening RPC socket unix:/tmp/dist-test-taskSc0tun/test-tmp/rpc-test-d38ef9ffff844fd9b65be4c123306e6d.sock every 8 connection(s)
I20260925 15:09:57.663079 25777 acceptor_pool.cc:254] collecting diagnostics on the listening RPC socket unix:/tmp/dist-test-taskSc0tun/test-tmp/rpc-test-d38ef9ffff844fd9b65be4c123306e6d.sock every 8 connection(s)
[       OK ] Parameters/TestRpc.TestRpcSidecar/SSL_UnixSocket (115 ms)
[ RUN      ] Parameters/TestRpc.TestRpcSidecarLimits/SSL_UnixSocket
I20260925 15:09:59.639192 25801 acceptor_pool.cc:254] collecting diagnostics on the listening RPC socket unix:/tmp/dist-test-taskSc0tun/test-tmp/rpc-test-fac06e8f3729441abc2ec30922d89490.sock every 8 connection(s)
I20260925 15:09:59.639411 25802 acceptor_pool.cc:254] collecting diagnostics on the listening RPC socket unix:/tmp/dist-test-taskSc0tun/test-tmp/rpc-test-fac06e8f3729441abc2ec30922d89490.sock every 8 connection(s)
W20260925 15:09:59.658080 25559 serialization.cc:72] Serialized kudu.rpc_test.PushStringsRequestPB (2147483654 bytes) is larger than the maximum configured RPC message size (52428800 bytes). Sending anyway, but peer may reject the data.
W20260925 15:09:59.663257 25798 connection.cc:535] server connection from unix:<unnamed> recv error: Network error: RPC frame had a length of 2147483714, but we only support messages up to 52428800 bytes long.
W20260925 15:09:59.663376 25798 connection.cc:158] shutting down server connection from unix:<unnamed> with pending inbound data: 4/2147483714 bytes received; last active 0 ns ago: status Network error: RPC frame had a length of 2147483714, but we only support messages up to 52428800 bytes long.
W20260925 15:09:59.663781 25814 connection.cc:196] Error closing socket: Network error: TlsSocket::Close: Broken pipe
I20260925 15:09:59.691174 25826 acceptor_pool.cc:254] collecting diagnostics on the listening RPC socket unix:/tmp/dist-test-taskSc0tun/test-tmp/rpc-test-fac06e8f3729441abc2ec30922d89490.sock every 8 connection(s)
I20260925 15:09:59.691354 25827 acceptor_pool.cc:254] collecting diagnostics on the listening RPC socket unix:/tmp/dist-test-taskSc0tun/test-tmp/rpc-test-fac06e8f3729441abc2ec30922d89490.sock every 8 connection(s)
W20260925 15:10:04.777987 25823 connection.cc:577] server connection from unix:<unnamed>: received bad data: 'Corruption: Invalid packet: message had a length of 2147483710, but we only support messages up to 2147483647 bytes
'
W20260925 15:10:04.778518 25839 connection.cc:196] Error closing socket: Network error: TlsSocket::Close: Broken pipe
[       OK ] Parameters/TestRpc.TestRpcSidecarLimits/SSL_UnixSocket (7438 ms)
[ RUN      ] Parameters/TestRpc.TestCallTimeoutDoesntAffectNegotiation/SSL_UnixSocket
I20260925 15:10:05.206139 25851 acceptor_pool.cc:254] collecting diagnostics on the listening RPC socket unix:/tmp/dist-test-taskSc0tun/test-tmp/rpc-test-ceff65e7d60142f292b88cf26c165561.sock every 8 connection(s)
I20260925 15:10:05.206367 25852 acceptor_pool.cc:254] collecting diagnostics on the listening RPC socket unix:/tmp/dist-test-taskSc0tun/test-tmp/rpc-test-ceff65e7d60142f292b88cf26c165561.sock every 8 connection(s)
W20260925 15:10:05.224300 25847 negotiation.cc:266] Injecting 500ms delay in negotiation
I20260925 15:10:05.274703 25559 rpc-test-base.h:595] status: Timed out: connection negotiation to unix:/tmp/dist-test-taskSc0tun/test-tmp/rpc-test-ceff65e7d60142f292b88cf26c165561.sock for RPC Sleep timed out after 0.050s (ON_OUTBOUND_QUEUE), seconds elapsed: 0.0508663
[       OK ] Parameters/TestRpc.TestCallTimeoutDoesntAffectNegotiation/SSL_UnixSocket (538 ms)
[ RUN      ] Parameters/TestRpc.TestRpcHandlerLatencyMetric/SSL_UnixSocket
I20260925 15:10:05.751852 25876 acceptor_pool.cc:254] collecting diagnostics on the listening RPC socket unix:/tmp/dist-test-taskSc0tun/test-tmp/rpc-test-255e0d9478624b39a2f28f6c89293ec0.sock every 8 connection(s)
I20260925 15:10:05.752084 25877 acceptor_pool.cc:254] collecting diagnostics on the listening RPC socket unix:/tmp/dist-test-taskSc0tun/test-tmp/rpc-test-255e0d9478624b39a2f28f6c89293ec0.sock every 8 connection(s)
I20260925 15:10:05.791936 25559 rpc-test.cc:1236] Sleep() min lat: 20565
I20260925 15:10:05.792001 25559 rpc-test.cc:1237] Sleep() mean lat: 20565
I20260925 15:10:05.792042 25559 rpc-test.cc:1238] Sleep() max lat: 20565
I20260925 15:10:05.792073 25559 rpc-test.cc:1239] Sleep() #calls: 1
[       OK ] Parameters/TestRpc.TestRpcHandlerLatencyMetric/SSL_UnixSocket (63 ms)
[ RUN      ] Parameters/TestRpc.TimedOutOnResponseMetricServiceQueue/SSL_UnixSocket
I20260925 15:10:05.808501 25902 acceptor_pool.cc:254] collecting diagnostics on the listening RPC socket unix:/tmp/dist-test-taskSc0tun/test-tmp/rpc-test-7f0687a4b0ab4f6d94394a233c4279fe.sock every 8 connection(s)
I20260925 15:10:05.808797 25903 acceptor_pool.cc:254] collecting diagnostics on the listening RPC socket unix:/tmp/dist-test-taskSc0tun/test-tmp/rpc-test-7f0687a4b0ab4f6d94394a233c4279fe.sock every 8 connection(s)
W20260925 15:10:05.868778 25904 rpcz_store.cc:267] Call kudu.rpc_test.CalculatorService.Sleep from unix:<unnamed> (request call id 2) took 20 ms (client timeout 20 ms). Trace:
W20260925 15:10:05.868906 25904 rpcz_store.cc:269] 0925 15:10:05.848358 (+     0us) service_pool.cc:170] Inserting onto call queue
0925 15:10:05.868691 (+ 20333us) service_pool.cc:214] Skipping call since client already timed out
0925 15:10:05.868742 (+    51us) inbound_call.cc:173] Queueing failure response
Metrics: {}
W20260925 15:10:05.869946 25899 connection.cc:196] Error closing socket: Network error: TlsSocket::Close: Broken pipe
[       OK ] Parameters/TestRpc.TimedOutOnResponseMetricServiceQueue/SSL_UnixSocket (75 ms)
[ RUN      ] Parameters/TestRpc.RpcPendingConnectionsMetric/SSL_UnixSocket
I20260925 15:10:05.876264 25925 acceptor_pool.cc:254] collecting diagnostics on the listening RPC socket 0.0.0.0:41197 every 8 connection(s)
I20260925 15:10:05.876451 25926 acceptor_pool.cc:254] collecting diagnostics on the listening RPC socket 0.0.0.0:41197 every 8 connection(s)
W20260925 15:10:05.878360 25921 negotiation.cc:337] Failed RPC negotiation. Trace:
0925 15:10:05.877829 (+     0us) reactor.cc:625] Submitting negotiation task for server connection from 127.0.0.1:40422 (local address 127.0.0.1:41197)
0925 15:10:05.877948 (+   119us) server_negotiation.cc:206] Beginning negotiation
0925 15:10:05.877951 (+     3us) server_negotiation.cc:399] Waiting for connection header
0925 15:10:05.878079 (+   128us) negotiation.cc:327] Negotiation complete: Network error: Server connection negotiation failed: server connection from 127.0.0.1:40422: BlockingRecv error: recv got EOF from 127.0.0.1:40422 (error 108)
Metrics: {"server-negotiator.queue_time_us":43}
[       OK ] Parameters/TestRpc.RpcPendingConnectionsMetric/SSL_UnixSocket (17 ms)
[ RUN      ] Parameters/TestRpc.TestRpcContextClientDeadline/SSL_UnixSocket
I20260925 15:10:05.908584 25941 acceptor_pool.cc:254] collecting diagnostics on the listening RPC socket unix:/tmp/dist-test-taskSc0tun/test-tmp/rpc-test-ed09cf0c24f040dcab6093fbf989e7ed.sock every 8 connection(s)
I20260925 15:10:05.908797 25942 acceptor_pool.cc:254] collecting diagnostics on the listening RPC socket unix:/tmp/dist-test-taskSc0tun/test-tmp/rpc-test-ed09cf0c24f040dcab6093fbf989e7ed.sock every 8 connection(s)
[       OK ] Parameters/TestRpc.TestRpcContextClientDeadline/SSL_UnixSocket (62 ms)
[ RUN      ] Parameters/TestRpc.TestApplicationFeatureFlagUnsupportedServer/SSL_UnixSocket
I20260925 15:10:05.960638 25966 acceptor_pool.cc:254] collecting diagnostics on the listening RPC socket unix:/tmp/dist-test-taskSc0tun/test-tmp/rpc-test-6a919aef5d6f48de86debb692df3ae00.sock every 8 connection(s)
I20260925 15:10:05.960844 25967 acceptor_pool.cc:254] collecting diagnostics on the listening RPC socket unix:/tmp/dist-test-taskSc0tun/test-tmp/rpc-test-6a919aef5d6f48de86debb692df3ae00.sock every 8 connection(s)
[       OK ] Parameters/TestRpc.TestApplicationFeatureFlagUnsupportedServer/SSL_UnixSocket (26 ms)
[ RUN      ] Parameters/TestRpc.TestCancellationAsync/SSL_UnixSocket
I20260925 15:10:05.993450 25991 acceptor_pool.cc:254] collecting diagnostics on the listening RPC socket unix:/tmp/dist-test-taskSc0tun/test-tmp/rpc-test-1da9832bcf9241159c2869598286b889.sock every 8 connection(s)
I20260925 15:10:05.993655 25992 acceptor_pool.cc:254] collecting diagnostics on the listening RPC socket unix:/tmp/dist-test-taskSc0tun/test-tmp/rpc-test-1da9832bcf9241159c2869598286b889.sock every 8 connection(s)
I20260925 15:10:05.994390 25559 rpc-test.cc:1716] Connecting to unix:/tmp/dist-test-taskSc0tun/test-tmp/rpc-test-1da9832bcf9241159c2869598286b889.sock
I20260925 15:10:06.010388 25559 test_util.cc:268] Using random seed: 478607367
I20260925 15:10:06.044902 25995 rpc-test-base.h:240] got call: sleep_micros: 500 pattern: 4294967295 num_repetitions: 2097152 sidecar_idx: 0
I20260925 15:10:06.068938 25994 rpc-test-base.h:240] got call: sleep_micros: 500 pattern: 4294967295 num_repetitions: 2097152 sidecar_idx: 0
I20260925 15:10:06.092742 25993 rpc-test-base.h:240] got call: sleep_micros: 500 pattern: 4294967295 num_repetitions: 2097152 sidecar_idx: 0
I20260925 15:10:06.123803 25994 rpc-test-base.h:240] got call: sleep_micros: 500 pattern: 4294967295 num_repetitions: 2097152 sidecar_idx: 0
I20260925 15:10:06.151243 25993 rpc-test-base.h:240] got call: sleep_micros: 500 pattern: 4294967295 num_repetitions: 2097152 sidecar_idx: 0
I20260925 15:10:06.176121 25994 rpc-test-base.h:240] got call: sleep_micros: 500 pattern: 4294967295 num_repetitions: 2097152 sidecar_idx: 0
W20260925 15:10:06.177592 25988 connection.cc:196] Error closing socket: Network error: TlsSocket::Close: Broken pipe
W20260925 15:10:06.193398 25988 connection.cc:441] server connection from unix:<unnamed> torn down before Call kudu.rpc.GenericCalculatorService.SleepWithSidecar from unix:<unnamed> (request call id 8) could send its response
W20260925 15:10:06.210896 25988 connection.cc:441] server connection from unix:<unnamed> torn down before Call kudu.rpc.GenericCalculatorService.SleepWithSidecar from unix:<unnamed> (request call id 9) could send its response
[       OK ] Parameters/TestRpc.TestCancellationAsync/SSL_UnixSocket (234 ms)
[ RUN      ] Parameters/TestRpc.TestPerformanceBySocketType/SSL_UnixSocket
I20260925 15:10:06.225010 26016 acceptor_pool.cc:254] collecting diagnostics on the listening RPC socket unix:/tmp/dist-test-taskSc0tun/test-tmp/rpc-test-af17c955d9c644cf9911ae6d179189b6.sock every 8 connection(s)
I20260925 15:10:06.225219 26017 acceptor_pool.cc:254] collecting diagnostics on the listening RPC socket unix:/tmp/dist-test-taskSc0tun/test-tmp/rpc-test-af17c955d9c644cf9911ae6d179189b6.sock every 8 connection(s)
I20260925 15:10:06.226110 25559 rpc-test.cc:1846] Connecting to unix:/tmp/dist-test-taskSc0tun/test-tmp/rpc-test-af17c955d9c644cf9911ae6d179189b6.sock
I20260925 15:10:08.935568 25559 rpc-test.cc:1859] Sending 1024MB via ssl-enabled unix socket: real 2.686s	user 2.530s	sys 2.060s
I20260925 15:10:11.762888 25559 rpc-test.cc:1859] Sending 1024MB via ssl-enabled unix socket: real 2.827s	user 2.757s	sys 2.086s
I20260925 15:10:14.526367 25559 rpc-test.cc:1859] Sending 1024MB via ssl-enabled unix socket: real 2.763s	user 2.597s	sys 2.116s
I20260925 15:10:17.426249 25559 rpc-test.cc:1859] Sending 1024MB via ssl-enabled unix socket: real 2.900s	user 2.878s	sys 2.110s
I20260925 15:10:20.370664 25559 rpc-test.cc:1859] Sending 1024MB via ssl-enabled unix socket: real 2.944s	user 2.873s	sys 2.163s
[       OK ] Parameters/TestRpc.TestPerformanceBySocketType/SSL_UnixSocket (14162 ms)
[----------] 20 tests from Parameters/TestRpc (46139 ms total)

[----------] 1 test from Parameters/TestRpcSocketTxRxQueue
[ RUN      ] Parameters/TestRpcSocketTxRxQueue.AcceptorRxQueueSizeMetric/0
I20260925 15:10:20.385565 26041 acceptor_pool.cc:254] collecting diagnostics on the listening RPC socket 0.0.0.0:40567 every 1 connection(s)
I20260925 15:10:20.385728 26042 acceptor_pool.cc:254] collecting diagnostics on the listening RPC socket 0.0.0.0:40567 every 1 connection(s)
W20260925 15:10:20.387217 26037 negotiation.cc:337] Failed RPC negotiation. Trace:
0925 15:10:20.386851 (+     0us) reactor.cc:625] Submitting negotiation task for server connection from 127.0.0.1:35226 (local address 127.0.0.1:40567)
0925 15:10:20.386983 (+   132us) server_negotiation.cc:206] Beginning negotiation
0925 15:10:20.386986 (+     3us) server_negotiation.cc:399] Waiting for connection header
0925 15:10:20.387083 (+    97us) negotiation.cc:327] Negotiation complete: Network error: Server connection negotiation failed: server connection from 127.0.0.1:35226: BlockingRecv error: recv got EOF from 127.0.0.1:35226 (error 108)
Metrics: {"server-negotiator.queue_time_us":44}
[       OK ] Parameters/TestRpcSocketTxRxQueue.AcceptorRxQueueSizeMetric/0 (13 ms)
[----------] 1 test from Parameters/TestRpcSocketTxRxQueue (13 ms total)

[----------] Global test environment tear-down
[==========] 21 tests from 2 test suites ran. (46153 ms total)
[  PASSED  ] 20 tests.
[  FAILED  ] 1 test, listed below:
[  FAILED  ] Parameters/TestRpc.TestCallWithChainCertAndChainCA/SSL_UnixSocket, where GetParam() = (true, true)

 1 FAILED TEST