Diagnosed failure
Parameters/TestRpc.TestCallWithChainCertAndChainCA/SSL_UnixSocket: /data0/somelongdirectorytoavoidrpathissues/src/kudu/src/kudu/rpc/rpc-test.cc:270: Failure
Failed
Bad status: Runtime error: could not verify certificate chain (error with cert: subject=CN = localhost, ST = sadfjas, C = AS, emailAddress = sdflkdsajf, O = lskdfjlsad, OU = sldfkja, issuer=C = AS, ST = ASDfkjdhf, L = lskdjf, O = saldfja, OU = skdjf, CN = localhost, emailAddress = sadjflkadsj): : certificate has expired
Google Test trace:
/data0/somelongdirectorytoavoidrpathissues/src/kudu/src/kudu/rpc/rpc-test.cc:267: Connecting to unix:/tmp/dist-test-taskbcFMif/test-tmp/rpc-test-67ee526ea85d4380a1f04783d1d69ca6.sock
I20260928 06:30:54.128120 14462 test_util.cc:175] -----------------------------------------------
I20260928 06:30:54.128175 14462 test_util.cc:176] Had fatal failures, leaving test files at /tmp/dist-test-taskbcFMif/test-tmp/rpc-test.6.Parameters_TestRpc.TestCallWithChainCertAndChainCA_SSL_UnixSocket.1790577054066090-14462-0
Full log
Note: This is test shard 7 of 8.
[==========] Running 21 tests from 2 test suites.
[----------] Global test environment set-up.
[----------] 20 tests from Parameters/TestRpc
[ RUN ] Parameters/TestRpc.TestMessengerCreateDestroy/SSL_UnixSocket
WARNING: Logging before InitGoogleLogging() is written to STDERR
I20260928 06:30:54.087152 14462 rpc-test.cc:169] started messenger TestCreateDestroy
[ OK ] Parameters/TestRpc.TestMessengerCreateDestroy/SSL_UnixSocket (19 ms)
[ RUN ] Parameters/TestRpc.TestNegotiationDeadlock/SSL_UnixSocket
I20260928 06:30:54.102762 14483 acceptor_pool.cc:254] collecting diagnostics on the listening RPC socket unix:/tmp/dist-test-taskbcFMif/test-tmp/rpc-test-205a3cc9cc424d20abb2d10b1b7c2252.sock every 8 connection(s)
I20260928 06:30:54.102762 14482 acceptor_pool.cc:254] collecting diagnostics on the listening RPC socket unix:/tmp/dist-test-taskbcFMif/test-tmp/rpc-test-205a3cc9cc424d20abb2d10b1b7c2252.sock every 8 connection(s)
[ OK ] Parameters/TestRpc.TestNegotiationDeadlock/SSL_UnixSocket (21 ms)
[ RUN ] Parameters/TestRpc.TestCallWithChainCertAndChainCA/SSL_UnixSocket
I20260928 06:30:54.124449 14498 acceptor_pool.cc:254] collecting diagnostics on the listening RPC socket unix:/tmp/dist-test-taskbcFMif/test-tmp/rpc-test-67ee526ea85d4380a1f04783d1d69ca6.sock every 8 connection(s)
I20260928 06:30:54.124487 14499 acceptor_pool.cc:254] collecting diagnostics on the listening RPC socket unix:/tmp/dist-test-taskbcFMif/test-tmp/rpc-test-67ee526ea85d4380a1f04783d1d69ca6.sock every 8 connection(s)
/data0/somelongdirectorytoavoidrpathissues/src/kudu/src/kudu/rpc/rpc-test.cc:270: Failure
Failed
Bad status: Runtime error: could not verify certificate chain (error with cert: subject=CN = localhost, ST = sadfjas, C = AS, emailAddress = sdflkdsajf, O = lskdfjlsad, OU = sldfkja, issuer=C = AS, ST = ASDfkjdhf, L = lskdjf, O = saldfja, OU = skdjf, CN = localhost, emailAddress = sadjflkadsj): : certificate has expired
Google Test trace:
/data0/somelongdirectorytoavoidrpathissues/src/kudu/src/kudu/rpc/rpc-test.cc:267: Connecting to unix:/tmp/dist-test-taskbcFMif/test-tmp/rpc-test-67ee526ea85d4380a1f04783d1d69ca6.sock
I20260928 06:30:54.128120 14462 test_util.cc:175] -----------------------------------------------
I20260928 06:30:54.128175 14462 test_util.cc:176] Had fatal failures, leaving test files at /tmp/dist-test-taskbcFMif/test-tmp/rpc-test.6.Parameters_TestRpc.TestCallWithChainCertAndChainCA_SSL_UnixSocket.1790577054066090-14462-0
[ FAILED ] Parameters/TestRpc.TestCallWithChainCertAndChainCA/SSL_UnixSocket, where GetParam() = (true, true) (18 ms)
[ RUN ] Parameters/TestRpc.TestCallWithPasswordProtectedKey/SSL_UnixSocket
I20260928 06:30:54.139288 14523 acceptor_pool.cc:254] collecting diagnostics on the listening RPC socket unix:/tmp/dist-test-taskbcFMif/test-tmp/rpc-test-cc4f3c10c5844bbd98cb6835c02ca2a8.sock every 8 connection(s)
I20260928 06:30:54.139326 14524 acceptor_pool.cc:254] collecting diagnostics on the listening RPC socket unix:/tmp/dist-test-taskbcFMif/test-tmp/rpc-test-cc4f3c10c5844bbd98cb6835c02ca2a8.sock every 8 connection(s)
W20260928 06:30:54.149816 14520 connection.cc:196] Error closing socket: Network error: TlsSocket::Close: Broken pipe
[ OK ] Parameters/TestRpc.TestCallWithPasswordProtectedKey/SSL_UnixSocket (22 ms)
[ RUN ] Parameters/TestRpc.TestCallToBadServer/SSL_UnixSocket
I20260928 06:30:54.156414 14462 rpc-test.cc:394] Status: Network error: Client connection negotiation failed: client connection to 0.0.0.0:0: connect: Connection refused (error 111)
I20260928 06:30:54.156709 14462 rpc-test.cc:394] Status: Network error: Client connection negotiation failed: client connection to 0.0.0.0:0: connect: Connection refused (error 111)
I20260928 06:30:54.156960 14462 rpc-test.cc:394] Status: Network error: Client connection negotiation failed: client connection to 0.0.0.0:0: connect: Connection refused (error 111)
I20260928 06:30:54.157167 14462 rpc-test.cc:394] Status: Network error: Client connection negotiation failed: client connection to 0.0.0.0:0: connect: Connection refused (error 111)
I20260928 06:30:54.157358 14462 rpc-test.cc:394] Status: Network error: Client connection negotiation failed: client connection to 0.0.0.0:0: connect: Connection refused (error 111)
[ OK ] Parameters/TestRpc.TestCallToBadServer/SSL_UnixSocket (6 ms)
[ RUN ] Parameters/TestRpc.TestWrongService/SSL_UnixSocket
I20260928 06:30:54.181053 14558 acceptor_pool.cc:254] collecting diagnostics on the listening RPC socket unix:/tmp/dist-test-taskbcFMif/test-tmp/rpc-test-572bbab8be344259bd954aa40cf80738.sock every 8 connection(s)
I20260928 06:30:54.181094 14559 acceptor_pool.cc:254] collecting diagnostics on the listening RPC socket unix:/tmp/dist-test-taskbcFMif/test-tmp/rpc-test-572bbab8be344259bd954aa40cf80738.sock every 8 connection(s)
I20260928 06:30:54.199551 14555 messenger.cc:345] service WrongServiceName not registered on TestServer
[ OK ] Parameters/TestRpc.TestWrongService/SSL_UnixSocket (43 ms)
[ RUN ] Parameters/TestRpc.TestConnectionKeepalive/SSL_UnixSocket
I20260928 06:30:54.213953 14581 acceptor_pool.cc:254] collecting diagnostics on the listening RPC socket unix:/tmp/dist-test-taskbcFMif/test-tmp/rpc-test-7c2e43a67511443c8179336115fee884.sock every 8 connection(s)
I20260928 06:30:54.214008 14582 acceptor_pool.cc:254] collecting diagnostics on the listening RPC socket unix:/tmp/dist-test-taskbcFMif/test-tmp/rpc-test-7c2e43a67511443c8179336115fee884.sock every 8 connection(s)
I20260928 06:30:54.214159 14462 rpc-test.cc:488] Connecting to unix:/tmp/dist-test-taskbcFMif/test-tmp/rpc-test-7c2e43a67511443c8179336115fee884.sock
W20260928 06:30:54.701996 14594 connection.cc:196] Error closing socket: Network error: TlsSocket::Close: Broken pipe
[ OK ] Parameters/TestRpc.TestConnectionKeepalive/SSL_UnixSocket (1037 ms)
[ RUN ] Parameters/TestRpc.TestClientConnectionMetrics/SSL_UnixSocket
I20260928 06:30:55.249636 14606 acceptor_pool.cc:254] collecting diagnostics on the listening RPC socket unix:/tmp/dist-test-taskbcFMif/test-tmp/rpc-test-36db6e0f857842e5baa6554d13a503be.sock every 8 connection(s)
I20260928 06:30:55.249706 14607 acceptor_pool.cc:254] collecting diagnostics on the listening RPC socket unix:/tmp/dist-test-taskbcFMif/test-tmp/rpc-test-36db6e0f857842e5baa6554d13a503be.sock every 8 connection(s)
I20260928 06:30:55.249878 14462 rpc-test.cc:569] Connecting to unix:/tmp/dist-test-taskbcFMif/test-tmp/rpc-test-36db6e0f857842e5baa6554d13a503be.sock
W20260928 06:31:03.449779 14603 connection.cc:196] Error closing socket: Network error: TlsSocket::Close: Broken pipe
[ OK ] Parameters/TestRpc.TestClientConnectionMetrics/SSL_UnixSocket (8212 ms)
[ RUN ] Parameters/TestRpc.TestCredentialsPolicy/SSL_UnixSocket
I20260928 06:31:03.465797 14629 acceptor_pool.cc:254] collecting diagnostics on the listening RPC socket unix:/tmp/dist-test-taskbcFMif/test-tmp/rpc-test-64b0c0d295df4ac985e63667af448f75.sock every 8 connection(s)
I20260928 06:31:03.465855 14630 acceptor_pool.cc:254] collecting diagnostics on the listening RPC socket unix:/tmp/dist-test-taskbcFMif/test-tmp/rpc-test-64b0c0d295df4ac985e63667af448f75.sock every 8 connection(s)
I20260928 06:31:03.466018 14462 rpc-test.cc:700] Connecting to unix:/tmp/dist-test-taskbcFMif/test-tmp/rpc-test-64b0c0d295df4ac985e63667af448f75.sock
W20260928 06:31:03.481446 14628 connection.cc:196] Error closing socket: Network error: TlsSocket::Close: Broken pipe
[ OK ] Parameters/TestRpc.TestCredentialsPolicy/SSL_UnixSocket (34 ms)
[ RUN ] Parameters/TestRpc.TestCallLongerThanKeepalive/SSL_UnixSocket
I20260928 06:31:03.504067 14654 acceptor_pool.cc:254] collecting diagnostics on the listening RPC socket unix:/tmp/dist-test-taskbcFMif/test-tmp/rpc-test-9e2a95cb800f44f0ad58db26166bfb15.sock every 8 connection(s)
I20260928 06:31:03.504103 14655 acceptor_pool.cc:254] collecting diagnostics on the listening RPC socket unix:/tmp/dist-test-taskbcFMif/test-tmp/rpc-test-9e2a95cb800f44f0ad58db26166bfb15.sock every 8 connection(s)
I20260928 06:31:03.512720 14658 rpc-test-base.h:222] got call: sleep_micros: 3000000 deferred: true
I20260928 06:31:06.513512 14658 rpcz_store.cc:275] Call kudu.rpc.GenericCalculatorService.Sleep from unix:<unnamed> (request call id 0) took 3000 ms. Trace:
I20260928 06:31:06.513605 14658 rpcz_store.cc:276] 0928 06:31:03.512651 (+ 0us) service_pool.cc:170] Inserting onto call queue
0928 06:31:03.512700 (+ 49us) service_pool.cc:227] Handling call
0928 06:31:06.513499 (+3000799us) inbound_call.cc:173] Queueing success response
Metrics: {}
W20260928 06:31:06.514495 14651 connection.cc:196] Error closing socket: Network error: TlsSocket::Close: Broken pipe
[ OK ] Parameters/TestRpc.TestCallLongerThanKeepalive/SSL_UnixSocket (3029 ms)
[ RUN ] Parameters/TestRpc.TestRpcSidecar/SSL_UnixSocket
I20260928 06:31:06.574687 14679 acceptor_pool.cc:254] collecting diagnostics on the listening RPC socket unix:/tmp/dist-test-taskbcFMif/test-tmp/rpc-test-e45674ec00c54b36a137daa720d95e7a.sock every 8 connection(s)
I20260928 06:31:06.574738 14680 acceptor_pool.cc:254] collecting diagnostics on the listening RPC socket unix:/tmp/dist-test-taskbcFMif/test-tmp/rpc-test-e45674ec00c54b36a137daa720d95e7a.sock every 8 connection(s)
[ OK ] Parameters/TestRpc.TestRpcSidecar/SSL_UnixSocket (101 ms)
[ RUN ] Parameters/TestRpc.TestRpcSidecarLimits/SSL_UnixSocket
I20260928 06:31:09.414928 14704 acceptor_pool.cc:254] collecting diagnostics on the listening RPC socket unix:/tmp/dist-test-taskbcFMif/test-tmp/rpc-test-1372c8b178a240d19ea053164a037b5e.sock every 8 connection(s)
I20260928 06:31:09.414992 14705 acceptor_pool.cc:254] collecting diagnostics on the listening RPC socket unix:/tmp/dist-test-taskbcFMif/test-tmp/rpc-test-1372c8b178a240d19ea053164a037b5e.sock every 8 connection(s)
W20260928 06:31:09.428406 14462 serialization.cc:72] Serialized kudu.rpc_test.PushStringsRequestPB (2147483654 bytes) is larger than the maximum configured RPC message size (52428800 bytes). Sending anyway, but peer may reject the data.
W20260928 06:31:09.431191 14701 connection.cc:535] server connection from unix:<unnamed> recv error: Network error: RPC frame had a length of 2147483714, but we only support messages up to 52428800 bytes long.
W20260928 06:31:09.431236 14701 connection.cc:158] shutting down server connection from unix:<unnamed> with pending inbound data: 4/2147483714 bytes received; last active 0 ns ago: status Network error: RPC frame had a length of 2147483714, but we only support messages up to 52428800 bytes long.
W20260928 06:31:09.431385 14717 connection.cc:196] Error closing socket: Network error: TlsSocket::Close: Broken pipe
I20260928 06:31:09.440799 14729 acceptor_pool.cc:254] collecting diagnostics on the listening RPC socket unix:/tmp/dist-test-taskbcFMif/test-tmp/rpc-test-1372c8b178a240d19ea053164a037b5e.sock every 8 connection(s)
I20260928 06:31:09.440871 14730 acceptor_pool.cc:254] collecting diagnostics on the listening RPC socket unix:/tmp/dist-test-taskbcFMif/test-tmp/rpc-test-1372c8b178a240d19ea053164a037b5e.sock every 8 connection(s)
W20260928 06:31:15.279796 14726 connection.cc:577] server connection from unix:<unnamed>: received bad data: 'Corruption: Invalid packet: message had a length of 2147483710, but we only support messages up to 2147483647 bytes
'
W20260928 06:31:15.280115 14742 connection.cc:196] Error closing socket: Network error: TlsSocket::Close: Broken pipe
[ OK ] Parameters/TestRpc.TestRpcSidecarLimits/SSL_UnixSocket (8664 ms)
[ RUN ] Parameters/TestRpc.TestCallTimeoutDoesntAffectNegotiation/SSL_UnixSocket
I20260928 06:31:15.309720 14754 acceptor_pool.cc:254] collecting diagnostics on the listening RPC socket unix:/tmp/dist-test-taskbcFMif/test-tmp/rpc-test-0bb0f0354c7f454380f987012a2256f8.sock every 8 connection(s)
I20260928 06:31:15.309779 14755 acceptor_pool.cc:254] collecting diagnostics on the listening RPC socket unix:/tmp/dist-test-taskbcFMif/test-tmp/rpc-test-0bb0f0354c7f454380f987012a2256f8.sock every 8 connection(s)
W20260928 06:31:15.335768 14750 negotiation.cc:266] Injecting 500ms delay in negotiation
I20260928 06:31:15.386080 14462 rpc-test-base.h:595] status: Timed out: connection negotiation to unix:/tmp/dist-test-taskbcFMif/test-tmp/rpc-test-0bb0f0354c7f454380f987012a2256f8.sock for RPC Sleep timed out after 0.050s (ON_OUTBOUND_QUEUE), seconds elapsed: 0.0507065
[ OK ] Parameters/TestRpc.TestCallTimeoutDoesntAffectNegotiation/SSL_UnixSocket (558 ms)
[ RUN ] Parameters/TestRpc.TestRpcHandlerLatencyMetric/SSL_UnixSocket
I20260928 06:31:15.846483 14779 acceptor_pool.cc:254] collecting diagnostics on the listening RPC socket unix:/tmp/dist-test-taskbcFMif/test-tmp/rpc-test-85e8011da23f4daf8eb871dba3bf7aaf.sock every 8 connection(s)
I20260928 06:31:15.846486 14780 acceptor_pool.cc:254] collecting diagnostics on the listening RPC socket unix:/tmp/dist-test-taskbcFMif/test-tmp/rpc-test-85e8011da23f4daf8eb871dba3bf7aaf.sock every 8 connection(s)
I20260928 06:31:15.877516 14462 rpc-test.cc:1236] Sleep() min lat: 20221
I20260928 06:31:15.877596 14462 rpc-test.cc:1237] Sleep() mean lat: 20221
I20260928 06:31:15.877631 14462 rpc-test.cc:1238] Sleep() max lat: 20221
I20260928 06:31:15.877676 14462 rpc-test.cc:1239] Sleep() #calls: 1
[ OK ] Parameters/TestRpc.TestRpcHandlerLatencyMetric/SSL_UnixSocket (38 ms)
[ RUN ] Parameters/TestRpc.TimedOutOnResponseMetricServiceQueue/SSL_UnixSocket
I20260928 06:31:15.888837 14805 acceptor_pool.cc:254] collecting diagnostics on the listening RPC socket unix:/tmp/dist-test-taskbcFMif/test-tmp/rpc-test-e286550011354170a9b65f9209acecbb.sock every 8 connection(s)
I20260928 06:31:15.888875 14806 acceptor_pool.cc:254] collecting diagnostics on the listening RPC socket unix:/tmp/dist-test-taskbcFMif/test-tmp/rpc-test-e286550011354170a9b65f9209acecbb.sock every 8 connection(s)
W20260928 06:31:15.973050 14807 rpcz_store.cc:267] Call kudu.rpc_test.CalculatorService.Sleep from unix:<unnamed> (request call id 2) took 20 ms (client timeout 20 ms). Trace:
W20260928 06:31:15.973156 14807 rpcz_store.cc:269] 0928 06:31:15.952828 (+ 0us) service_pool.cc:170] Inserting onto call queue
0928 06:31:15.973005 (+ 20177us) service_pool.cc:214] Skipping call since client already timed out
0928 06:31:15.973034 (+ 29us) inbound_call.cc:173] Queueing failure response
Metrics: {}
[ OK ] Parameters/TestRpc.TimedOutOnResponseMetricServiceQueue/SSL_UnixSocket (95 ms)
[ RUN ] Parameters/TestRpc.RpcPendingConnectionsMetric/SSL_UnixSocket
I20260928 06:31:15.976279 14828 acceptor_pool.cc:254] collecting diagnostics on the listening RPC socket 0.0.0.0:34767 every 8 connection(s)
I20260928 06:31:15.976347 14829 acceptor_pool.cc:254] collecting diagnostics on the listening RPC socket 0.0.0.0:34767 every 8 connection(s)
W20260928 06:31:15.976944 14824 negotiation.cc:337] Failed RPC negotiation. Trace:
0928 06:31:15.976789 (+ 0us) reactor.cc:625] Submitting negotiation task for server connection from 127.0.0.1:57952 (local address 127.0.0.1:34767)
0928 06:31:15.976826 (+ 37us) server_negotiation.cc:206] Beginning negotiation
0928 06:31:15.976828 (+ 2us) server_negotiation.cc:399] Waiting for connection header
0928 06:31:15.976900 (+ 72us) negotiation.cc:327] Negotiation complete: Network error: Server connection negotiation failed: server connection from 127.0.0.1:57952: BlockingRecv error: recv got EOF from 127.0.0.1:57952 (error 108)
Metrics: {"server-negotiator.queue_time_us":12}
[ OK ] Parameters/TestRpc.RpcPendingConnectionsMetric/SSL_UnixSocket (13 ms)
[ RUN ] Parameters/TestRpc.TestRpcContextClientDeadline/SSL_UnixSocket
I20260928 06:31:16.002969 14844 acceptor_pool.cc:254] collecting diagnostics on the listening RPC socket unix:/tmp/dist-test-taskbcFMif/test-tmp/rpc-test-49ef6c8375ed4a61bbfc83c88f6b3dd5.sock every 8 connection(s)
I20260928 06:31:16.003012 14845 acceptor_pool.cc:254] collecting diagnostics on the listening RPC socket unix:/tmp/dist-test-taskbcFMif/test-tmp/rpc-test-49ef6c8375ed4a61bbfc83c88f6b3dd5.sock every 8 connection(s)
[ OK ] Parameters/TestRpc.TestRpcContextClientDeadline/SSL_UnixSocket (51 ms)
[ RUN ] Parameters/TestRpc.TestApplicationFeatureFlagUnsupportedServer/SSL_UnixSocket
I20260928 06:31:16.052906 14869 acceptor_pool.cc:254] collecting diagnostics on the listening RPC socket unix:/tmp/dist-test-taskbcFMif/test-tmp/rpc-test-0105efb32f174ddbb6b09395b3fb7e59.sock every 8 connection(s)
I20260928 06:31:16.052949 14870 acceptor_pool.cc:254] collecting diagnostics on the listening RPC socket unix:/tmp/dist-test-taskbcFMif/test-tmp/rpc-test-0105efb32f174ddbb6b09395b3fb7e59.sock every 8 connection(s)
[ OK ] Parameters/TestRpc.TestApplicationFeatureFlagUnsupportedServer/SSL_UnixSocket (27 ms)
[ RUN ] Parameters/TestRpc.TestCancellationAsync/SSL_UnixSocket
I20260928 06:31:16.081080 14894 acceptor_pool.cc:254] collecting diagnostics on the listening RPC socket unix:/tmp/dist-test-taskbcFMif/test-tmp/rpc-test-06abb1a944e84a68b7241141e8207703.sock every 8 connection(s)
I20260928 06:31:16.081146 14895 acceptor_pool.cc:254] collecting diagnostics on the listening RPC socket unix:/tmp/dist-test-taskbcFMif/test-tmp/rpc-test-06abb1a944e84a68b7241141e8207703.sock every 8 connection(s)
I20260928 06:31:16.081337 14462 rpc-test.cc:1716] Connecting to unix:/tmp/dist-test-taskbcFMif/test-tmp/rpc-test-06abb1a944e84a68b7241141e8207703.sock
I20260928 06:31:16.104367 14462 test_util.cc:268] Using random seed: 915434669
I20260928 06:31:16.121510 14898 rpc-test-base.h:240] got call: sleep_micros: 500 pattern: 4294967295 num_repetitions: 2097152 sidecar_idx: 0
I20260928 06:31:16.134521 14898 rpc-test-base.h:240] got call: sleep_micros: 500 pattern: 4294967295 num_repetitions: 2097152 sidecar_idx: 0
I20260928 06:31:16.147364 14898 rpc-test-base.h:240] got call: sleep_micros: 500 pattern: 4294967295 num_repetitions: 2097152 sidecar_idx: 0
I20260928 06:31:16.160158 14898 rpc-test-base.h:240] got call: sleep_micros: 500 pattern: 4294967295 num_repetitions: 2097152 sidecar_idx: 0
I20260928 06:31:16.172889 14898 rpc-test-base.h:240] got call: sleep_micros: 500 pattern: 4294967295 num_repetitions: 2097152 sidecar_idx: 0
I20260928 06:31:16.185467 14898 rpc-test-base.h:240] got call: sleep_micros: 500 pattern: 4294967295 num_repetitions: 2097152 sidecar_idx: 0
I20260928 06:31:16.196105 14898 rpc-test-base.h:240] got call: sleep_micros: 500 pattern: 4294967295 num_repetitions: 2097152 sidecar_idx: 0
W20260928 06:31:16.197570 14891 connection.cc:196] Error closing socket: Network error: TlsSocket::Close: Broken pipe
W20260928 06:31:16.199188 14891 connection.cc:441] server connection from unix:<unnamed> torn down before Call kudu.rpc.GenericCalculatorService.SleepWithSidecar from unix:<unnamed> (request call id 9) could send its response
[ OK ] Parameters/TestRpc.TestCancellationAsync/SSL_UnixSocket (133 ms)
[ RUN ] Parameters/TestRpc.TestPerformanceBySocketType/SSL_UnixSocket
I20260928 06:31:16.216724 14919 acceptor_pool.cc:254] collecting diagnostics on the listening RPC socket unix:/tmp/dist-test-taskbcFMif/test-tmp/rpc-test-8342d1ae148345e68c234666012baeb3.sock every 8 connection(s)
I20260928 06:31:16.216771 14920 acceptor_pool.cc:254] collecting diagnostics on the listening RPC socket unix:/tmp/dist-test-taskbcFMif/test-tmp/rpc-test-8342d1ae148345e68c234666012baeb3.sock every 8 connection(s)
I20260928 06:31:16.216954 14462 rpc-test.cc:1846] Connecting to unix:/tmp/dist-test-taskbcFMif/test-tmp/rpc-test-8342d1ae148345e68c234666012baeb3.sock
I20260928 06:31:17.384032 14462 rpc-test.cc:1859] Sending 1024MB via ssl-enabled unix socket: real 1.153s user 1.329s sys 0.767s
I20260928 06:31:18.557829 14462 rpc-test.cc:1859] Sending 1024MB via ssl-enabled unix socket: real 1.174s user 1.446s sys 0.673s
I20260928 06:31:19.684263 14462 rpc-test.cc:1859] Sending 1024MB via ssl-enabled unix socket: real 1.126s user 1.268s sys 0.777s
I20260928 06:31:20.850950 14462 rpc-test.cc:1859] Sending 1024MB via ssl-enabled unix socket: real 1.167s user 1.257s sys 0.865s
I20260928 06:31:21.970943 14462 rpc-test.cc:1859] Sending 1024MB via ssl-enabled unix socket: real 1.120s user 1.193s sys 0.844s
[ OK ] Parameters/TestRpc.TestPerformanceBySocketType/SSL_UnixSocket (5771 ms)
[----------] 20 tests from Parameters/TestRpc (27904 ms total)
[----------] 1 test from Parameters/TestRpcSocketTxRxQueue
[ RUN ] Parameters/TestRpcSocketTxRxQueue.AcceptorRxQueueSizeMetric/0
I20260928 06:31:21.978163 14944 acceptor_pool.cc:254] collecting diagnostics on the listening RPC socket 0.0.0.0:40149 every 1 connection(s)
I20260928 06:31:21.978284 14945 acceptor_pool.cc:254] collecting diagnostics on the listening RPC socket 0.0.0.0:40149 every 1 connection(s)
W20260928 06:31:21.978765 14940 negotiation.cc:337] Failed RPC negotiation. Trace:
0928 06:31:21.978624 (+ 0us) reactor.cc:625] Submitting negotiation task for server connection from 127.0.0.1:60714 (local address 127.0.0.1:40149)
0928 06:31:21.978675 (+ 51us) server_negotiation.cc:206] Beginning negotiation
0928 06:31:21.978677 (+ 2us) server_negotiation.cc:399] Waiting for connection header
0928 06:31:21.978735 (+ 58us) negotiation.cc:327] Negotiation complete: Network error: Server connection negotiation failed: server connection from 127.0.0.1:60714: BlockingRecv error: recv got EOF from 127.0.0.1:60714 (error 108)
Metrics: {"server-negotiator.queue_time_us":17}
[ OK ] Parameters/TestRpcSocketTxRxQueue.AcceptorRxQueueSizeMetric/0 (8 ms)
[----------] 1 test from Parameters/TestRpcSocketTxRxQueue (8 ms total)
[----------] Global test environment tear-down
[==========] 21 tests from 2 test suites ran. (27912 ms total)
[ PASSED ] 20 tests.
[ FAILED ] 1 test, listed below:
[ FAILED ] Parameters/TestRpc.TestCallWithChainCertAndChainCA/SSL_UnixSocket, where GetParam() = (true, true)
1 FAILED TEST