Diagnosed failure
Parameters/TestRpc.TestCallWithChainCertAndChainCA/SSL_UnixSocket: /data0/somelongdirectorytoavoidrpathissues/src/kudu/src/kudu/rpc/rpc-test.cc:270: Failure
Failed
Bad status: Runtime error: could not verify certificate chain (error with cert: subject=CN = localhost, ST = sadfjas, C = AS, emailAddress = sdflkdsajf, O = lskdfjlsad, OU = sldfkja, issuer=C = AS, ST = ASDfkjdhf, L = lskdjf, O = saldfja, OU = skdjf, CN = localhost, emailAddress = sadjflkadsj): : certificate has expired
Google Test trace:
/data0/somelongdirectorytoavoidrpathissues/src/kudu/src/kudu/rpc/rpc-test.cc:267: Connecting to unix:/tmp/dist-test-taskpIPpTM/test-tmp/rpc-test-36ae76fc24cc42a4a791f1fef51517f7.sock
I20260925 03:02:48.668304 9607 test_util.cc:175] -----------------------------------------------
I20260925 03:02:48.668501 9607 test_util.cc:176] Had fatal failures, leaving test files at /tmp/dist-test-taskpIPpTM/test-tmp/rpc-test.6.Parameters_TestRpc.TestCallWithChainCertAndChainCA_SSL_UnixSocket.1790305367276636-9607-0
Full log
Note: This is test shard 7 of 8.
[==========] Running 21 tests from 2 test suites.
[----------] Global test environment set-up.
[----------] 20 tests from Parameters/TestRpc
[ RUN ] Parameters/TestRpc.TestMessengerCreateDestroy/SSL_UnixSocket
WARNING: Logging before InitGoogleLogging() is written to STDERR
I20260925 03:02:47.407441 9607 rpc-test.cc:169] started messenger TestCreateDestroy
[ OK ] Parameters/TestRpc.TestMessengerCreateDestroy/SSL_UnixSocket (1161 ms)
[ RUN ] Parameters/TestRpc.TestNegotiationDeadlock/SSL_UnixSocket
I20260925 03:02:48.541285 9629 acceptor_pool.cc:254] collecting diagnostics on the listening RPC socket unix:/tmp/dist-test-taskpIPpTM/test-tmp/rpc-test-f4cbf49af55449d2a1cd12e866242aa0.sock every 8 connection(s)
I20260925 03:02:48.543138 9630 acceptor_pool.cc:254] collecting diagnostics on the listening RPC socket unix:/tmp/dist-test-taskpIPpTM/test-tmp/rpc-test-f4cbf49af55449d2a1cd12e866242aa0.sock every 8 connection(s)
[ OK ] Parameters/TestRpc.TestNegotiationDeadlock/SSL_UnixSocket (95 ms)
[ RUN ] Parameters/TestRpc.TestCallWithChainCertAndChainCA/SSL_UnixSocket
I20260925 03:02:48.632999 9645 acceptor_pool.cc:254] collecting diagnostics on the listening RPC socket unix:/tmp/dist-test-taskpIPpTM/test-tmp/rpc-test-36ae76fc24cc42a4a791f1fef51517f7.sock every 8 connection(s)
I20260925 03:02:48.635536 9646 acceptor_pool.cc:254] collecting diagnostics on the listening RPC socket unix:/tmp/dist-test-taskpIPpTM/test-tmp/rpc-test-36ae76fc24cc42a4a791f1fef51517f7.sock every 8 connection(s)
/data0/somelongdirectorytoavoidrpathissues/src/kudu/src/kudu/rpc/rpc-test.cc:270: Failure
Failed
Bad status: Runtime error: could not verify certificate chain (error with cert: subject=CN = localhost, ST = sadfjas, C = AS, emailAddress = sdflkdsajf, O = lskdfjlsad, OU = sldfkja, issuer=C = AS, ST = ASDfkjdhf, L = lskdjf, O = saldfja, OU = skdjf, CN = localhost, emailAddress = sadjflkadsj): : certificate has expired
Google Test trace:
/data0/somelongdirectorytoavoidrpathissues/src/kudu/src/kudu/rpc/rpc-test.cc:267: Connecting to unix:/tmp/dist-test-taskpIPpTM/test-tmp/rpc-test-36ae76fc24cc42a4a791f1fef51517f7.sock
I20260925 03:02:48.668304 9607 test_util.cc:175] -----------------------------------------------
I20260925 03:02:48.668501 9607 test_util.cc:176] Had fatal failures, leaving test files at /tmp/dist-test-taskpIPpTM/test-tmp/rpc-test.6.Parameters_TestRpc.TestCallWithChainCertAndChainCA_SSL_UnixSocket.1790305367276636-9607-0
[ FAILED ] Parameters/TestRpc.TestCallWithChainCertAndChainCA/SSL_UnixSocket, where GetParam() = (true, true) (65 ms)
[ RUN ] Parameters/TestRpc.TestCallWithPasswordProtectedKey/SSL_UnixSocket
I20260925 03:02:48.696448 9670 acceptor_pool.cc:254] collecting diagnostics on the listening RPC socket unix:/tmp/dist-test-taskpIPpTM/test-tmp/rpc-test-39c36f8c37dd4bd7885f7db38e474c42.sock every 8 connection(s)
I20260925 03:02:48.697171 9671 acceptor_pool.cc:254] collecting diagnostics on the listening RPC socket unix:/tmp/dist-test-taskpIPpTM/test-tmp/rpc-test-39c36f8c37dd4bd7885f7db38e474c42.sock every 8 connection(s)
W20260925 03:02:48.750898 9667 connection.cc:196] Error closing socket: Network error: TlsSocket::Close: Broken pipe
[ OK ] Parameters/TestRpc.TestCallWithPasswordProtectedKey/SSL_UnixSocket (88 ms)
[ RUN ] Parameters/TestRpc.TestCallToBadServer/SSL_UnixSocket
I20260925 03:02:48.784585 9607 rpc-test.cc:394] Status: Network error: Client connection negotiation failed: client connection to 0.0.0.0:0: connect: Connection refused (error 111)
I20260925 03:02:48.786183 9607 rpc-test.cc:394] Status: Network error: Client connection negotiation failed: client connection to 0.0.0.0:0: connect: Connection refused (error 111)
I20260925 03:02:48.787516 9607 rpc-test.cc:394] Status: Network error: Client connection negotiation failed: client connection to 0.0.0.0:0: connect: Connection refused (error 111)
I20260925 03:02:48.788790 9607 rpc-test.cc:394] Status: Network error: Client connection negotiation failed: client connection to 0.0.0.0:0: connect: Connection refused (error 111)
I20260925 03:02:48.790093 9607 rpc-test.cc:394] Status: Network error: Client connection negotiation failed: client connection to 0.0.0.0:0: connect: Connection refused (error 111)
[ OK ] Parameters/TestRpc.TestCallToBadServer/SSL_UnixSocket (35 ms)
[ RUN ] Parameters/TestRpc.TestWrongService/SSL_UnixSocket
I20260925 03:02:48.832818 9705 acceptor_pool.cc:254] collecting diagnostics on the listening RPC socket unix:/tmp/dist-test-taskpIPpTM/test-tmp/rpc-test-bb7eeaf191a64a9cbb586324f548cda4.sock every 8 connection(s)
I20260925 03:02:48.833564 9706 acceptor_pool.cc:254] collecting diagnostics on the listening RPC socket unix:/tmp/dist-test-taskpIPpTM/test-tmp/rpc-test-bb7eeaf191a64a9cbb586324f548cda4.sock every 8 connection(s)
I20260925 03:02:48.867875 9702 messenger.cc:345] service WrongServiceName not registered on TestServer
[ OK ] Parameters/TestRpc.TestWrongService/SSL_UnixSocket (83 ms)
[ RUN ] Parameters/TestRpc.TestConnectionKeepalive/SSL_UnixSocket
I20260925 03:02:48.893862 9728 acceptor_pool.cc:254] collecting diagnostics on the listening RPC socket unix:/tmp/dist-test-taskpIPpTM/test-tmp/rpc-test-033a24f79b594558a4f40bad78332f58.sock every 8 connection(s)
I20260925 03:02:48.894608 9729 acceptor_pool.cc:254] collecting diagnostics on the listening RPC socket unix:/tmp/dist-test-taskpIPpTM/test-tmp/rpc-test-033a24f79b594558a4f40bad78332f58.sock every 8 connection(s)
I20260925 03:02:48.897794 9607 rpc-test.cc:488] Connecting to unix:/tmp/dist-test-taskpIPpTM/test-tmp/rpc-test-033a24f79b594558a4f40bad78332f58.sock
W20260925 03:02:49.379874 9741 connection.cc:196] Error closing socket: Network error: TlsSocket::Close: Broken pipe
[ OK ] Parameters/TestRpc.TestConnectionKeepalive/SSL_UnixSocket (1075 ms)
[ RUN ] Parameters/TestRpc.TestClientConnectionMetrics/SSL_UnixSocket
I20260925 03:02:49.974740 9754 acceptor_pool.cc:254] collecting diagnostics on the listening RPC socket unix:/tmp/dist-test-taskpIPpTM/test-tmp/rpc-test-ef59e529cc3d4a2eba42dcb427f886ea.sock every 8 connection(s)
I20260925 03:02:49.975448 9755 acceptor_pool.cc:254] collecting diagnostics on the listening RPC socket unix:/tmp/dist-test-taskpIPpTM/test-tmp/rpc-test-ef59e529cc3d4a2eba42dcb427f886ea.sock every 8 connection(s)
I20260925 03:02:49.978842 9607 rpc-test.cc:569] Connecting to unix:/tmp/dist-test-taskpIPpTM/test-tmp/rpc-test-ef59e529cc3d4a2eba42dcb427f886ea.sock
W20260925 03:05:04.488456 9751 connection.cc:196] Error closing socket: Network error: TlsSocket::Close: Broken pipe
[ OK ] Parameters/TestRpc.TestClientConnectionMetrics/SSL_UnixSocket (134544 ms)
[ RUN ] Parameters/TestRpc.TestCredentialsPolicy/SSL_UnixSocket
I20260925 03:05:04.526098 9790 acceptor_pool.cc:254] collecting diagnostics on the listening RPC socket unix:/tmp/dist-test-taskpIPpTM/test-tmp/rpc-test-508f36ea240a4f92aea1af86b598bca5.sock every 8 connection(s)
I20260925 03:05:04.526999 9791 acceptor_pool.cc:254] collecting diagnostics on the listening RPC socket unix:/tmp/dist-test-taskpIPpTM/test-tmp/rpc-test-508f36ea240a4f92aea1af86b598bca5.sock every 8 connection(s)
I20260925 03:05:04.530184 9607 rpc-test.cc:700] Connecting to unix:/tmp/dist-test-taskpIPpTM/test-tmp/rpc-test-508f36ea240a4f92aea1af86b598bca5.sock
W20260925 03:05:04.572968 9789 connection.cc:196] Error closing socket: Network error: TlsSocket::Close: Broken pipe
[ OK ] Parameters/TestRpc.TestCredentialsPolicy/SSL_UnixSocket (98 ms)
[ RUN ] Parameters/TestRpc.TestCallLongerThanKeepalive/SSL_UnixSocket
I20260925 03:05:04.616798 9815 acceptor_pool.cc:254] collecting diagnostics on the listening RPC socket unix:/tmp/dist-test-taskpIPpTM/test-tmp/rpc-test-7f0d456c8fe3414e906f3d632832a585.sock every 8 connection(s)
I20260925 03:05:04.617519 9816 acceptor_pool.cc:254] collecting diagnostics on the listening RPC socket unix:/tmp/dist-test-taskpIPpTM/test-tmp/rpc-test-7f0d456c8fe3414e906f3d632832a585.sock every 8 connection(s)
I20260925 03:05:04.647894 9820 rpc-test-base.h:222] got call: sleep_micros: 3000000 deferred: true
I20260925 03:05:07.652542 9820 rpcz_store.cc:275] Call kudu.rpc.GenericCalculatorService.Sleep from unix:<unnamed> (request call id 0) took 3004 ms. Trace:
I20260925 03:05:07.652985 9820 rpcz_store.cc:276] 0925 03:05:04.647711 (+ 0us) service_pool.cc:170] Inserting onto call queue
0925 03:05:04.647827 (+ 116us) service_pool.cc:227] Handling call
0925 03:05:07.652307 (+3004480us) inbound_call.cc:173] Queueing success response
Metrics: {}
W20260925 03:05:07.657703 9812 connection.cc:196] Error closing socket: Network error: TlsSocket::Close: Broken pipe
[ OK ] Parameters/TestRpc.TestCallLongerThanKeepalive/SSL_UnixSocket (3070 ms)
[ RUN ] Parameters/TestRpc.TestRpcSidecar/SSL_UnixSocket
I20260925 03:05:07.691462 9842 acceptor_pool.cc:254] collecting diagnostics on the listening RPC socket unix:/tmp/dist-test-taskpIPpTM/test-tmp/rpc-test-8c39b9b64d3e4b4da1eec16cec796380.sock every 8 connection(s)
I20260925 03:05:07.692267 9843 acceptor_pool.cc:254] collecting diagnostics on the listening RPC socket unix:/tmp/dist-test-taskpIPpTM/test-tmp/rpc-test-8c39b9b64d3e4b4da1eec16cec796380.sock every 8 connection(s)
W20260925 03:05:08.220795 9839 connection.cc:196] Error closing socket: Network error: TlsSocket::Close: Broken pipe
[ OK ] Parameters/TestRpc.TestRpcSidecar/SSL_UnixSocket (560 ms)
[ RUN ] Parameters/TestRpc.TestRpcSidecarLimits/SSL_UnixSocket
I20260925 03:05:28.387624 9869 acceptor_pool.cc:254] collecting diagnostics on the listening RPC socket unix:/tmp/dist-test-taskpIPpTM/test-tmp/rpc-test-77a92a50f3284411a20ec1600d1c3c28.sock every 8 connection(s)
I20260925 03:05:28.388417 9870 acceptor_pool.cc:254] collecting diagnostics on the listening RPC socket unix:/tmp/dist-test-taskpIPpTM/test-tmp/rpc-test-77a92a50f3284411a20ec1600d1c3c28.sock every 8 connection(s)
W20260925 03:05:28.431941 9607 serialization.cc:72] Serialized kudu.rpc_test.PushStringsRequestPB (2147483654 bytes) is larger than the maximum configured RPC message size (52428800 bytes). Sending anyway, but peer may reject the data.
W20260925 03:05:28.442687 9866 connection.cc:535] server connection from unix:<unnamed> recv error: Network error: RPC frame had a length of 2147483714, but we only support messages up to 52428800 bytes long.
W20260925 03:05:28.443084 9866 connection.cc:158] shutting down server connection from unix:<unnamed> with pending inbound data: 4/2147483714 bytes received; last active 0 ns ago: status Network error: RPC frame had a length of 2147483714, but we only support messages up to 52428800 bytes long.
W20260925 03:05:28.444113 9882 connection.cc:196] Error closing socket: Network error: TlsSocket::Close: Broken pipe
[ OK ] Parameters/TestRpc.TestRpcSidecarLimits/SSL_UnixSocket (20811 ms)
[ RUN ] Parameters/TestRpc.TestCallTimeoutDoesntAffectNegotiation/SSL_UnixSocket
I20260925 03:05:29.068125 9895 acceptor_pool.cc:254] collecting diagnostics on the listening RPC socket unix:/tmp/dist-test-taskpIPpTM/test-tmp/rpc-test-b88d88aded8d42e089b251b7e715bffc.sock every 8 connection(s)
I20260925 03:05:29.068820 9896 acceptor_pool.cc:254] collecting diagnostics on the listening RPC socket unix:/tmp/dist-test-taskpIPpTM/test-tmp/rpc-test-b88d88aded8d42e089b251b7e715bffc.sock every 8 connection(s)
W20260925 03:05:29.102276 9891 negotiation.cc:266] Injecting 500ms delay in negotiation
I20260925 03:05:29.151777 9607 rpc-test-base.h:595] status: Timed out: connection negotiation to unix:/tmp/dist-test-taskpIPpTM/test-tmp/rpc-test-b88d88aded8d42e089b251b7e715bffc.sock for RPC Sleep timed out after 0.050s (ON_OUTBOUND_QUEUE), seconds elapsed: 0.0505974
[ OK ] Parameters/TestRpc.TestCallTimeoutDoesntAffectNegotiation/SSL_UnixSocket (580 ms)
[ RUN ] Parameters/TestRpc.TestRpcHandlerLatencyMetric/SSL_UnixSocket
I20260925 03:05:29.639102 9920 acceptor_pool.cc:254] collecting diagnostics on the listening RPC socket unix:/tmp/dist-test-taskpIPpTM/test-tmp/rpc-test-e57a4e1ebaf046bdb1e3706bc6342a43.sock every 8 connection(s)
I20260925 03:05:29.639818 9921 acceptor_pool.cc:254] collecting diagnostics on the listening RPC socket unix:/tmp/dist-test-taskpIPpTM/test-tmp/rpc-test-e57a4e1ebaf046bdb1e3706bc6342a43.sock every 8 connection(s)
I20260925 03:05:29.689913 9607 rpc-test.cc:1236] Sleep() min lat: 21633
I20260925 03:05:29.690157 9607 rpc-test.cc:1237] Sleep() mean lat: 21633
I20260925 03:05:29.690325 9607 rpc-test.cc:1238] Sleep() max lat: 21633
I20260925 03:05:29.690490 9607 rpc-test.cc:1239] Sleep() #calls: 1
W20260925 03:05:29.693220 9917 connection.cc:196] Error closing socket: Network error: TlsSocket::Close: Broken pipe
[ OK ] Parameters/TestRpc.TestRpcHandlerLatencyMetric/SSL_UnixSocket (79 ms)
[ RUN ] Parameters/TestRpc.TimedOutOnResponseMetricServiceQueue/SSL_UnixSocket
I20260925 03:05:29.717034 9946 acceptor_pool.cc:254] collecting diagnostics on the listening RPC socket unix:/tmp/dist-test-taskpIPpTM/test-tmp/rpc-test-354184764a434f23abcdd16dd026470e.sock every 8 connection(s)
I20260925 03:05:29.717727 9947 acceptor_pool.cc:254] collecting diagnostics on the listening RPC socket unix:/tmp/dist-test-taskpIPpTM/test-tmp/rpc-test-354184764a434f23abcdd16dd026470e.sock every 8 connection(s)
W20260925 03:05:29.793964 9948 rpcz_store.cc:267] Call kudu.rpc_test.CalculatorService.Sleep from unix:<unnamed> (request call id 2) took 20 ms (client timeout 20 ms). Trace:
W20260925 03:05:29.794354 9948 rpcz_store.cc:269] 0925 03:05:29.773548 (+ 0us) service_pool.cc:170] Inserting onto call queue
0925 03:05:29.793785 (+ 20237us) service_pool.cc:214] Skipping call since client already timed out
0925 03:05:29.793872 (+ 87us) inbound_call.cc:173] Queueing failure response
Metrics: {}
[ OK ] Parameters/TestRpc.TimedOutOnResponseMetricServiceQueue/SSL_UnixSocket (103 ms)
[ RUN ] Parameters/TestRpc.RpcPendingConnectionsMetric/SSL_UnixSocket
I20260925 03:05:29.811173 9969 acceptor_pool.cc:254] collecting diagnostics on the listening RPC socket 0.0.0.0:35187 every 8 connection(s)
I20260925 03:05:29.811862 9970 acceptor_pool.cc:254] collecting diagnostics on the listening RPC socket 0.0.0.0:35187 every 8 connection(s)
W20260925 03:05:29.816883 9965 negotiation.cc:337] Failed RPC negotiation. Trace:
0925 03:05:29.815683 (+ 0us) reactor.cc:625] Submitting negotiation task for server connection from 127.0.0.1:41776 (local address 127.0.0.1:35187)
0925 03:05:29.816101 (+ 418us) server_negotiation.cc:206] Beginning negotiation
0925 03:05:29.816119 (+ 18us) server_negotiation.cc:399] Waiting for connection header
0925 03:05:29.816353 (+ 234us) negotiation.cc:327] Negotiation complete: Network error: Server connection negotiation failed: server connection from 127.0.0.1:41776: BlockingRecv error: recv got EOF from 127.0.0.1:41776 (error 108)
Metrics: {"server-negotiator.queue_time_us":104}
[ OK ] Parameters/TestRpc.RpcPendingConnectionsMetric/SSL_UnixSocket (28 ms)
[ RUN ] Parameters/TestRpc.TestRpcContextClientDeadline/SSL_UnixSocket
I20260925 03:05:29.858071 9986 acceptor_pool.cc:254] collecting diagnostics on the listening RPC socket unix:/tmp/dist-test-taskpIPpTM/test-tmp/rpc-test-9dce2604f1344a9eb22d9e2dc6272314.sock every 8 connection(s)
I20260925 03:05:29.858767 9987 acceptor_pool.cc:254] collecting diagnostics on the listening RPC socket unix:/tmp/dist-test-taskpIPpTM/test-tmp/rpc-test-9dce2604f1344a9eb22d9e2dc6272314.sock every 8 connection(s)
W20260925 03:05:29.928673 9983 connection.cc:196] Error closing socket: Network error: TlsSocket::Close: Broken pipe
[ OK ] Parameters/TestRpc.TestRpcContextClientDeadline/SSL_UnixSocket (103 ms)
[ RUN ] Parameters/TestRpc.TestApplicationFeatureFlagUnsupportedServer/SSL_UnixSocket
I20260925 03:05:29.960420 10011 acceptor_pool.cc:254] collecting diagnostics on the listening RPC socket unix:/tmp/dist-test-taskpIPpTM/test-tmp/rpc-test-9ef166a0a5c14525a8545c030899dfd4.sock every 8 connection(s)
I20260925 03:05:29.961028 10012 acceptor_pool.cc:254] collecting diagnostics on the listening RPC socket unix:/tmp/dist-test-taskpIPpTM/test-tmp/rpc-test-9ef166a0a5c14525a8545c030899dfd4.sock every 8 connection(s)
W20260925 03:05:29.991752 10008 connection.cc:196] Error closing socket: Network error: TlsSocket::Close: Broken pipe
[ OK ] Parameters/TestRpc.TestApplicationFeatureFlagUnsupportedServer/SSL_UnixSocket (62 ms)
[ RUN ] Parameters/TestRpc.TestCancellationAsync/SSL_UnixSocket
I20260925 03:05:30.011761 10036 acceptor_pool.cc:254] collecting diagnostics on the listening RPC socket unix:/tmp/dist-test-taskpIPpTM/test-tmp/rpc-test-c91b8ce02e6d4983921ed89d305d5277.sock every 8 connection(s)
I20260925 03:05:30.012449 10037 acceptor_pool.cc:254] collecting diagnostics on the listening RPC socket unix:/tmp/dist-test-taskpIPpTM/test-tmp/rpc-test-c91b8ce02e6d4983921ed89d305d5277.sock every 8 connection(s)
I20260925 03:05:30.015596 9607 rpc-test.cc:1716] Connecting to unix:/tmp/dist-test-taskpIPpTM/test-tmp/rpc-test-c91b8ce02e6d4983921ed89d305d5277.sock
I20260925 03:05:30.048323 9607 test_util.cc:268] Using random seed: -47681752
I20260925 03:05:30.277405 10040 rpc-test-base.h:240] got call: sleep_micros: 500 pattern: 4294967295 num_repetitions: 2097152 sidecar_idx: 0
I20260925 03:05:30.469703 10039 rpc-test-base.h:240] got call: sleep_micros: 500 pattern: 4294967295 num_repetitions: 2097152 sidecar_idx: 0
I20260925 03:05:30.709937 10040 rpc-test-base.h:240] got call: sleep_micros: 500 pattern: 4294967295 num_repetitions: 2097152 sidecar_idx: 0
I20260925 03:05:30.895972 10039 rpc-test-base.h:240] got call: sleep_micros: 500 pattern: 4294967295 num_repetitions: 2097152 sidecar_idx: 0
I20260925 03:05:31.116510 10040 rpc-test-base.h:240] got call: sleep_micros: 500 pattern: 4294967295 num_repetitions: 2097152 sidecar_idx: 0
I20260925 03:05:31.327682 10040 rpc-test-base.h:240] got call: sleep_micros: 500 pattern: 4294967295 num_repetitions: 2097152 sidecar_idx: 0
I20260925 03:05:31.525362 10040 rpc-test-base.h:240] got call: sleep_micros: 500 pattern: 4294967295 num_repetitions: 2097152 sidecar_idx: 0
I20260925 03:05:31.737076 10040 rpc-test-base.h:240] got call: sleep_micros: 500 pattern: 4294967295 num_repetitions: 2097152 sidecar_idx: 0
I20260925 03:05:31.942536 10039 rpc-test-base.h:240] got call: sleep_micros: 500 pattern: 4294967295 num_repetitions: 2097152 sidecar_idx: 0
W20260925 03:05:31.964560 10033 connection.cc:196] Error closing socket: Network error: TlsSocket::Close: Broken pipe
W20260925 03:05:31.964854 10033 connection.cc:441] server connection from unix:<unnamed> torn down before Call kudu.rpc.GenericCalculatorService.SleepWithSidecar from unix:<unnamed> (request call id 8) could send its response
W20260925 03:05:32.090416 10033 connection.cc:441] server connection from unix:<unnamed> torn down before Call kudu.rpc.GenericCalculatorService.SleepWithSidecar from unix:<unnamed> (request call id 9) could send its response
[ OK ] Parameters/TestRpc.TestCancellationAsync/SSL_UnixSocket (2103 ms)
[ RUN ] Parameters/TestRpc.TestPerformanceBySocketType/SSL_UnixSocket
I20260925 03:05:32.187918 10061 acceptor_pool.cc:254] collecting diagnostics on the listening RPC socket unix:/tmp/dist-test-taskpIPpTM/test-tmp/rpc-test-3d70fae44e704f00954fa3e6471e9158.sock every 8 connection(s)
I20260925 03:05:32.188614 10062 acceptor_pool.cc:254] collecting diagnostics on the listening RPC socket unix:/tmp/dist-test-taskpIPpTM/test-tmp/rpc-test-3d70fae44e704f00954fa3e6471e9158.sock every 8 connection(s)
I20260925 03:05:32.191787 9607 rpc-test.cc:1846] Connecting to unix:/tmp/dist-test-taskpIPpTM/test-tmp/rpc-test-3d70fae44e704f00954fa3e6471e9158.sock
I20260925 03:05:53.779165 9607 rpc-test.cc:1859] Sending 1024MB via ssl-enabled unix socket: real 21.571s user 19.810s sys 12.672s
I20260925 03:06:15.406703 9607 rpc-test.cc:1859] Sending 1024MB via ssl-enabled unix socket: real 21.627s user 19.820s sys 12.775s
I20260925 03:06:36.443377 9607 rpc-test.cc:1859] Sending 1024MB via ssl-enabled unix socket: real 21.036s user 18.803s sys 12.582s
I20260925 03:06:57.779075 9607 rpc-test.cc:1859] Sending 1024MB via ssl-enabled unix socket: real 21.335s user 19.184s sys 12.726s
I20260925 03:07:19.090735 9607 rpc-test.cc:1859] Sending 1024MB via ssl-enabled unix socket: real 21.311s user 19.155s sys 12.825s
W20260925 03:07:19.096781 10058 connection.cc:196] Error closing socket: Network error: TlsSocket::Close: Broken pipe
[ OK ] Parameters/TestRpc.TestPerformanceBySocketType/SSL_UnixSocket (107008 ms)
[----------] 20 tests from Parameters/TestRpc (271764 ms total)
[----------] 1 test from Parameters/TestRpcSocketTxRxQueue
[ RUN ] Parameters/TestRpcSocketTxRxQueue.AcceptorRxQueueSizeMetric/0
I20260925 03:07:19.128724 10097 acceptor_pool.cc:254] collecting diagnostics on the listening RPC socket 0.0.0.0:33319 every 1 connection(s)
I20260925 03:07:19.129580 10098 acceptor_pool.cc:254] collecting diagnostics on the listening RPC socket 0.0.0.0:33319 every 1 connection(s)
W20260925 03:07:19.134960 10093 negotiation.cc:337] Failed RPC negotiation. Trace:
0925 03:07:19.133456 (+ 0us) reactor.cc:625] Submitting negotiation task for server connection from 127.0.0.1:37526 (local address 127.0.0.1:33319)
0925 03:07:19.133981 (+ 525us) server_negotiation.cc:206] Beginning negotiation
0925 03:07:19.134008 (+ 27us) server_negotiation.cc:399] Waiting for connection header
0925 03:07:19.134246 (+ 238us) negotiation.cc:327] Negotiation complete: Network error: Server connection negotiation failed: server connection from 127.0.0.1:37526: BlockingRecv error: recv got EOF from 127.0.0.1:37526 (error 108)
Metrics: {"server-negotiator.queue_time_us":135}
[ OK ] Parameters/TestRpcSocketTxRxQueue.AcceptorRxQueueSizeMetric/0 (33 ms)
[----------] 1 test from Parameters/TestRpcSocketTxRxQueue (33 ms total)
[----------] Global test environment tear-down
[==========] 21 tests from 2 test suites ran. (271798 ms total)
[ PASSED ] 20 tests.
[ FAILED ] 1 test, listed below:
[ FAILED ] Parameters/TestRpc.TestCallWithChainCertAndChainCA/SSL_UnixSocket, where GetParam() = (true, true)
1 FAILED TEST