Diagnosed failure
Parameters/TestRpc.TestCallWithChainCertAndChainCA/SSL_UnixSocket: /data0/somelongdirectorytoavoidrpathissues/src/kudu/src/kudu/rpc/rpc-test.cc:270: Failure
Failed
Bad status: Runtime error: could not verify certificate chain (error with cert: subject=CN = localhost, ST = sadfjas, C = AS, emailAddress = sdflkdsajf, O = lskdfjlsad, OU = sldfkja, issuer=C = AS, ST = ASDfkjdhf, L = lskdjf, O = saldfja, OU = skdjf, CN = localhost, emailAddress = sadjflkadsj): : certificate has expired
Google Test trace:
/data0/somelongdirectorytoavoidrpathissues/src/kudu/src/kudu/rpc/rpc-test.cc:267: Connecting to unix:/tmp/dist-test-taskIdMRKI/test-tmp/rpc-test-921ecd4ccc4849a2bc6f626fddd43d82.sock
I20260929 19:01:17.195675 771 test_util.cc:175] -----------------------------------------------
I20260929 19:01:17.195736 771 test_util.cc:176] Had fatal failures, leaving test files at /tmp/dist-test-taskIdMRKI/test-tmp/rpc-test.6.Parameters_TestRpc.TestCallWithChainCertAndChainCA_SSL_UnixSocket.1790708477141476-771-0
Full log
Note: This is test shard 7 of 8.
[==========] Running 21 tests from 2 test suites.
[----------] Global test environment set-up.
[----------] 20 tests from Parameters/TestRpc
[ RUN ] Parameters/TestRpc.TestMessengerCreateDestroy/SSL_UnixSocket
WARNING: Logging before InitGoogleLogging() is written to STDERR
I20260929 19:01:17.164212 771 rpc-test.cc:169] started messenger TestCreateDestroy
[ OK ] Parameters/TestRpc.TestMessengerCreateDestroy/SSL_UnixSocket (21 ms)
[ RUN ] Parameters/TestRpc.TestNegotiationDeadlock/SSL_UnixSocket
I20260929 19:01:17.172147 791 acceptor_pool.cc:254] collecting diagnostics on the listening RPC socket unix:/tmp/dist-test-taskIdMRKI/test-tmp/rpc-test-526ea63435fc4175952cd1f8e067560c.sock every 8 connection(s)
I20260929 19:01:17.172151 792 acceptor_pool.cc:254] collecting diagnostics on the listening RPC socket unix:/tmp/dist-test-taskIdMRKI/test-tmp/rpc-test-526ea63435fc4175952cd1f8e067560c.sock every 8 connection(s)
[ OK ] Parameters/TestRpc.TestNegotiationDeadlock/SSL_UnixSocket (13 ms)
[ RUN ] Parameters/TestRpc.TestCallWithChainCertAndChainCA/SSL_UnixSocket
I20260929 19:01:17.191610 808 acceptor_pool.cc:254] collecting diagnostics on the listening RPC socket unix:/tmp/dist-test-taskIdMRKI/test-tmp/rpc-test-921ecd4ccc4849a2bc6f626fddd43d82.sock every 8 connection(s)
I20260929 19:01:17.191610 807 acceptor_pool.cc:254] collecting diagnostics on the listening RPC socket unix:/tmp/dist-test-taskIdMRKI/test-tmp/rpc-test-921ecd4ccc4849a2bc6f626fddd43d82.sock every 8 connection(s)
/data0/somelongdirectorytoavoidrpathissues/src/kudu/src/kudu/rpc/rpc-test.cc:270: Failure
Failed
Bad status: Runtime error: could not verify certificate chain (error with cert: subject=CN = localhost, ST = sadfjas, C = AS, emailAddress = sdflkdsajf, O = lskdfjlsad, OU = sldfkja, issuer=C = AS, ST = ASDfkjdhf, L = lskdjf, O = saldfja, OU = skdjf, CN = localhost, emailAddress = sadjflkadsj): : certificate has expired
Google Test trace:
/data0/somelongdirectorytoavoidrpathissues/src/kudu/src/kudu/rpc/rpc-test.cc:267: Connecting to unix:/tmp/dist-test-taskIdMRKI/test-tmp/rpc-test-921ecd4ccc4849a2bc6f626fddd43d82.sock
I20260929 19:01:17.195675 771 test_util.cc:175] -----------------------------------------------
I20260929 19:01:17.195736 771 test_util.cc:176] Had fatal failures, leaving test files at /tmp/dist-test-taskIdMRKI/test-tmp/rpc-test.6.Parameters_TestRpc.TestCallWithChainCertAndChainCA_SSL_UnixSocket.1790708477141476-771-0
[ FAILED ] Parameters/TestRpc.TestCallWithChainCertAndChainCA/SSL_UnixSocket, where GetParam() = (true, true) (16 ms)
[ RUN ] Parameters/TestRpc.TestCallWithPasswordProtectedKey/SSL_UnixSocket
I20260929 19:01:17.223400 832 acceptor_pool.cc:254] collecting diagnostics on the listening RPC socket unix:/tmp/dist-test-taskIdMRKI/test-tmp/rpc-test-fb0e963b1910486e862a816fa5411d77.sock every 8 connection(s)
I20260929 19:01:17.223430 833 acceptor_pool.cc:254] collecting diagnostics on the listening RPC socket unix:/tmp/dist-test-taskIdMRKI/test-tmp/rpc-test-fb0e963b1910486e862a816fa5411d77.sock every 8 connection(s)
W20260929 19:01:17.235610 829 connection.cc:196] Error closing socket: Network error: TlsSocket::Close: Broken pipe
[ OK ] Parameters/TestRpc.TestCallWithPasswordProtectedKey/SSL_UnixSocket (41 ms)
[ RUN ] Parameters/TestRpc.TestCallToBadServer/SSL_UnixSocket
I20260929 19:01:17.250269 771 rpc-test.cc:394] Status: Network error: Client connection negotiation failed: client connection to 0.0.0.0:0: connect: Connection refused (error 111)
I20260929 19:01:17.250694 771 rpc-test.cc:394] Status: Network error: Client connection negotiation failed: client connection to 0.0.0.0:0: connect: Connection refused (error 111)
I20260929 19:01:17.250942 771 rpc-test.cc:394] Status: Network error: Client connection negotiation failed: client connection to 0.0.0.0:0: connect: Connection refused (error 111)
I20260929 19:01:17.251125 771 rpc-test.cc:394] Status: Network error: Client connection negotiation failed: client connection to 0.0.0.0:0: connect: Connection refused (error 111)
I20260929 19:01:17.251298 771 rpc-test.cc:394] Status: Network error: Client connection negotiation failed: client connection to 0.0.0.0:0: connect: Connection refused (error 111)
[ OK ] Parameters/TestRpc.TestCallToBadServer/SSL_UnixSocket (15 ms)
[ RUN ] Parameters/TestRpc.TestWrongService/SSL_UnixSocket
I20260929 19:01:17.275910 867 acceptor_pool.cc:254] collecting diagnostics on the listening RPC socket unix:/tmp/dist-test-taskIdMRKI/test-tmp/rpc-test-96ff6144cedf41738fa660f1e58beaf8.sock every 8 connection(s)
I20260929 19:01:17.275962 868 acceptor_pool.cc:254] collecting diagnostics on the listening RPC socket unix:/tmp/dist-test-taskIdMRKI/test-tmp/rpc-test-96ff6144cedf41738fa660f1e58beaf8.sock every 8 connection(s)
I20260929 19:01:17.293694 864 messenger.cc:345] service WrongServiceName not registered on TestServer
W20260929 19:01:17.294497 864 connection.cc:196] Error closing socket: Network error: TlsSocket::Close: Broken pipe
[ OK ] Parameters/TestRpc.TestWrongService/SSL_UnixSocket (43 ms)
[ RUN ] Parameters/TestRpc.TestConnectionKeepalive/SSL_UnixSocket
I20260929 19:01:17.326994 890 acceptor_pool.cc:254] collecting diagnostics on the listening RPC socket unix:/tmp/dist-test-taskIdMRKI/test-tmp/rpc-test-76c68e8fd6824f0ab0f790eacccae698.sock every 8 connection(s)
I20260929 19:01:17.327044 891 acceptor_pool.cc:254] collecting diagnostics on the listening RPC socket unix:/tmp/dist-test-taskIdMRKI/test-tmp/rpc-test-76c68e8fd6824f0ab0f790eacccae698.sock every 8 connection(s)
I20260929 19:01:17.327216 771 rpc-test.cc:488] Connecting to unix:/tmp/dist-test-taskIdMRKI/test-tmp/rpc-test-76c68e8fd6824f0ab0f790eacccae698.sock
W20260929 19:01:17.797727 903 connection.cc:196] Error closing socket: Network error: TlsSocket::Close: Broken pipe
[ OK ] Parameters/TestRpc.TestConnectionKeepalive/SSL_UnixSocket (1047 ms)
[ RUN ] Parameters/TestRpc.TestClientConnectionMetrics/SSL_UnixSocket
I20260929 19:01:18.374352 915 acceptor_pool.cc:254] collecting diagnostics on the listening RPC socket unix:/tmp/dist-test-taskIdMRKI/test-tmp/rpc-test-a651d7ea79d448f3af5c0117a85bd951.sock every 8 connection(s)
I20260929 19:01:18.374408 916 acceptor_pool.cc:254] collecting diagnostics on the listening RPC socket unix:/tmp/dist-test-taskIdMRKI/test-tmp/rpc-test-a651d7ea79d448f3af5c0117a85bd951.sock every 8 connection(s)
I20260929 19:01:18.374595 771 rpc-test.cc:569] Connecting to unix:/tmp/dist-test-taskIdMRKI/test-tmp/rpc-test-a651d7ea79d448f3af5c0117a85bd951.sock
W20260929 19:01:28.159884 912 connection.cc:196] Error closing socket: Network error: TlsSocket::Close: Broken pipe
[ OK ] Parameters/TestRpc.TestClientConnectionMetrics/SSL_UnixSocket (9818 ms)
[ RUN ] Parameters/TestRpc.TestCredentialsPolicy/SSL_UnixSocket
I20260929 19:01:28.179878 938 acceptor_pool.cc:254] collecting diagnostics on the listening RPC socket unix:/tmp/dist-test-taskIdMRKI/test-tmp/rpc-test-ddbf8f78bfa54afdae6afcc6f7666f73.sock every 8 connection(s)
I20260929 19:01:28.179917 939 acceptor_pool.cc:254] collecting diagnostics on the listening RPC socket unix:/tmp/dist-test-taskIdMRKI/test-tmp/rpc-test-ddbf8f78bfa54afdae6afcc6f7666f73.sock every 8 connection(s)
I20260929 19:01:28.180123 771 rpc-test.cc:700] Connecting to unix:/tmp/dist-test-taskIdMRKI/test-tmp/rpc-test-ddbf8f78bfa54afdae6afcc6f7666f73.sock
W20260929 19:01:28.215082 937 connection.cc:196] Error closing socket: Network error: TlsSocket::Close: Broken pipe
[ OK ] Parameters/TestRpc.TestCredentialsPolicy/SSL_UnixSocket (59 ms)
[ RUN ] Parameters/TestRpc.TestCallLongerThanKeepalive/SSL_UnixSocket
I20260929 19:01:28.231573 963 acceptor_pool.cc:254] collecting diagnostics on the listening RPC socket unix:/tmp/dist-test-taskIdMRKI/test-tmp/rpc-test-07477d92e44d42d191599ad197e8245f.sock every 8 connection(s)
I20260929 19:01:28.231607 964 acceptor_pool.cc:254] collecting diagnostics on the listening RPC socket unix:/tmp/dist-test-taskIdMRKI/test-tmp/rpc-test-07477d92e44d42d191599ad197e8245f.sock every 8 connection(s)
I20260929 19:01:28.242831 967 rpc-test-base.h:222] got call: sleep_micros: 3000000 deferred: true
I20260929 19:01:31.243726 967 rpcz_store.cc:275] Call kudu.rpc.GenericCalculatorService.Sleep from unix:<unnamed> (request call id 0) took 3000 ms. Trace:
I20260929 19:01:31.243868 967 rpcz_store.cc:276] 0929 19:01:28.242775 (+ 0us) service_pool.cc:170] Inserting onto call queue
0929 19:01:28.242810 (+ 35us) service_pool.cc:227] Handling call
0929 19:01:31.243679 (+3000869us) inbound_call.cc:173] Queueing success response
Metrics: {}
[ OK ] Parameters/TestRpc.TestCallLongerThanKeepalive/SSL_UnixSocket (3025 ms)
[ RUN ] Parameters/TestRpc.TestRpcSidecar/SSL_UnixSocket
I20260929 19:01:31.271787 988 acceptor_pool.cc:254] collecting diagnostics on the listening RPC socket unix:/tmp/dist-test-taskIdMRKI/test-tmp/rpc-test-052d8cc0e5a04964ac68a5a60491a9d8.sock every 8 connection(s)
I20260929 19:01:31.271852 989 acceptor_pool.cc:254] collecting diagnostics on the listening RPC socket unix:/tmp/dist-test-taskIdMRKI/test-tmp/rpc-test-052d8cc0e5a04964ac68a5a60491a9d8.sock every 8 connection(s)
[ OK ] Parameters/TestRpc.TestRpcSidecar/SSL_UnixSocket (65 ms)
[ RUN ] Parameters/TestRpc.TestRpcSidecarLimits/SSL_UnixSocket
I20260929 19:01:33.196740 1013 acceptor_pool.cc:254] collecting diagnostics on the listening RPC socket unix:/tmp/dist-test-taskIdMRKI/test-tmp/rpc-test-36c1566462874f52aefc826902c9cdf0.sock every 8 connection(s)
I20260929 19:01:33.196741 1014 acceptor_pool.cc:254] collecting diagnostics on the listening RPC socket unix:/tmp/dist-test-taskIdMRKI/test-tmp/rpc-test-36c1566462874f52aefc826902c9cdf0.sock every 8 connection(s)
W20260929 19:01:33.204803 771 serialization.cc:72] Serialized kudu.rpc_test.PushStringsRequestPB (2147483654 bytes) is larger than the maximum configured RPC message size (52428800 bytes). Sending anyway, but peer may reject the data.
W20260929 19:01:33.208055 1010 connection.cc:535] server connection from unix:<unnamed> recv error: Network error: RPC frame had a length of 2147483714, but we only support messages up to 52428800 bytes long.
W20260929 19:01:33.208115 1010 connection.cc:158] shutting down server connection from unix:<unnamed> with pending inbound data: 4/2147483714 bytes received; last active 0 ns ago: status Network error: RPC frame had a length of 2147483714, but we only support messages up to 52428800 bytes long.
W20260929 19:01:33.208304 1026 connection.cc:196] Error closing socket: Network error: TlsSocket::Close: Broken pipe
I20260929 19:01:33.216333 1039 acceptor_pool.cc:254] collecting diagnostics on the listening RPC socket unix:/tmp/dist-test-taskIdMRKI/test-tmp/rpc-test-36c1566462874f52aefc826902c9cdf0.sock every 8 connection(s)
I20260929 19:01:33.216329 1038 acceptor_pool.cc:254] collecting diagnostics on the listening RPC socket unix:/tmp/dist-test-taskIdMRKI/test-tmp/rpc-test-36c1566462874f52aefc826902c9cdf0.sock every 8 connection(s)
W20260929 19:01:37.670933 1035 connection.cc:577] server connection from unix:<unnamed>: received bad data: 'Corruption: Invalid packet: message had a length of 2147483710, but we only support messages up to 2147483647 bytes
'
W20260929 19:01:37.671314 1051 connection.cc:196] Error closing socket: Network error: TlsSocket::Close: Broken pipe
[ OK ] Parameters/TestRpc.TestRpcSidecarLimits/SSL_UnixSocket (6361 ms)
[ RUN ] Parameters/TestRpc.TestCallTimeoutDoesntAffectNegotiation/SSL_UnixSocket
I20260929 19:01:37.696123 1063 acceptor_pool.cc:254] collecting diagnostics on the listening RPC socket unix:/tmp/dist-test-taskIdMRKI/test-tmp/rpc-test-9f05dbb4dad04a838f638dea75ee738a.sock every 8 connection(s)
I20260929 19:01:37.696166 1064 acceptor_pool.cc:254] collecting diagnostics on the listening RPC socket unix:/tmp/dist-test-taskIdMRKI/test-tmp/rpc-test-9f05dbb4dad04a838f638dea75ee738a.sock every 8 connection(s)
W20260929 19:01:37.711426 1059 negotiation.cc:266] Injecting 500ms delay in negotiation
I20260929 19:01:37.761754 771 rpc-test-base.h:595] status: Timed out: connection negotiation to unix:/tmp/dist-test-taskIdMRKI/test-tmp/rpc-test-9f05dbb4dad04a838f638dea75ee738a.sock for RPC Sleep timed out after 0.050s (ON_OUTBOUND_QUEUE), seconds elapsed: 0.0506836
[ OK ] Parameters/TestRpc.TestCallTimeoutDoesntAffectNegotiation/SSL_UnixSocket (548 ms)
[ RUN ] Parameters/TestRpc.TestRpcHandlerLatencyMetric/SSL_UnixSocket
I20260929 19:01:38.229265 1088 acceptor_pool.cc:254] collecting diagnostics on the listening RPC socket unix:/tmp/dist-test-taskIdMRKI/test-tmp/rpc-test-e8107044082a4c8ba7b42022b72bc1ca.sock every 8 connection(s)
I20260929 19:01:38.229321 1089 acceptor_pool.cc:254] collecting diagnostics on the listening RPC socket unix:/tmp/dist-test-taskIdMRKI/test-tmp/rpc-test-e8107044082a4c8ba7b42022b72bc1ca.sock every 8 connection(s)
I20260929 19:01:38.266129 771 rpc-test.cc:1236] Sleep() min lat: 20341
I20260929 19:01:38.266247 771 rpc-test.cc:1237] Sleep() mean lat: 20341
I20260929 19:01:38.266278 771 rpc-test.cc:1238] Sleep() max lat: 20341
I20260929 19:01:38.266289 771 rpc-test.cc:1239] Sleep() #calls: 1
[ OK ] Parameters/TestRpc.TestRpcHandlerLatencyMetric/SSL_UnixSocket (46 ms)
[ RUN ] Parameters/TestRpc.TimedOutOnResponseMetricServiceQueue/SSL_UnixSocket
I20260929 19:01:38.288805 1114 acceptor_pool.cc:254] collecting diagnostics on the listening RPC socket unix:/tmp/dist-test-taskIdMRKI/test-tmp/rpc-test-85eee3c67163433ba217935d13976299.sock every 8 connection(s)
I20260929 19:01:38.288839 1115 acceptor_pool.cc:254] collecting diagnostics on the listening RPC socket unix:/tmp/dist-test-taskIdMRKI/test-tmp/rpc-test-85eee3c67163433ba217935d13976299.sock every 8 connection(s)
W20260929 19:01:38.348824 1116 rpcz_store.cc:267] Call kudu.rpc_test.CalculatorService.Sleep from unix:<unnamed> (request call id 2) took 20 ms (client timeout 20 ms). Trace:
W20260929 19:01:38.348953 1116 rpcz_store.cc:269] 0929 19:01:38.328507 (+ 0us) service_pool.cc:170] Inserting onto call queue
0929 19:01:38.348784 (+ 20277us) service_pool.cc:214] Skipping call since client already timed out
0929 19:01:38.348800 (+ 16us) inbound_call.cc:173] Queueing failure response
Metrics: {}
W20260929 19:01:38.349542 1111 connection.cc:196] Error closing socket: Network error: TlsSocket::Close: Broken pipe
[ OK ] Parameters/TestRpc.TimedOutOnResponseMetricServiceQueue/SSL_UnixSocket (82 ms)
[ RUN ] Parameters/TestRpc.RpcPendingConnectionsMetric/SSL_UnixSocket
I20260929 19:01:38.352423 1137 acceptor_pool.cc:254] collecting diagnostics on the listening RPC socket 0.0.0.0:41641 every 8 connection(s)
I20260929 19:01:38.352461 1138 acceptor_pool.cc:254] collecting diagnostics on the listening RPC socket 0.0.0.0:41641 every 8 connection(s)
W20260929 19:01:38.363098 1132 negotiation.cc:337] Failed RPC negotiation. Trace:
0929 19:01:38.362858 (+ 0us) reactor.cc:625] Submitting negotiation task for server connection from 127.0.0.1:48068 (local address 127.0.0.1:41641)
0929 19:01:38.362925 (+ 67us) server_negotiation.cc:206] Beginning negotiation
0929 19:01:38.362927 (+ 2us) server_negotiation.cc:399] Waiting for connection header
0929 19:01:38.363004 (+ 77us) negotiation.cc:327] Negotiation complete: Network error: Server connection negotiation failed: server connection from 127.0.0.1:48068: BlockingRecv error: recv got EOF from 127.0.0.1:48068 (error 108)
Metrics: {"server-negotiator.queue_time_us":28}
[ OK ] Parameters/TestRpc.RpcPendingConnectionsMetric/SSL_UnixSocket (23 ms)
[ RUN ] Parameters/TestRpc.TestRpcContextClientDeadline/SSL_UnixSocket
I20260929 19:01:38.385530 1153 acceptor_pool.cc:254] collecting diagnostics on the listening RPC socket unix:/tmp/dist-test-taskIdMRKI/test-tmp/rpc-test-b1e9ceed002a4717a557a5e65c744b95.sock every 8 connection(s)
I20260929 19:01:38.385588 1154 acceptor_pool.cc:254] collecting diagnostics on the listening RPC socket unix:/tmp/dist-test-taskIdMRKI/test-tmp/rpc-test-b1e9ceed002a4717a557a5e65c744b95.sock every 8 connection(s)
W20260929 19:01:38.430608 1150 connection.cc:196] Error closing socket: Network error: TlsSocket::Close: Broken pipe
[ OK ] Parameters/TestRpc.TestRpcContextClientDeadline/SSL_UnixSocket (57 ms)
[ RUN ] Parameters/TestRpc.TestApplicationFeatureFlagUnsupportedServer/SSL_UnixSocket
I20260929 19:01:38.457062 1178 acceptor_pool.cc:254] collecting diagnostics on the listening RPC socket unix:/tmp/dist-test-taskIdMRKI/test-tmp/rpc-test-5595f9b8d5c24ddd8fbf30102ae59247.sock every 8 connection(s)
I20260929 19:01:38.457114 1179 acceptor_pool.cc:254] collecting diagnostics on the listening RPC socket unix:/tmp/dist-test-taskIdMRKI/test-tmp/rpc-test-5595f9b8d5c24ddd8fbf30102ae59247.sock every 8 connection(s)
W20260929 19:01:38.483974 1175 connection.cc:196] Error closing socket: Network error: TlsSocket::Close: Broken pipe
[ OK ] Parameters/TestRpc.TestApplicationFeatureFlagUnsupportedServer/SSL_UnixSocket (53 ms)
[ RUN ] Parameters/TestRpc.TestCancellationAsync/SSL_UnixSocket
I20260929 19:01:38.493961 1203 acceptor_pool.cc:254] collecting diagnostics on the listening RPC socket unix:/tmp/dist-test-taskIdMRKI/test-tmp/rpc-test-7b533dbe4b22438a9f3e9f523274f2e2.sock every 8 connection(s)
I20260929 19:01:38.494010 1204 acceptor_pool.cc:254] collecting diagnostics on the listening RPC socket unix:/tmp/dist-test-taskIdMRKI/test-tmp/rpc-test-7b533dbe4b22438a9f3e9f523274f2e2.sock every 8 connection(s)
I20260929 19:01:38.494223 771 rpc-test.cc:1716] Connecting to unix:/tmp/dist-test-taskIdMRKI/test-tmp/rpc-test-7b533dbe4b22438a9f3e9f523274f2e2.sock
I20260929 19:01:38.498411 771 test_util.cc:268] Using random seed: -806157465
I20260929 19:01:38.514809 1207 rpc-test-base.h:240] got call: sleep_micros: 500 pattern: 4294967295 num_repetitions: 2097152 sidecar_idx: 0
I20260929 19:01:38.528321 1207 rpc-test-base.h:240] got call: sleep_micros: 500 pattern: 4294967295 num_repetitions: 2097152 sidecar_idx: 0
I20260929 19:01:38.541519 1207 rpc-test-base.h:240] got call: sleep_micros: 500 pattern: 4294967295 num_repetitions: 2097152 sidecar_idx: 0
I20260929 19:01:38.554489 1207 rpc-test-base.h:240] got call: sleep_micros: 500 pattern: 4294967295 num_repetitions: 2097152 sidecar_idx: 0
I20260929 19:01:38.567752 1207 rpc-test-base.h:240] got call: sleep_micros: 500 pattern: 4294967295 num_repetitions: 2097152 sidecar_idx: 0
I20260929 19:01:38.581302 1207 rpc-test-base.h:240] got call: sleep_micros: 500 pattern: 4294967295 num_repetitions: 2097152 sidecar_idx: 0
I20260929 19:01:38.595134 1207 rpc-test-base.h:240] got call: sleep_micros: 500 pattern: 4294967295 num_repetitions: 2097152 sidecar_idx: 0
I20260929 19:01:38.609299 1207 rpc-test-base.h:240] got call: sleep_micros: 500 pattern: 4294967295 num_repetitions: 2097152 sidecar_idx: 0
I20260929 19:01:38.621951 1207 rpc-test-base.h:240] got call: sleep_micros: 500 pattern: 4294967295 num_repetitions: 2097152 sidecar_idx: 0
W20260929 19:01:38.624533 1200 connection.cc:196] Error closing socket: Network error: TlsSocket::Close: Broken pipe
W20260929 19:01:38.625976 1200 connection.cc:441] server connection from unix:<unnamed> torn down before Call kudu.rpc.GenericCalculatorService.SleepWithSidecar from unix:<unnamed> (request call id 9) could send its response
[ OK ] Parameters/TestRpc.TestCancellationAsync/SSL_UnixSocket (142 ms)
[ RUN ] Parameters/TestRpc.TestPerformanceBySocketType/SSL_UnixSocket
I20260929 19:01:38.642763 1228 acceptor_pool.cc:254] collecting diagnostics on the listening RPC socket unix:/tmp/dist-test-taskIdMRKI/test-tmp/rpc-test-208241732b4a4e2b87a70efac3234951.sock every 8 connection(s)
I20260929 19:01:38.642812 1229 acceptor_pool.cc:254] collecting diagnostics on the listening RPC socket unix:/tmp/dist-test-taskIdMRKI/test-tmp/rpc-test-208241732b4a4e2b87a70efac3234951.sock every 8 connection(s)
I20260929 19:01:38.642987 771 rpc-test.cc:1846] Connecting to unix:/tmp/dist-test-taskIdMRKI/test-tmp/rpc-test-208241732b4a4e2b87a70efac3234951.sock
I20260929 19:01:40.135986 771 rpc-test.cc:1859] Sending 1024MB via ssl-enabled unix socket: real 1.485s user 1.867s sys 0.727s
I20260929 19:01:41.616395 771 rpc-test.cc:1859] Sending 1024MB via ssl-enabled unix socket: real 1.480s user 1.563s sys 1.009s
I20260929 19:01:43.055128 771 rpc-test.cc:1859] Sending 1024MB via ssl-enabled unix socket: real 1.439s user 1.675s sys 0.836s
I20260929 19:01:44.500414 771 rpc-test.cc:1859] Sending 1024MB via ssl-enabled unix socket: real 1.445s user 1.632s sys 0.899s
I20260929 19:01:45.937474 771 rpc-test.cc:1859] Sending 1024MB via ssl-enabled unix socket: real 1.437s user 1.672s sys 0.834s
W20260929 19:01:45.938212 1225 connection.cc:196] Error closing socket: Network error: TlsSocket::Close: Broken pipe
[ OK ] Parameters/TestRpc.TestPerformanceBySocketType/SSL_UnixSocket (7311 ms)
[----------] 20 tests from Parameters/TestRpc (28794 ms total)
[----------] 1 test from Parameters/TestRpcSocketTxRxQueue
[ RUN ] Parameters/TestRpcSocketTxRxQueue.AcceptorRxQueueSizeMetric/0
I20260929 19:01:45.944963 1253 acceptor_pool.cc:254] collecting diagnostics on the listening RPC socket 0.0.0.0:41313 every 1 connection(s)
I20260929 19:01:45.945097 1254 acceptor_pool.cc:254] collecting diagnostics on the listening RPC socket 0.0.0.0:41313 every 1 connection(s)
W20260929 19:01:45.945722 1249 negotiation.cc:337] Failed RPC negotiation. Trace:
0929 19:01:45.945560 (+ 0us) reactor.cc:625] Submitting negotiation task for server connection from 127.0.0.1:40040 (local address 127.0.0.1:41313)
0929 19:01:45.945611 (+ 51us) server_negotiation.cc:206] Beginning negotiation
0929 19:01:45.945613 (+ 2us) server_negotiation.cc:399] Waiting for connection header
0929 19:01:45.945677 (+ 64us) negotiation.cc:327] Negotiation complete: Network error: Server connection negotiation failed: server connection from 127.0.0.1:40040: BlockingRecv error: recv got EOF from 127.0.0.1:40040 (error 108)
Metrics: {"server-negotiator.queue_time_us":20}
[ OK ] Parameters/TestRpcSocketTxRxQueue.AcceptorRxQueueSizeMetric/0 (8 ms)
[----------] 1 test from Parameters/TestRpcSocketTxRxQueue (8 ms total)
[----------] Global test environment tear-down
[==========] 21 tests from 2 test suites ran. (28803 ms total)
[ PASSED ] 20 tests.
[ FAILED ] 1 test, listed below:
[ FAILED ] Parameters/TestRpc.TestCallWithChainCertAndChainCA/SSL_UnixSocket, where GetParam() = (true, true)
1 FAILED TEST