Diagnosed failure

Parameters/TestRpc.TestCallWithChainCertAndChainCA/SSL_UnixSocket: /data0/somelongdirectorytoavoidrpathissues/src/kudu/src/kudu/rpc/rpc-test.cc:270: Failure
Failed
Bad status: Runtime error: could not verify certificate chain (error with cert: subject=CN = localhost, ST = sadfjas, C = AS, emailAddress = sdflkdsajf, O = lskdfjlsad, OU = sldfkja, issuer=C = AS, ST = ASDfkjdhf, L = lskdjf, O = saldfja, OU = skdjf, CN = localhost, emailAddress = sadjflkadsj): : certificate has expired
Google Test trace:
/data0/somelongdirectorytoavoidrpathissues/src/kudu/src/kudu/rpc/rpc-test.cc:267: Connecting to unix:/tmp/dist-test-taskgEQD9s/test-tmp/rpc-test-348cacf6c8fa4c02b190b2f934823a88.sock
I20260923 14:36:19.616966  2749 test_util.cc:175] -----------------------------------------------
I20260923 14:36:19.617022  2749 test_util.cc:176] Had fatal failures, leaving test files at /tmp/dist-test-taskgEQD9s/test-tmp/rpc-test.6.Parameters_TestRpc.TestCallWithChainCertAndChainCA_SSL_UnixSocket.1790174179564039-2749-0

Full log

Note: This is test shard 7 of 8.
[==========] Running 21 tests from 2 test suites.
[----------] Global test environment set-up.
[----------] 20 tests from Parameters/TestRpc
[ RUN      ] Parameters/TestRpc.TestMessengerCreateDestroy/SSL_UnixSocket
WARNING: Logging before InitGoogleLogging() is written to STDERR
I20260923 14:36:19.584457  2749 rpc-test.cc:169] started messenger TestCreateDestroy
[       OK ] Parameters/TestRpc.TestMessengerCreateDestroy/SSL_UnixSocket (15 ms)
[ RUN      ] Parameters/TestRpc.TestNegotiationDeadlock/SSL_UnixSocket
I20260923 14:36:19.594827  2769 acceptor_pool.cc:254] collecting diagnostics on the listening RPC socket unix:/tmp/dist-test-taskgEQD9s/test-tmp/rpc-test-0673037ef5d64eb8b0496cb66307cd96.sock every 8 connection(s)
I20260923 14:36:19.594882  2770 acceptor_pool.cc:254] collecting diagnostics on the listening RPC socket unix:/tmp/dist-test-taskgEQD9s/test-tmp/rpc-test-0673037ef5d64eb8b0496cb66307cd96.sock every 8 connection(s)
[       OK ] Parameters/TestRpc.TestNegotiationDeadlock/SSL_UnixSocket (18 ms)
[ RUN      ] Parameters/TestRpc.TestCallWithChainCertAndChainCA/SSL_UnixSocket
I20260923 14:36:19.611533  2785 acceptor_pool.cc:254] collecting diagnostics on the listening RPC socket unix:/tmp/dist-test-taskgEQD9s/test-tmp/rpc-test-348cacf6c8fa4c02b190b2f934823a88.sock every 8 connection(s)
I20260923 14:36:19.611588  2786 acceptor_pool.cc:254] collecting diagnostics on the listening RPC socket unix:/tmp/dist-test-taskgEQD9s/test-tmp/rpc-test-348cacf6c8fa4c02b190b2f934823a88.sock every 8 connection(s)
/data0/somelongdirectorytoavoidrpathissues/src/kudu/src/kudu/rpc/rpc-test.cc:270: Failure
Failed
Bad status: Runtime error: could not verify certificate chain (error with cert: subject=CN = localhost, ST = sadfjas, C = AS, emailAddress = sdflkdsajf, O = lskdfjlsad, OU = sldfkja, issuer=C = AS, ST = ASDfkjdhf, L = lskdjf, O = saldfja, OU = skdjf, CN = localhost, emailAddress = sadjflkadsj): : certificate has expired
Google Test trace:
/data0/somelongdirectorytoavoidrpathissues/src/kudu/src/kudu/rpc/rpc-test.cc:267: Connecting to unix:/tmp/dist-test-taskgEQD9s/test-tmp/rpc-test-348cacf6c8fa4c02b190b2f934823a88.sock
I20260923 14:36:19.616966  2749 test_util.cc:175] -----------------------------------------------
I20260923 14:36:19.617022  2749 test_util.cc:176] Had fatal failures, leaving test files at /tmp/dist-test-taskgEQD9s/test-tmp/rpc-test.6.Parameters_TestRpc.TestCallWithChainCertAndChainCA_SSL_UnixSocket.1790174179564039-2749-0
[  FAILED  ] Parameters/TestRpc.TestCallWithChainCertAndChainCA/SSL_UnixSocket, where GetParam() = (true, true) (11 ms)
[ RUN      ] Parameters/TestRpc.TestCallWithPasswordProtectedKey/SSL_UnixSocket
I20260923 14:36:19.639988  2810 acceptor_pool.cc:254] collecting diagnostics on the listening RPC socket unix:/tmp/dist-test-taskgEQD9s/test-tmp/rpc-test-f84a564fec40489f85b7239da4dd5448.sock every 8 connection(s)
I20260923 14:36:19.640007  2811 acceptor_pool.cc:254] collecting diagnostics on the listening RPC socket unix:/tmp/dist-test-taskgEQD9s/test-tmp/rpc-test-f84a564fec40489f85b7239da4dd5448.sock every 8 connection(s)
W20260923 14:36:19.655162  2807 connection.cc:196] Error closing socket: Network error: TlsSocket::Close: Broken pipe
[       OK ] Parameters/TestRpc.TestCallWithPasswordProtectedKey/SSL_UnixSocket (39 ms)
[ RUN      ] Parameters/TestRpc.TestCallToBadServer/SSL_UnixSocket
I20260923 14:36:19.667757  2749 rpc-test.cc:394] Status: Network error: Client connection negotiation failed: client connection to 0.0.0.0:0: connect: Connection refused (error 111)
I20260923 14:36:19.668220  2749 rpc-test.cc:394] Status: Network error: Client connection negotiation failed: client connection to 0.0.0.0:0: connect: Connection refused (error 111)
I20260923 14:36:19.668610  2749 rpc-test.cc:394] Status: Network error: Client connection negotiation failed: client connection to 0.0.0.0:0: connect: Connection refused (error 111)
I20260923 14:36:19.668992  2749 rpc-test.cc:394] Status: Network error: Client connection negotiation failed: client connection to 0.0.0.0:0: connect: Connection refused (error 111)
I20260923 14:36:19.669376  2749 rpc-test.cc:394] Status: Network error: Client connection negotiation failed: client connection to 0.0.0.0:0: connect: Connection refused (error 111)
[       OK ] Parameters/TestRpc.TestCallToBadServer/SSL_UnixSocket (13 ms)
[ RUN      ] Parameters/TestRpc.TestWrongService/SSL_UnixSocket
I20260923 14:36:19.690153  2845 acceptor_pool.cc:254] collecting diagnostics on the listening RPC socket unix:/tmp/dist-test-taskgEQD9s/test-tmp/rpc-test-ec6996b684e1441faa274d57725e3c6b.sock every 8 connection(s)
I20260923 14:36:19.690181  2846 acceptor_pool.cc:254] collecting diagnostics on the listening RPC socket unix:/tmp/dist-test-taskgEQD9s/test-tmp/rpc-test-ec6996b684e1441faa274d57725e3c6b.sock every 8 connection(s)
I20260923 14:36:19.703413  2842 messenger.cc:345] service WrongServiceName not registered on TestServer
[       OK ] Parameters/TestRpc.TestWrongService/SSL_UnixSocket (35 ms)
[ RUN      ] Parameters/TestRpc.TestConnectionKeepalive/SSL_UnixSocket
I20260923 14:36:19.731252  2868 acceptor_pool.cc:254] collecting diagnostics on the listening RPC socket unix:/tmp/dist-test-taskgEQD9s/test-tmp/rpc-test-bb6b8e30e484451ab8e3e28c18690d6e.sock every 8 connection(s)
I20260923 14:36:19.731297  2869 acceptor_pool.cc:254] collecting diagnostics on the listening RPC socket unix:/tmp/dist-test-taskgEQD9s/test-tmp/rpc-test-bb6b8e30e484451ab8e3e28c18690d6e.sock every 8 connection(s)
I20260923 14:36:19.731585  2749 rpc-test.cc:488] Connecting to unix:/tmp/dist-test-taskgEQD9s/test-tmp/rpc-test-bb6b8e30e484451ab8e3e28c18690d6e.sock
W20260923 14:36:20.207438  2881 connection.cc:196] Error closing socket: Network error: TlsSocket::Close: Broken pipe
[       OK ] Parameters/TestRpc.TestConnectionKeepalive/SSL_UnixSocket (1062 ms)
[ RUN      ] Parameters/TestRpc.TestClientConnectionMetrics/SSL_UnixSocket
I20260923 14:36:20.786486  2893 acceptor_pool.cc:254] collecting diagnostics on the listening RPC socket unix:/tmp/dist-test-taskgEQD9s/test-tmp/rpc-test-cd6fa4e013dd4661918e11a5cc55a05a.sock every 8 connection(s)
I20260923 14:36:20.786512  2894 acceptor_pool.cc:254] collecting diagnostics on the listening RPC socket unix:/tmp/dist-test-taskgEQD9s/test-tmp/rpc-test-cd6fa4e013dd4661918e11a5cc55a05a.sock every 8 connection(s)
I20260923 14:36:20.786831  2749 rpc-test.cc:569] Connecting to unix:/tmp/dist-test-taskgEQD9s/test-tmp/rpc-test-cd6fa4e013dd4661918e11a5cc55a05a.sock
W20260923 14:36:31.757723  2890 connection.cc:196] Error closing socket: Network error: TlsSocket::Close: Broken pipe
[       OK ] Parameters/TestRpc.TestClientConnectionMetrics/SSL_UnixSocket (10990 ms)
[ RUN      ] Parameters/TestRpc.TestCredentialsPolicy/SSL_UnixSocket
I20260923 14:36:31.771961  2916 acceptor_pool.cc:254] collecting diagnostics on the listening RPC socket unix:/tmp/dist-test-taskgEQD9s/test-tmp/rpc-test-d7833c8e3e554f8db91a66e8fec62ce5.sock every 8 connection(s)
I20260923 14:36:31.772092  2917 acceptor_pool.cc:254] collecting diagnostics on the listening RPC socket unix:/tmp/dist-test-taskgEQD9s/test-tmp/rpc-test-d7833c8e3e554f8db91a66e8fec62ce5.sock every 8 connection(s)
I20260923 14:36:31.772387  2749 rpc-test.cc:700] Connecting to unix:/tmp/dist-test-taskgEQD9s/test-tmp/rpc-test-d7833c8e3e554f8db91a66e8fec62ce5.sock
W20260923 14:36:31.795017  2915 connection.cc:196] Error closing socket: Network error: TlsSocket::Close: Broken pipe
W20260923 14:36:31.800113  2915 connection.cc:196] Error closing socket: Network error: TlsSocket::Close: Broken pipe
[       OK ] Parameters/TestRpc.TestCredentialsPolicy/SSL_UnixSocket (42 ms)
[ RUN      ] Parameters/TestRpc.TestCallLongerThanKeepalive/SSL_UnixSocket
I20260923 14:36:31.814396  2942 acceptor_pool.cc:254] collecting diagnostics on the listening RPC socket unix:/tmp/dist-test-taskgEQD9s/test-tmp/rpc-test-31e849ca087e4221b14f0dbcf54163f0.sock every 8 connection(s)
I20260923 14:36:31.814374  2941 acceptor_pool.cc:254] collecting diagnostics on the listening RPC socket unix:/tmp/dist-test-taskgEQD9s/test-tmp/rpc-test-31e849ca087e4221b14f0dbcf54163f0.sock every 8 connection(s)
I20260923 14:36:31.853744  2945 rpc-test-base.h:222] got call: sleep_micros: 3000000 deferred: true
I20260923 14:36:34.855057  2945 rpcz_store.cc:275] Call kudu.rpc.GenericCalculatorService.Sleep from unix:<unnamed> (request call id 0) took 3001 ms. Trace:
I20260923 14:36:34.855188  2945 rpcz_store.cc:276] 0923 14:36:31.853635 (+     0us) service_pool.cc:170] Inserting onto call queue
0923 14:36:31.853716 (+    81us) service_pool.cc:227] Handling call
0923 14:36:34.855035 (+3001319us) inbound_call.cc:173] Queueing success response
Metrics: {}
W20260923 14:36:34.856894  2938 connection.cc:196] Error closing socket: Network error: TlsSocket::Close: Broken pipe
[       OK ] Parameters/TestRpc.TestCallLongerThanKeepalive/SSL_UnixSocket (3057 ms)
[ RUN      ] Parameters/TestRpc.TestRpcSidecar/SSL_UnixSocket
I20260923 14:36:34.871578  2967 acceptor_pool.cc:254] collecting diagnostics on the listening RPC socket unix:/tmp/dist-test-taskgEQD9s/test-tmp/rpc-test-6542221933c2402790c4c14de29c6944.sock every 8 connection(s)
I20260923 14:36:34.871613  2966 acceptor_pool.cc:254] collecting diagnostics on the listening RPC socket unix:/tmp/dist-test-taskgEQD9s/test-tmp/rpc-test-6542221933c2402790c4c14de29c6944.sock every 8 connection(s)
W20260923 14:36:34.935248  2963 connection.cc:196] Error closing socket: Network error: TlsSocket::Close: Broken pipe
[       OK ] Parameters/TestRpc.TestRpcSidecar/SSL_UnixSocket (78 ms)
[ RUN      ] Parameters/TestRpc.TestRpcSidecarLimits/SSL_UnixSocket
I20260923 14:36:37.571823  2991 acceptor_pool.cc:254] collecting diagnostics on the listening RPC socket unix:/tmp/dist-test-taskgEQD9s/test-tmp/rpc-test-9b76d6fa46c14e2692f3cbdcef2e1313.sock every 8 connection(s)
I20260923 14:36:37.571871  2992 acceptor_pool.cc:254] collecting diagnostics on the listening RPC socket unix:/tmp/dist-test-taskgEQD9s/test-tmp/rpc-test-9b76d6fa46c14e2692f3cbdcef2e1313.sock every 8 connection(s)
W20260923 14:36:37.600250  2749 serialization.cc:72] Serialized kudu.rpc_test.PushStringsRequestPB (2147483654 bytes) is larger than the maximum configured RPC message size (52428800 bytes). Sending anyway, but peer may reject the data.
W20260923 14:36:37.604341  2988 connection.cc:535] server connection from unix:<unnamed> recv error: Network error: RPC frame had a length of 2147483714, but we only support messages up to 52428800 bytes long.
W20260923 14:36:37.604436  2988 connection.cc:158] shutting down server connection from unix:<unnamed> with pending inbound data: 4/2147483714 bytes received; last active 0 ns ago: status Network error: RPC frame had a length of 2147483714, but we only support messages up to 52428800 bytes long.
W20260923 14:36:37.604735  3004 connection.cc:196] Error closing socket: Network error: TlsSocket::Close: Broken pipe
I20260923 14:36:37.617246  3016 acceptor_pool.cc:254] collecting diagnostics on the listening RPC socket unix:/tmp/dist-test-taskgEQD9s/test-tmp/rpc-test-9b76d6fa46c14e2692f3cbdcef2e1313.sock every 8 connection(s)
I20260923 14:36:37.617360  3017 acceptor_pool.cc:254] collecting diagnostics on the listening RPC socket unix:/tmp/dist-test-taskgEQD9s/test-tmp/rpc-test-9b76d6fa46c14e2692f3cbdcef2e1313.sock every 8 connection(s)
W20260923 14:36:42.972522  3013 connection.cc:577] server connection from unix:<unnamed>: received bad data: 'Corruption: Invalid packet: message had a length of 2147483710, but we only support messages up to 2147483647 bytes
'
W20260923 14:36:42.972899  3029 connection.cc:196] Error closing socket: Network error: TlsSocket::Close: Broken pipe
[       OK ] Parameters/TestRpc.TestRpcSidecarLimits/SSL_UnixSocket (8038 ms)
[ RUN      ] Parameters/TestRpc.TestCallTimeoutDoesntAffectNegotiation/SSL_UnixSocket
I20260923 14:36:42.987526  3041 acceptor_pool.cc:254] collecting diagnostics on the listening RPC socket unix:/tmp/dist-test-taskgEQD9s/test-tmp/rpc-test-a439fc7719b04ce282daef39305588aa.sock every 8 connection(s)
I20260923 14:36:42.987648  3042 acceptor_pool.cc:254] collecting diagnostics on the listening RPC socket unix:/tmp/dist-test-taskgEQD9s/test-tmp/rpc-test-a439fc7719b04ce282daef39305588aa.sock every 8 connection(s)
W20260923 14:36:42.998222  3037 negotiation.cc:266] Injecting 500ms delay in negotiation
I20260923 14:36:43.048462  2749 rpc-test-base.h:595] status: Timed out: connection negotiation to unix:/tmp/dist-test-taskgEQD9s/test-tmp/rpc-test-a439fc7719b04ce282daef39305588aa.sock for RPC Sleep timed out after 0.050s (ON_OUTBOUND_QUEUE), seconds elapsed: 0.0507389
[       OK ] Parameters/TestRpc.TestCallTimeoutDoesntAffectNegotiation/SSL_UnixSocket (529 ms)
[ RUN      ] Parameters/TestRpc.TestRpcHandlerLatencyMetric/SSL_UnixSocket
I20260923 14:36:43.522495  3066 acceptor_pool.cc:254] collecting diagnostics on the listening RPC socket unix:/tmp/dist-test-taskgEQD9s/test-tmp/rpc-test-38806289604541128e91ba13e2182e58.sock every 8 connection(s)
I20260923 14:36:43.522529  3067 acceptor_pool.cc:254] collecting diagnostics on the listening RPC socket unix:/tmp/dist-test-taskgEQD9s/test-tmp/rpc-test-38806289604541128e91ba13e2182e58.sock every 8 connection(s)
I20260923 14:36:43.555778  2749 rpc-test.cc:1236] Sleep() min lat: 20372
I20260923 14:36:43.555861  2749 rpc-test.cc:1237] Sleep() mean lat: 20372
I20260923 14:36:43.555899  2749 rpc-test.cc:1238] Sleep() max lat: 20372
I20260923 14:36:43.555919  2749 rpc-test.cc:1239] Sleep() #calls: 1
W20260923 14:36:43.556684  3063 connection.cc:196] Error closing socket: Network error: TlsSocket::Close: Broken pipe
[       OK ] Parameters/TestRpc.TestRpcHandlerLatencyMetric/SSL_UnixSocket (54 ms)
[ RUN      ] Parameters/TestRpc.TimedOutOnResponseMetricServiceQueue/SSL_UnixSocket
I20260923 14:36:43.565595  3092 acceptor_pool.cc:254] collecting diagnostics on the listening RPC socket unix:/tmp/dist-test-taskgEQD9s/test-tmp/rpc-test-a0926dd670c14081be4d1917a8c97c3b.sock every 8 connection(s)
I20260923 14:36:43.565645  3093 acceptor_pool.cc:254] collecting diagnostics on the listening RPC socket unix:/tmp/dist-test-taskgEQD9s/test-tmp/rpc-test-a0926dd670c14081be4d1917a8c97c3b.sock every 8 connection(s)
W20260923 14:36:43.619527  3094 rpcz_store.cc:267] Call kudu.rpc_test.CalculatorService.Sleep from unix:<unnamed> (request call id 2) took 20 ms (client timeout 20 ms). Trace:
W20260923 14:36:43.619639  3094 rpcz_store.cc:269] 0923 14:36:43.599193 (+     0us) service_pool.cc:170] Inserting onto call queue
0923 14:36:43.619489 (+ 20296us) service_pool.cc:214] Skipping call since client already timed out
0923 14:36:43.619512 (+    23us) inbound_call.cc:173] Queueing failure response
Metrics: {}
W20260923 14:36:43.620541  3089 connection.cc:196] Error closing socket: Network error: TlsSocket::Close: Broken pipe
[       OK ] Parameters/TestRpc.TimedOutOnResponseMetricServiceQueue/SSL_UnixSocket (61 ms)
[ RUN      ] Parameters/TestRpc.RpcPendingConnectionsMetric/SSL_UnixSocket
I20260923 14:36:43.623984  3115 acceptor_pool.cc:254] collecting diagnostics on the listening RPC socket 0.0.0.0:37673 every 8 connection(s)
I20260923 14:36:43.624060  3116 acceptor_pool.cc:254] collecting diagnostics on the listening RPC socket 0.0.0.0:37673 every 8 connection(s)
W20260923 14:36:43.625224  3111 negotiation.cc:337] Failed RPC negotiation. Trace:
0923 14:36:43.624810 (+     0us) reactor.cc:625] Submitting negotiation task for server connection from 127.0.0.1:57502 (local address 127.0.0.1:37673)
0923 14:36:43.624911 (+   101us) server_negotiation.cc:206] Beginning negotiation
0923 14:36:43.624914 (+     3us) server_negotiation.cc:399] Waiting for connection header
0923 14:36:43.625027 (+   113us) negotiation.cc:327] Negotiation complete: Network error: Server connection negotiation failed: server connection from 127.0.0.1:57502: BlockingRecv error: recv got EOF from 127.0.0.1:57502 (error 108)
Metrics: {"server-negotiator.queue_time_us":23}
[       OK ] Parameters/TestRpc.RpcPendingConnectionsMetric/SSL_UnixSocket (14 ms)
[ RUN      ] Parameters/TestRpc.TestRpcContextClientDeadline/SSL_UnixSocket
I20260923 14:36:43.663460  3131 acceptor_pool.cc:254] collecting diagnostics on the listening RPC socket unix:/tmp/dist-test-taskgEQD9s/test-tmp/rpc-test-2d00e917b75d4dc6aa1fb46207e65f0a.sock every 8 connection(s)
I20260923 14:36:43.663497  3132 acceptor_pool.cc:254] collecting diagnostics on the listening RPC socket unix:/tmp/dist-test-taskgEQD9s/test-tmp/rpc-test-2d00e917b75d4dc6aa1fb46207e65f0a.sock every 8 connection(s)
[       OK ] Parameters/TestRpc.TestRpcContextClientDeadline/SSL_UnixSocket (66 ms)
[ RUN      ] Parameters/TestRpc.TestApplicationFeatureFlagUnsupportedServer/SSL_UnixSocket
I20260923 14:36:43.717434  3156 acceptor_pool.cc:254] collecting diagnostics on the listening RPC socket unix:/tmp/dist-test-taskgEQD9s/test-tmp/rpc-test-b23273992c2443e6a3b935948c7f46bd.sock every 8 connection(s)
I20260923 14:36:43.717481  3157 acceptor_pool.cc:254] collecting diagnostics on the listening RPC socket unix:/tmp/dist-test-taskgEQD9s/test-tmp/rpc-test-b23273992c2443e6a3b935948c7f46bd.sock every 8 connection(s)
W20260923 14:36:43.738404  3153 connection.cc:196] Error closing socket: Network error: TlsSocket::Close: Broken pipe
[       OK ] Parameters/TestRpc.TestApplicationFeatureFlagUnsupportedServer/SSL_UnixSocket (36 ms)
[ RUN      ] Parameters/TestRpc.TestCancellationAsync/SSL_UnixSocket
I20260923 14:36:43.748807  3181 acceptor_pool.cc:254] collecting diagnostics on the listening RPC socket unix:/tmp/dist-test-taskgEQD9s/test-tmp/rpc-test-1075aa481b0346e8bf31ef9a807c98cb.sock every 8 connection(s)
I20260923 14:36:43.748858  3182 acceptor_pool.cc:254] collecting diagnostics on the listening RPC socket unix:/tmp/dist-test-taskgEQD9s/test-tmp/rpc-test-1075aa481b0346e8bf31ef9a807c98cb.sock every 8 connection(s)
I20260923 14:36:43.749102  2749 rpc-test.cc:1716] Connecting to unix:/tmp/dist-test-taskgEQD9s/test-tmp/rpc-test-1075aa481b0346e8bf31ef9a807c98cb.sock
I20260923 14:36:43.757457  2749 test_util.cc:268] Using random seed: 1770013583
I20260923 14:36:43.773487  3185 rpc-test-base.h:240] got call: sleep_micros: 500 pattern: 4294967295 num_repetitions: 2097152 sidecar_idx: 0
I20260923 14:36:43.790452  3184 rpc-test-base.h:240] got call: sleep_micros: 500 pattern: 4294967295 num_repetitions: 2097152 sidecar_idx: 0
I20260923 14:36:43.806311  3185 rpc-test-base.h:240] got call: sleep_micros: 500 pattern: 4294967295 num_repetitions: 2097152 sidecar_idx: 0
I20260923 14:36:43.823663  3184 rpc-test-base.h:240] got call: sleep_micros: 500 pattern: 4294967295 num_repetitions: 2097152 sidecar_idx: 0
I20260923 14:36:43.839756  3185 rpc-test-base.h:240] got call: sleep_micros: 500 pattern: 4294967295 num_repetitions: 2097152 sidecar_idx: 0
I20260923 14:36:43.858665  3184 rpc-test-base.h:240] got call: sleep_micros: 500 pattern: 4294967295 num_repetitions: 2097152 sidecar_idx: 0
I20260923 14:36:43.876536  3185 rpc-test-base.h:240] got call: sleep_micros: 500 pattern: 4294967295 num_repetitions: 2097152 sidecar_idx: 0
I20260923 14:36:43.894966  3185 rpc-test-base.h:240] got call: sleep_micros: 500 pattern: 4294967295 num_repetitions: 2097152 sidecar_idx: 0
W20260923 14:36:43.896623  3178 connection.cc:196] Error closing socket: Network error: TlsSocket::Close: Broken pipe
W20260923 14:36:43.913260  3178 connection.cc:441] server connection from unix:<unnamed> torn down before Call kudu.rpc.GenericCalculatorService.SleepWithSidecar from unix:<unnamed> (request call id 9) could send its response
[       OK ] Parameters/TestRpc.TestCancellationAsync/SSL_UnixSocket (175 ms)
[ RUN      ] Parameters/TestRpc.TestPerformanceBySocketType/SSL_UnixSocket
I20260923 14:36:43.927117  3206 acceptor_pool.cc:254] collecting diagnostics on the listening RPC socket unix:/tmp/dist-test-taskgEQD9s/test-tmp/rpc-test-1d6085463dde4253a4188abea22b9712.sock every 8 connection(s)
I20260923 14:36:43.927162  3207 acceptor_pool.cc:254] collecting diagnostics on the listening RPC socket unix:/tmp/dist-test-taskgEQD9s/test-tmp/rpc-test-1d6085463dde4253a4188abea22b9712.sock every 8 connection(s)
I20260923 14:36:43.927503  2749 rpc-test.cc:1846] Connecting to unix:/tmp/dist-test-taskgEQD9s/test-tmp/rpc-test-1d6085463dde4253a4188abea22b9712.sock
I20260923 14:36:45.465858  2749 rpc-test.cc:1859] Sending 1024MB via ssl-enabled unix socket: real 1.530s	user 1.888s	sys 0.889s
I20260923 14:36:46.987308  2749 rpc-test.cc:1859] Sending 1024MB via ssl-enabled unix socket: real 1.521s	user 1.941s	sys 0.826s
I20260923 14:36:48.478952  2749 rpc-test.cc:1859] Sending 1024MB via ssl-enabled unix socket: real 1.492s	user 1.941s	sys 0.778s
I20260923 14:36:50.060837  2749 rpc-test.cc:1859] Sending 1024MB via ssl-enabled unix socket: real 1.582s	user 2.003s	sys 0.881s
I20260923 14:36:51.518337  2749 rpc-test.cc:1859] Sending 1024MB via ssl-enabled unix socket: real 1.457s	user 1.855s	sys 0.804s
W20260923 14:36:51.519212  3203 connection.cc:196] Error closing socket: Network error: TlsSocket::Close: Broken pipe
[       OK ] Parameters/TestRpc.TestPerformanceBySocketType/SSL_UnixSocket (7605 ms)
[----------] 20 tests from Parameters/TestRpc (31949 ms total)

[----------] 1 test from Parameters/TestRpcSocketTxRxQueue
[ RUN      ] Parameters/TestRpcSocketTxRxQueue.AcceptorRxQueueSizeMetric/0
I20260923 14:36:51.530272  3231 acceptor_pool.cc:254] collecting diagnostics on the listening RPC socket 0.0.0.0:34767 every 1 connection(s)
I20260923 14:36:51.530331  3232 acceptor_pool.cc:254] collecting diagnostics on the listening RPC socket 0.0.0.0:34767 every 1 connection(s)
W20260923 14:36:51.531140  3227 negotiation.cc:337] Failed RPC negotiation. Trace:
0923 14:36:51.530895 (+     0us) reactor.cc:625] Submitting negotiation task for server connection from 127.0.0.1:43746 (local address 127.0.0.1:34767)
0923 14:36:51.530983 (+    88us) server_negotiation.cc:206] Beginning negotiation
0923 14:36:51.530986 (+     3us) server_negotiation.cc:399] Waiting for connection header
0923 14:36:51.531066 (+    80us) negotiation.cc:327] Negotiation complete: Network error: Server connection negotiation failed: server connection from 127.0.0.1:43746: BlockingRecv error: recv got EOF from 127.0.0.1:43746 (error 108)
Metrics: {"server-negotiator.queue_time_us":22}
[       OK ] Parameters/TestRpcSocketTxRxQueue.AcceptorRxQueueSizeMetric/0 (12 ms)
[----------] 1 test from Parameters/TestRpcSocketTxRxQueue (12 ms total)

[----------] Global test environment tear-down
[==========] 21 tests from 2 test suites ran. (31962 ms total)
[  PASSED  ] 20 tests.
[  FAILED  ] 1 test, listed below:
[  FAILED  ] Parameters/TestRpc.TestCallWithChainCertAndChainCA/SSL_UnixSocket, where GetParam() = (true, true)

 1 FAILED TEST