Diagnosed failure

Parameters/TestRpc.TestCallWithChainCertAndChainCA/SSL_TCP: /data0/somelongdirectorytoavoidrpathissues/src/kudu/src/kudu/rpc/rpc-test.cc:270: Failure
Failed
Bad status: Runtime error: could not verify certificate chain (error with cert: subject=CN = localhost, ST = sadfjas, C = AS, emailAddress = sdflkdsajf, O = lskdfjlsad, OU = sldfkja, issuer=C = AS, ST = ASDfkjdhf, L = lskdjf, O = saldfja, OU = skdjf, CN = localhost, emailAddress = sadjflkadsj): : certificate has expired
Google Test trace:
/data0/somelongdirectorytoavoidrpathissues/src/kudu/src/kudu/rpc/rpc-test.cc:267: Connecting to 0.0.0.0:42361
I20260927 22:52:17.507515  2633 test_util.cc:175] -----------------------------------------------
I20260927 22:52:17.507797  2633 test_util.cc:176] Had fatal failures, leaving test files at /tmp/dist-test-task7BvxyD/test-tmp/rpc-test.5.Parameters_TestRpc.TestCallWithChainCertAndChainCA_SSL_TCP.1790549537354739-2633-0

Full log

Note: This is test shard 6 of 8.
[==========] Running 21 tests from 2 test suites.
[----------] Global test environment set-up.
[----------] 20 tests from Parameters/TestRpc
[ RUN      ] Parameters/TestRpc.TestMessengerCreateDestroy/SSL_TCP
WARNING: Logging before InitGoogleLogging() is written to STDERR
I20260927 22:52:17.413031  2633 rpc-test.cc:169] started messenger TestCreateDestroy
[       OK ] Parameters/TestRpc.TestMessengerCreateDestroy/SSL_TCP (36 ms)
[ RUN      ] Parameters/TestRpc.TestNegotiationDeadlock/SSL_TCP
I20260927 22:52:17.444305  2653 acceptor_pool.cc:254] collecting diagnostics on the listening RPC socket 0.0.0.0:42917 every 8 connection(s)
I20260927 22:52:17.444490  2654 acceptor_pool.cc:254] collecting diagnostics on the listening RPC socket 0.0.0.0:42917 every 8 connection(s)
[       OK ] Parameters/TestRpc.TestNegotiationDeadlock/SSL_TCP (51 ms)
[ RUN      ] Parameters/TestRpc.TestCallWithChainCertAndChainCA/SSL_TCP
I20260927 22:52:17.492478  2669 acceptor_pool.cc:254] collecting diagnostics on the listening RPC socket 0.0.0.0:42361 every 8 connection(s)
I20260927 22:52:17.492856  2670 acceptor_pool.cc:254] collecting diagnostics on the listening RPC socket 0.0.0.0:42361 every 8 connection(s)
/data0/somelongdirectorytoavoidrpathissues/src/kudu/src/kudu/rpc/rpc-test.cc:270: Failure
Failed
Bad status: Runtime error: could not verify certificate chain (error with cert: subject=CN = localhost, ST = sadfjas, C = AS, emailAddress = sdflkdsajf, O = lskdfjlsad, OU = sldfkja, issuer=C = AS, ST = ASDfkjdhf, L = lskdjf, O = saldfja, OU = skdjf, CN = localhost, emailAddress = sadjflkadsj): : certificate has expired
Google Test trace:
/data0/somelongdirectorytoavoidrpathissues/src/kudu/src/kudu/rpc/rpc-test.cc:267: Connecting to 0.0.0.0:42361
I20260927 22:52:17.507515  2633 test_util.cc:175] -----------------------------------------------
I20260927 22:52:17.507797  2633 test_util.cc:176] Had fatal failures, leaving test files at /tmp/dist-test-task7BvxyD/test-tmp/rpc-test.5.Parameters_TestRpc.TestCallWithChainCertAndChainCA_SSL_TCP.1790549537354739-2633-0
[  FAILED  ] Parameters/TestRpc.TestCallWithChainCertAndChainCA/SSL_TCP, where GetParam() = (true, false) (38 ms)
[ RUN      ] Parameters/TestRpc.TestCallWithPasswordProtectedKey/SSL_TCP
I20260927 22:52:17.532492  2694 acceptor_pool.cc:254] collecting diagnostics on the listening RPC socket 0.0.0.0:39311 every 8 connection(s)
I20260927 22:52:17.532785  2695 acceptor_pool.cc:254] collecting diagnostics on the listening RPC socket 0.0.0.0:39311 every 8 connection(s)
[       OK ] Parameters/TestRpc.TestCallWithPasswordProtectedKey/SSL_TCP (65 ms)
[ RUN      ] Parameters/TestRpc.TestCallToBadServer/SSL_TCP
I20260927 22:52:17.599660  2633 rpc-test.cc:394] Status: Network error: Client connection negotiation failed: client connection to 0.0.0.0:0: connect: Connection refused (error 111)
I20260927 22:52:17.600508  2633 rpc-test.cc:394] Status: Network error: Client connection negotiation failed: client connection to 0.0.0.0:0: connect: Connection refused (error 111)
I20260927 22:52:17.601202  2633 rpc-test.cc:394] Status: Network error: Client connection negotiation failed: client connection to 0.0.0.0:0: connect: Connection refused (error 111)
I20260927 22:52:17.602270  2633 rpc-test.cc:394] Status: Network error: Client connection negotiation failed: client connection to 0.0.0.0:0: connect: Connection refused (error 111)
I20260927 22:52:17.603089  2633 rpc-test.cc:394] Status: Network error: Client connection negotiation failed: client connection to 0.0.0.0:0: connect: Connection refused (error 111)
[       OK ] Parameters/TestRpc.TestCallToBadServer/SSL_TCP (31 ms)
[ RUN      ] Parameters/TestRpc.TestWrongService/SSL_TCP
I20260927 22:52:17.615253  2729 acceptor_pool.cc:254] collecting diagnostics on the listening RPC socket 0.0.0.0:36745 every 8 connection(s)
I20260927 22:52:17.615594  2730 acceptor_pool.cc:254] collecting diagnostics on the listening RPC socket 0.0.0.0:36745 every 8 connection(s)
I20260927 22:52:17.652143  2727 messenger.cc:345] service WrongServiceName not registered on TestServer
[       OK ] Parameters/TestRpc.TestWrongService/SSL_TCP (52 ms)
[ RUN      ] Parameters/TestRpc.TestConnectionKeepalive/SSL_TCP
I20260927 22:52:17.679832  2752 acceptor_pool.cc:254] collecting diagnostics on the listening RPC socket 0.0.0.0:43995 every 8 connection(s)
I20260927 22:52:17.680137  2753 acceptor_pool.cc:254] collecting diagnostics on the listening RPC socket 0.0.0.0:43995 every 8 connection(s)
I20260927 22:52:17.681258  2633 rpc-test.cc:488] Connecting to 0.0.0.0:43995
[       OK ] Parameters/TestRpc.TestConnectionKeepalive/SSL_TCP (1060 ms)
[ RUN      ] Parameters/TestRpc.TestClientConnectionMetrics/SSL_TCP
I20260927 22:52:18.735914  2777 acceptor_pool.cc:254] collecting diagnostics on the listening RPC socket 0.0.0.0:33745 every 8 connection(s)
I20260927 22:52:18.736270  2778 acceptor_pool.cc:254] collecting diagnostics on the listening RPC socket 0.0.0.0:33745 every 8 connection(s)
I20260927 22:52:18.737316  2633 rpc-test.cc:569] Connecting to 0.0.0.0:33745
[       OK ] Parameters/TestRpc.TestClientConnectionMetrics/SSL_TCP (21022 ms)
[ RUN      ] Parameters/TestRpc.TestCredentialsPolicy/SSL_TCP
I20260927 22:52:39.754863  2800 acceptor_pool.cc:254] collecting diagnostics on the listening RPC socket 0.0.0.0:37799 every 8 connection(s)
I20260927 22:52:39.755180  2801 acceptor_pool.cc:254] collecting diagnostics on the listening RPC socket 0.0.0.0:37799 every 8 connection(s)
I20260927 22:52:39.756352  2633 rpc-test.cc:700] Connecting to 0.0.0.0:37799
[       OK ] Parameters/TestRpc.TestCredentialsPolicy/SSL_TCP (52 ms)
[ RUN      ] Parameters/TestRpc.TestCallLongerThanKeepalive/SSL_TCP
I20260927 22:52:39.814664  2825 acceptor_pool.cc:254] collecting diagnostics on the listening RPC socket 0.0.0.0:45669 every 8 connection(s)
I20260927 22:52:39.815014  2826 acceptor_pool.cc:254] collecting diagnostics on the listening RPC socket 0.0.0.0:45669 every 8 connection(s)
I20260927 22:52:39.852505  2829 rpc-test-base.h:222] got call: sleep_micros: 3000000 deferred: true
I20260927 22:52:42.854492  2829 rpcz_store.cc:275] Call kudu.rpc.GenericCalculatorService.Sleep from 127.0.0.1:37868 (request call id 0) took 3002 ms. Trace:
I20260927 22:52:42.854676  2829 rpcz_store.cc:276] 0927 22:52:39.852362 (+     0us) service_pool.cc:170] Inserting onto call queue
0927 22:52:39.852447 (+    85us) service_pool.cc:227] Handling call
0927 22:52:42.854440 (+3001993us) inbound_call.cc:173] Queueing success response
Metrics: {}
[       OK ] Parameters/TestRpc.TestCallLongerThanKeepalive/SSL_TCP (3068 ms)
[ RUN      ] Parameters/TestRpc.TestRpcSidecar/SSL_TCP
I20260927 22:52:42.900135  2850 acceptor_pool.cc:254] collecting diagnostics on the listening RPC socket 0.0.0.0:44157 every 8 connection(s)
I20260927 22:52:42.900365  2851 acceptor_pool.cc:254] collecting diagnostics on the listening RPC socket 0.0.0.0:44157 every 8 connection(s)
[       OK ] Parameters/TestRpc.TestRpcSidecar/SSL_TCP (177 ms)
[ RUN      ] Parameters/TestRpc.TestRpcSidecarLimits/SSL_TCP
I20260927 22:52:45.278043  2875 acceptor_pool.cc:254] collecting diagnostics on the listening RPC socket 0.0.0.0:38319 every 8 connection(s)
I20260927 22:52:45.278330  2876 acceptor_pool.cc:254] collecting diagnostics on the listening RPC socket 0.0.0.0:38319 every 8 connection(s)
W20260927 22:52:45.294340  2633 serialization.cc:72] Serialized kudu.rpc_test.PushStringsRequestPB (2147483654 bytes) is larger than the maximum configured RPC message size (52428800 bytes). Sending anyway, but peer may reject the data.
W20260927 22:52:45.301869  2874 connection.cc:535] server connection from 127.0.0.1:58436 recv error: Network error: RPC frame had a length of 2147483714, but we only support messages up to 52428800 bytes long.
W20260927 22:52:45.302004  2874 connection.cc:158] shutting down server connection from 127.0.0.1:58436 with pending inbound data: 4/2147483714 bytes received; last active 0 ns ago: status Network error: RPC frame had a length of 2147483714, but we only support messages up to 52428800 bytes long.
W20260927 22:52:45.302592  2888 connection.cc:196] Error closing socket: Network error: TlsSocket::Close: Connection reset by peer
I20260927 22:52:45.321753  2900 acceptor_pool.cc:254] collecting diagnostics on the listening RPC socket 0.0.0.0:37629 every 8 connection(s)
I20260927 22:52:45.322018  2901 acceptor_pool.cc:254] collecting diagnostics on the listening RPC socket 0.0.0.0:37629 every 8 connection(s)
W20260927 22:52:50.946228  2898 connection.cc:577] server connection from 127.0.0.1:54396: received bad data: 'Corruption: Invalid packet: message had a length of 2147483710, but we only support messages up to 2147483647 bytes
'
[       OK ] Parameters/TestRpc.TestRpcSidecarLimits/SSL_TCP (8366 ms)
[ RUN      ] Parameters/TestRpc.TestCallTimeoutDoesntAffectNegotiation/SSL_TCP
I20260927 22:52:51.430042  2925 acceptor_pool.cc:254] collecting diagnostics on the listening RPC socket 0.0.0.0:45849 every 8 connection(s)
I20260927 22:52:51.430408  2926 acceptor_pool.cc:254] collecting diagnostics on the listening RPC socket 0.0.0.0:45849 every 8 connection(s)
W20260927 22:52:51.441286  2921 negotiation.cc:266] Injecting 500ms delay in negotiation
I20260927 22:52:51.491997  2633 rpc-test-base.h:595] status: Timed out: connection negotiation to 0.0.0.0:45849 for RPC Sleep timed out after 0.050s (ON_OUTBOUND_QUEUE), seconds elapsed: 0.0514191
[       OK ] Parameters/TestRpc.TestCallTimeoutDoesntAffectNegotiation/SSL_TCP (548 ms)
[ RUN      ] Parameters/TestRpc.TestRpcHandlerLatencyMetric/SSL_TCP
I20260927 22:52:51.971737  2950 acceptor_pool.cc:254] collecting diagnostics on the listening RPC socket 0.0.0.0:33879 every 8 connection(s)
I20260927 22:52:51.971935  2951 acceptor_pool.cc:254] collecting diagnostics on the listening RPC socket 0.0.0.0:33879 every 8 connection(s)
I20260927 22:52:52.058082  2633 rpc-test.cc:1236] Sleep() min lat: 20769
I20260927 22:52:52.058308  2633 rpc-test.cc:1237] Sleep() mean lat: 20769
I20260927 22:52:52.058393  2633 rpc-test.cc:1238] Sleep() max lat: 20769
I20260927 22:52:52.058430  2633 rpc-test.cc:1239] Sleep() #calls: 1
[       OK ] Parameters/TestRpc.TestRpcHandlerLatencyMetric/SSL_TCP (110 ms)
[ RUN      ] Parameters/TestRpc.TimedOutOnResponseMetricServiceQueue/SSL_TCP
I20260927 22:52:52.109386  2976 acceptor_pool.cc:254] collecting diagnostics on the listening RPC socket 0.0.0.0:35459 every 8 connection(s)
I20260927 22:52:52.109506  2977 acceptor_pool.cc:254] collecting diagnostics on the listening RPC socket 0.0.0.0:35459 every 8 connection(s)
W20260927 22:52:52.170385  2978 rpcz_store.cc:267] Call kudu.rpc_test.CalculatorService.Sleep from 127.0.0.1:49440 (request call id 2) took 20 ms (client timeout 20 ms). Trace:
W20260927 22:52:52.170578  2978 rpcz_store.cc:269] 0927 22:52:52.149875 (+     0us) service_pool.cc:170] Inserting onto call queue
0927 22:52:52.170302 (+ 20427us) service_pool.cc:214] Skipping call since client already timed out
0927 22:52:52.170364 (+    62us) inbound_call.cc:173] Queueing failure response
Metrics: {}
[       OK ] Parameters/TestRpc.TimedOutOnResponseMetricServiceQueue/SSL_TCP (111 ms)
[ RUN      ] Parameters/TestRpc.RpcPendingConnectionsMetric/SSL_TCP
I20260927 22:52:52.181936  2999 acceptor_pool.cc:254] collecting diagnostics on the listening RPC socket 0.0.0.0:40253 every 8 connection(s)
I20260927 22:52:52.182019  3000 acceptor_pool.cc:254] collecting diagnostics on the listening RPC socket 0.0.0.0:40253 every 8 connection(s)
W20260927 22:52:52.184481  2995 negotiation.cc:337] Failed RPC negotiation. Trace:
0927 22:52:52.183720 (+     0us) reactor.cc:625] Submitting negotiation task for server connection from 127.0.0.1:43892 (local address 127.0.0.1:40253)
0927 22:52:52.183895 (+   175us) server_negotiation.cc:206] Beginning negotiation
0927 22:52:52.183900 (+     5us) server_negotiation.cc:399] Waiting for connection header
0927 22:52:52.184028 (+   128us) negotiation.cc:327] Negotiation complete: Network error: Server connection negotiation failed: server connection from 127.0.0.1:43892: BlockingRecv error: recv got EOF from 127.0.0.1:43892 (error 108)
Metrics: {"server-negotiator.queue_time_us":52}
[       OK ] Parameters/TestRpc.RpcPendingConnectionsMetric/SSL_TCP (21 ms)
[ RUN      ] Parameters/TestRpc.TestRpcContextClientDeadline/SSL_TCP
I20260927 22:52:52.217267  3015 acceptor_pool.cc:254] collecting diagnostics on the listening RPC socket 0.0.0.0:41251 every 8 connection(s)
I20260927 22:52:52.217528  3016 acceptor_pool.cc:254] collecting diagnostics on the listening RPC socket 0.0.0.0:41251 every 8 connection(s)
[       OK ] Parameters/TestRpc.TestRpcContextClientDeadline/SSL_TCP (64 ms)
[ RUN      ] Parameters/TestRpc.TestApplicationFeatureFlagUnsupportedServer/SSL_TCP
I20260927 22:52:52.285356  3040 acceptor_pool.cc:254] collecting diagnostics on the listening RPC socket 0.0.0.0:43983 every 8 connection(s)
I20260927 22:52:52.285588  3041 acceptor_pool.cc:254] collecting diagnostics on the listening RPC socket 0.0.0.0:43983 every 8 connection(s)
[       OK ] Parameters/TestRpc.TestApplicationFeatureFlagUnsupportedServer/SSL_TCP (51 ms)
[ RUN      ] Parameters/TestRpc.TestCancellationAsync/SSL_TCP
I20260927 22:52:52.343935  3065 acceptor_pool.cc:254] collecting diagnostics on the listening RPC socket 0.0.0.0:39265 every 8 connection(s)
I20260927 22:52:52.344308  3066 acceptor_pool.cc:254] collecting diagnostics on the listening RPC socket 0.0.0.0:39265 every 8 connection(s)
I20260927 22:52:52.345338  2633 rpc-test.cc:1716] Connecting to 0.0.0.0:39265
I20260927 22:52:52.361804  2633 test_util.cc:268] Using random seed: -818504156
I20260927 22:52:52.409472  3069 rpc-test-base.h:240] got call: sleep_micros: 500 pattern: 4294967295 num_repetitions: 2097152 sidecar_idx: 0
I20260927 22:52:52.441731  3069 rpc-test-base.h:240] got call: sleep_micros: 500 pattern: 4294967295 num_repetitions: 2097152 sidecar_idx: 0
I20260927 22:52:52.471626  3068 rpc-test-base.h:240] got call: sleep_micros: 500 pattern: 4294967295 num_repetitions: 2097152 sidecar_idx: 0
I20260927 22:52:52.503636  3069 rpc-test-base.h:240] got call: sleep_micros: 500 pattern: 4294967295 num_repetitions: 2097152 sidecar_idx: 0
I20260927 22:52:52.541098  3068 rpc-test-base.h:240] got call: sleep_micros: 500 pattern: 4294967295 num_repetitions: 2097152 sidecar_idx: 0
I20260927 22:52:52.569751  3069 rpc-test-base.h:240] got call: sleep_micros: 500 pattern: 4294967295 num_repetitions: 2097152 sidecar_idx: 0
W20260927 22:52:52.598302  3062 connection.cc:196] Error closing socket: Network error: TlsSocket::Close: Broken pipe
W20260927 22:52:52.599614  3062 connection.cc:441] server connection from 127.0.0.1:52438 torn down before Call kudu.rpc.GenericCalculatorService.SleepWithSidecar from 127.0.0.1:52438 (request call id 7) could send its response
W20260927 22:52:52.611507  3062 connection.cc:441] server connection from 127.0.0.1:52438 torn down before Call kudu.rpc.GenericCalculatorService.SleepWithSidecar from 127.0.0.1:52438 (request call id 8) could send its response
[       OK ] Parameters/TestRpc.TestCancellationAsync/SSL_TCP (301 ms)
[ RUN      ] Parameters/TestRpc.TestPerformanceBySocketType/SSL_TCP
I20260927 22:52:52.638993  3090 acceptor_pool.cc:254] collecting diagnostics on the listening RPC socket 0.0.0.0:45599 every 8 connection(s)
I20260927 22:52:52.639216  3091 acceptor_pool.cc:254] collecting diagnostics on the listening RPC socket 0.0.0.0:45599 every 8 connection(s)
I20260927 22:52:52.640236  2633 rpc-test.cc:1846] Connecting to 0.0.0.0:45599
I20260927 22:52:56.169986  2633 rpc-test.cc:1859] Sending 1024MB via ssl-enabled tcp socket: real 3.510s	user 3.153s	sys 2.740s
I20260927 22:52:59.662182  2633 rpc-test.cc:1859] Sending 1024MB via ssl-enabled tcp socket: real 3.492s	user 3.004s	sys 2.910s
I20260927 22:53:03.248809  2633 rpc-test.cc:1859] Sending 1024MB via ssl-enabled tcp socket: real 3.586s	user 3.142s	sys 2.851s
I20260927 22:53:06.874138  2633 rpc-test.cc:1859] Sending 1024MB via ssl-enabled tcp socket: real 3.625s	user 3.195s	sys 2.883s
I20260927 22:53:10.482121  2633 rpc-test.cc:1859] Sending 1024MB via ssl-enabled tcp socket: real 3.608s	user 3.181s	sys 2.804s
[       OK ] Parameters/TestRpc.TestPerformanceBySocketType/SSL_TCP (17877 ms)
[----------] 20 tests from Parameters/TestRpc (53112 ms total)

[----------] 1 test from Parameters/TestRpcSocketTxRxQueue
[ RUN      ] Parameters/TestRpcSocketTxRxQueue.OverCapacity/0
W20260927 22:53:10.808307  3116 negotiation.cc:337] Failed RPC negotiation. Trace:
0927 22:53:10.508417 (+     0us) reactor.cc:625] Submitting negotiation task for client connection to 0.0.0.0:36151 (local address 127.0.0.1:39034)
0927 22:53:10.508654 (+   237us) negotiation.cc:107] Waiting for socket to connect
0927 22:53:10.508676 (+    22us) client_negotiation.cc:174] Beginning negotiation
0927 22:53:10.508806 (+   130us) client_negotiation.cc:252] Sending NEGOTIATE NegotiatePB request
0927 22:53:10.807255 (+298449us) negotiation.cc:327] Negotiation complete: Network error: Client connection negotiation failed: client connection to 0.0.0.0:36151: BlockingRecv error: recv error from unknown peer: Transport endpoint is not connected (error 107)
Metrics: {"client-negotiator.queue_time_us":87}
W20260927 22:53:10.808620  3143 negotiation.cc:337] Failed RPC negotiation. Trace:
0927 22:53:10.517989 (+     0us) reactor.cc:625] Submitting negotiation task for client connection to 0.0.0.0:36151 (local address 127.0.0.1:39078)
0927 22:53:10.518189 (+   200us) negotiation.cc:107] Waiting for socket to connect
0927 22:53:10.518214 (+    25us) client_negotiation.cc:174] Beginning negotiation
0927 22:53:10.518319 (+   105us) client_negotiation.cc:252] Sending NEGOTIATE NegotiatePB request
0927 22:53:10.808019 (+289700us) negotiation.cc:327] Negotiation complete: Network error: Client connection negotiation failed: client connection to 0.0.0.0:36151: BlockingRecv error: recv error from unknown peer: Transport endpoint is not connected (error 107)
Metrics: {"client-negotiator.queue_time_us":72}
W20260927 22:53:10.808797  3125 negotiation.cc:337] Failed RPC negotiation. Trace:
0927 22:53:10.511482 (+     0us) reactor.cc:625] Submitting negotiation task for client connection to 0.0.0.0:36151 (local address 127.0.0.1:39046)
0927 22:53:10.511754 (+   272us) negotiation.cc:107] Waiting for socket to connect
0927 22:53:10.511774 (+    20us) client_negotiation.cc:174] Beginning negotiation
0927 22:53:10.511881 (+   107us) client_negotiation.cc:252] Sending NEGOTIATE NegotiatePB request
0927 22:53:10.807228 (+295347us) negotiation.cc:327] Negotiation complete: Network error: Client connection negotiation failed: client connection to 0.0.0.0:36151: BlockingRecv error: recv error from unknown peer: Transport endpoint is not connected (error 107)
Metrics: {"client-negotiator.queue_time_us":115}
W20260927 22:53:10.808955  3107 negotiation.cc:337] Failed RPC negotiation. Trace:
0927 22:53:10.504960 (+     0us) reactor.cc:625] Submitting negotiation task for client connection to 0.0.0.0:36151 (local address 127.0.0.1:39032)
0927 22:53:10.505142 (+   182us) negotiation.cc:107] Waiting for socket to connect
0927 22:53:10.505166 (+    24us) client_negotiation.cc:174] Beginning negotiation
0927 22:53:10.505322 (+   156us) client_negotiation.cc:252] Sending NEGOTIATE NegotiatePB request
0927 22:53:10.807255 (+301933us) negotiation.cc:327] Negotiation complete: Network error: Client connection negotiation failed: client connection to 0.0.0.0:36151: BlockingRecv error: recv error from unknown peer: Transport endpoint is not connected (error 107)
Metrics: {"client-negotiator.queue_time_us":62}
W20260927 22:53:10.810153  3134 negotiation.cc:337] Failed RPC negotiation. Trace:
0927 22:53:10.514791 (+     0us) reactor.cc:625] Submitting negotiation task for client connection to 0.0.0.0:36151 (local address 127.0.0.1:39062)
0927 22:53:10.515095 (+   304us) negotiation.cc:107] Waiting for socket to connect
0927 22:53:10.515118 (+    23us) client_negotiation.cc:174] Beginning negotiation
0927 22:53:10.515271 (+   153us) client_negotiation.cc:252] Sending NEGOTIATE NegotiatePB request
0927 22:53:10.810015 (+294744us) negotiation.cc:327] Negotiation complete: Network error: Client connection negotiation failed: client connection to 0.0.0.0:36151: BlockingRecv error: recv error from unknown peer: Transport endpoint is not connected (error 107)
Metrics: {"client-negotiator.queue_time_us":96}
W20260927 22:53:10.812709  3152 negotiation.cc:337] Failed RPC negotiation. Trace:
0927 22:53:10.521239 (+     0us) reactor.cc:625] Submitting negotiation task for client connection to 0.0.0.0:36151 (local address 127.0.0.1:39088)
0927 22:53:10.521433 (+   194us) negotiation.cc:107] Waiting for socket to connect
0927 22:53:10.521452 (+    19us) client_negotiation.cc:174] Beginning negotiation
0927 22:53:10.521566 (+   114us) client_negotiation.cc:252] Sending NEGOTIATE NegotiatePB request
0927 22:53:10.808319 (+286753us) negotiation.cc:327] Negotiation complete: Network error: Client connection negotiation failed: client connection to 0.0.0.0:36151: BlockingRecv error: recv error from unknown peer: Transport endpoint is not connected (error 107)
Metrics: {"client-negotiator.queue_time_us":68}
[       OK ] Parameters/TestRpcSocketTxRxQueue.OverCapacity/0 (1088 ms)
[----------] 1 test from Parameters/TestRpcSocketTxRxQueue (1088 ms total)

[----------] Global test environment tear-down
[==========] 21 tests from 2 test suites ran. (54201 ms total)
[  PASSED  ] 20 tests.
[  FAILED  ] 1 test, listed below:
[  FAILED  ] Parameters/TestRpc.TestCallWithChainCertAndChainCA/SSL_TCP, where GetParam() = (true, false)

 1 FAILED TEST